{"text_format":"1","workbook":"xlsx","n_sheets":3,"sheets":["Home","Shape Limits","Data"],"not_rendered":{"charts":0,"images":23,"macros":1,"external_links":0,"defined_names":80,"comments":1,"pivot_tables":0},"unopened":[],"bounds":{"document_bytes":16777216,"sheet_cells":100000,"rows_first":2000,"rows_last":500,"rows_between":2000,"halvings":0,"cell_chars":16384,"cell_head_chars":4096},"cells_cut":0,"cells_raw":0,"read":"whole","date_system":"1900"}

{"sheet":"Home","index":0,"n_rows":18,"n_cols":14,"rows_kept":18,"cut":false,"hidden":false,"merged":[[20,1,20,13],[0,11,1,13],[5,13,6,13],[17,13,18,13],[5,11,6,11],[17,12,18,12],[17,11,18,11],[17,10,18,10],[5,12,6,12],[16,2,16,7],[15,2,15,7],[5,10,6,10],[2,3,2,7],[7,3,7,6],[13,2,13,7],[14,2,14,7],[10,2,11,2]]}
[null,null,null,null,null,null,null,null,null,null,null,"Manufacturing Data"]
[]
[null,null,null,"Windows Min. Max. Look-up",null,null,null,null,null,null,1,{"$f":"VLOOKUP($K3,'Shape Limits'!$S:$U,2,FALSE)","v":{"$error":"#N/A"}},{"$f":"VLOOKUP($K3,'Shape Limits'!$S:$U,3,FALSE)","v":{"$error":"#N/A"}},{"$f":"IF((VLOOKUP($K3,'Shape Limits'!$S:$V,4,FALSE))=1,\"Z\",\"\")","v":{"$error":"#N/A"}}]
[null,null,"Model #","Min. W","Min. H","Max. W","Max. H","Max. UI",null,null,2,{"$f":"VLOOKUP($K4,'Shape Limits'!$S:$U,2,FALSE)","v":{"$error":"#N/A"}},{"$f":"VLOOKUP($K4,'Shape Limits'!$S:$U,3,FALSE)","v":{"$error":"#N/A"}},{"$f":"IF((VLOOKUP($K4,'Shape Limits'!$S:$V,4,FALSE))=1,\"Z\",\"\")","v":{"$error":"#N/A"}}]
[null,null,{"$f":"MODEL","v":""},{"$f":"MINW","v":""},{"$f":"MINH","v":""},{"$f":"MAXW","v":""},{"$f":"MAXH","v":""},{"$f":"MAXUI","v":""},null,null,3,{"$f":"VLOOKUP($K5,'Shape Limits'!$S:$U,2,FALSE)","v":{"$error":"#N/A"}},{"$f":"VLOOKUP($K5,'Shape Limits'!$S:$U,3,FALSE)","v":{"$error":"#N/A"}},{"$f":"IF((VLOOKUP($K5,'Shape Limits'!$S:$V,4,FALSE))=1,\"Z\",\"\")","v":{"$error":"#N/A"}}]
[null,null,null,null,null,null,null,null,null,null,4,{"$f":"VLOOKUP($K6,'Shape Limits'!$S:$U,2,FALSE)","v":{"$error":"#N/A"}},{"$f":"VLOOKUP($K6,'Shape Limits'!$S:$U,3,FALSE)","v":{"$error":"#N/A"}},{"$f":"IF((VLOOKUP($K6,'Shape Limits'!$S:$V,4,FALSE))=1,\"Z\",\"\")","v":{"$error":"#N/A"}}]
[]
[null,null,null,"PW / Shapes Min. Max. Look-up",null,null,null,null,null,null,5,{"$f":"VLOOKUP($K8,'Shape Limits'!$S:$U,2,FALSE)","v":{"$error":"#N/A"}},{"$f":"VLOOKUP($K8,'Shape Limits'!$S:$U,3,FALSE)","v":{"$error":"#N/A"}},{"$f":"IF((VLOOKUP($K8,'Shape Limits'!$S:$V,4,FALSE))=1,\"Z\",\"\")","v":{"$error":"#N/A"}}]
[null,null,"Extrusion / Brickmold",null,"Model #",null,null,null,null,null,6,{"$f":"VLOOKUP($K9,'Shape Limits'!$S:$U,2,FALSE)","v":{"$error":"#N/A"}},{"$f":"VLOOKUP($K9,'Shape Limits'!$S:$U,3,FALSE)","v":{"$error":"#N/A"}},{"$f":"IF((VLOOKUP($K9,'Shape Limits'!$S:$V,4,FALSE))=1,\"Z\",\"\")","v":{"$error":"#N/A"}}]
[null,null,null,null,null,null,null,null,null,null,7,{"$f":"VLOOKUP($K10,'Shape Limits'!$S:$U,2,FALSE)","v":{"$error":"#N/A"}},{"$f":"VLOOKUP($K10,'Shape Limits'!$S:$U,3,FALSE)","v":{"$error":"#N/A"}},{"$f":"IF((VLOOKUP($K10,'Shape Limits'!$S:$V,4,FALSE))=1,\"Z\",\"\")","v":{"$error":"#N/A"}}]
[null,null,{"$f":"IF(AND(EXTLINK>3,REGENCYSELECT=1),\"MUST SELECT EXTRUSION\",\"\")","v":""},"Width","Height","Dim. 3","Dim. 4",null,null,null,8,{"$f":"VLOOKUP($K11,'Shape Limits'!$S:$U,2,FALSE)","v":{"$error":"#N/A"}},{"$f":"VLOOKUP($K11,'Shape Limits'!$S:$U,3,FALSE)","v":{"$error":"#N/A"}},{"$f":"IF((VLOOKUP($K11,'Shape Limits'!$S:$V,4,FALSE))=1,\"Z\",\"\")","v":{"$error":"#N/A"}}]
[null,null,null,null,null,null,null,null,null,null,9,{"$f":"VLOOKUP($K12,'Shape Limits'!$S:$U,2,FALSE)","v":{"$error":"#N/A"}},{"$f":"VLOOKUP($K12,'Shape Limits'!$S:$U,3,FALSE)","v":{"$error":"#N/A"}},{"$f":"IF((VLOOKUP($K12,'Shape Limits'!$S:$V,4,FALSE))=1,\"Z\",\"\")","v":{"$error":"#N/A"}}]
[null,null,null,{"$f":"IF(AND(SHAPELINK>1,SHAPEW>0,EXTLINK>3),\"FRAME SIZE TO ORDER ON THE RIGHT PANEL\",IF(AND(SHAPELINK>1,SHAPEW>0,OR(EXTLINK=2,EXTLINK=3)),\"EXACT FRAME SIZE\",\"\"))","v":""},null,null,null,null,null,null,10,{"$f":"VLOOKUP($K13,'Shape Limits'!$S:$U,2,FALSE)","v":{"$error":"#N/A"}},{"$f":"VLOOKUP($K13,'Shape Limits'!$S:$U,3,FALSE)","v":{"$error":"#N/A"}},{"$f":"IF((VLOOKUP($K13,'Shape Limits'!$S:$V,4,FALSE))=1,\"Z\",\"\")","v":{"$error":"#N/A"}}]
[null,null,{"$f":"IF(AND(SHAPELINK>1,EXTLINK>3,ORDERGUIDE>\"\"),ORDERGUIDE,\"\")","v":""},null,null,null,null,null,null,null,11,{"$f":"VLOOKUP($K14,'Shape Limits'!$S:$U,2,FALSE)","v":{"$error":"#N/A"}},{"$f":"VLOOKUP($K14,'Shape Limits'!$S:$U,3,FALSE)","v":{"$error":"#N/A"}},{"$f":"IF((VLOOKUP($K14,'Shape Limits'!$S:$V,4,FALSE))=1,\"Z\",\"\")","v":{"$error":"#N/A"}}]
[null,null,{"$f":"IF(AND(SHAPEW>0,SHAPELIMIT>0,ORDERGUIDE<\"\",EXT>1,PWSELECT=1),\"SIZE IS OUTSIDE LIMITATION\",\"\")","v":""},null,null,null,null,null,null,null,12,{"$f":"VLOOKUP($K15,'Shape Limits'!$S:$U,2,FALSE)","v":{"$error":"#N/A"}},{"$f":"VLOOKUP($K15,'Shape Limits'!$S:$U,3,FALSE)","v":{"$error":"#N/A"}},{"$f":"IF((VLOOKUP($K15,'Shape Limits'!$S:$V,4,FALSE))=1,\"Z\",\"\")","v":{"$error":"#N/A"}}]
[null,null,{"$f":"RADIUS","v":""},null,null,null,null,null,null,null,13,{"$f":"VLOOKUP($K16,'Shape Limits'!$S:$U,2,FALSE)","v":{"$error":"#N/A"}},{"$f":"VLOOKUP($K16,'Shape Limits'!$S:$U,3,FALSE)","v":{"$error":"#N/A"}},{"$f":"IF((VLOOKUP($K16,'Shape Limits'!$S:$V,4,FALSE))=1,\"Z\",\"\")","v":{"$error":"#N/A"}}]
[null,null,{"$f":"IF(AND(SHAPELINK>1,EXTLINK=1),\"Please Select Extrusion / Brickmold\",\"\")","v":""},null,null,null,null,null,null,null,14,{"$f":"VLOOKUP($K17,'Shape Limits'!$S:$U,2,FALSE)","v":{"$error":"#N/A"}},{"$f":"VLOOKUP($K17,'Shape Limits'!$S:$U,3,FALSE)","v":{"$error":"#N/A"}},{"$f":"IF((VLOOKUP($K17,'Shape Limits'!$S:$V,4,FALSE))=1,\"Z\",\"\")","v":{"$error":"#N/A"}}]
[null,null,null,null,null,null,null,null,null,null,15,{"$f":"VLOOKUP($K18,'Shape Limits'!$S:$U,2,FALSE)","v":{"$error":"#N/A"}},{"$f":"VLOOKUP($K18,'Shape Limits'!$S:$U,3,FALSE)","v":{"$error":"#N/A"}},{"$f":"IF((VLOOKUP($K18,'Shape Limits'!$S:$V,4,FALSE))=1,\"Z\",\"\")","v":{"$error":"#N/A"}}]

{"sheet":"Shape Limits","index":1,"n_rows":367,"n_cols":61,"rows_kept":367,"cut":false,"hidden":true,"merged":[[1,31,1,32],[2,36,2,37],[0,1,0,2],[0,3,0,10],[0,11,0,12],[1,29,1,30]]}
[null,{"$f":"MAX(D5,D13,D23,D32,D43,D51,D61,D74,D87,D97,D106,D118,D126,D138,D146,D159,D169,D181,D193,D205,D217,D229,D240,D250)","v":0},null,"Shapes Min. Max. Limitations",null,null,null,null,null,null,null,{"$f":"IF(O1>\"\",O1,IF(O2>\"\",O2,IF(O3>\"\",O3,IF(O4>\"\",O4,\"\"))))","v":""},null,null,{"$f":"IF($F$5>\"\",$F$5,IF($F$13>\"\",$F$13,IF($F$23>\"\",$F$23,IF($F$32>\"\",$F$32,IF($F$43>\"\",$F$43,IF($F$51>\"\",$F$51,\"\"))))))","v":""}]
[null,105,"Min R","Max W","Max UI","Max Sq.ft",null,"Frame Width:",{"$f":"IF(AND(SHAPEW>0,SHAPE=B2,EXTLINK>3),TRUNC((2*(SQRT(I4*((2*((SHAPEW/2)-OFFSET))-I4))))*16+0.5)/16,IF(AND(SHAPEW>0,SHAPE=B2,EXTLINK<=3),SHAPEW,0))","v":0},null,null,null,null,null,{"$f":"IF(F61>\"\",F61,IF(F74>\"\",F74,IF(F87>\"\",F87,IF(F97>\"\",F97,IF(F106>\"\",F106,IF(F118>\"\",F118,\"\"))))))","v":""},null,null,null,null,null,null,null,null,null,null,null,null,null,null,"Min",null,"Max"]
[null,{"$f":"EXT","v":1},{"$f":"MIN_R","v":""},{"$f":"MAX_W","v":""},{"$f":"MAX_UI","v":""},{"$f":"MAX_SF","v":""},null,"Frame Radius:",{"$f":"IF(AND(SHAPEW>0,SHAPE=B2,EXTLINK>3),(SHAPEW/2)-OFFSET,IF(AND(SHAPEW>0,SHAPE=B2,EXTLINK<=3),SHAPEW/2,0))","v":0},null,null,null,null,null,{"$f":"IF(F126>\"\",F126,IF(F138>\"\",F138,IF(F146>\"\",F146,IF(F159>\"\",F159,IF(F193>\"\",F193,IF(F205>\"\",F205,\"\"))))))","v":""},null,null,null,null,null,null,null,null,null,null,null,null,1,"Select a Model","W","H","W","H","UI",null,null,"Shapes",null,null,null,null,null,null,null,null,null,null,null,null,null,"Model","Width","Height","Area",null,null,"SS (2.2)","DS (3.2)","4 mm","TS (5.0)"]
[null,null,{"$f":"IF(AND(SHAPEW>0,SHAPE=B2,(FW/2)<C3),1,0)","v":0},{"$f":"IF(AND(SHAPEW>0,EXTLINK>1,SHAPE=B2,FW>D3),1,0)","v":0},{"$f":"IF(AND(SHAPEW>0,EXTLINK>1,SHAPE=B2,(FW+FH)>E3),1,0)","v":0},{"$f":"IF(AND(SHAPEW>0,EXTLINK>1,SHAPE=B2,((FW*FH)/144)>F3),1,0)","v":0},null,"Frame Height:",{"$f":"IF(AND(SHAPEW>0,SHAPE=B2,EXTLINK>3),(SHAPEW/2)-(OFFSET*2),IF(AND(SHAPEW>0,SHAPE=B2,EXTLINK<=3),(SHAPEW/2),0))","v":0},null,null,null,null,null,{"$f":"IF(F169>\"\",F169,IF(F181>\"\",F181,IF(F217>\"\",F217,IF(F229>\"\",F229,IF(F240>\"\",F240,IF(F250>\"\",F250,\"\"))))))","v":""},null,null,null,null,null,null,null,"FH",null,"FW","FL",null,2,"8E00A",10,10,120,120,168,null,1,"Select","Select",null,"<< Cut Angle",null,1,"Select",1,0,0,null,null,null,null,105,{"$f":"I7","v":0},{"$f":"I6","v":0},{"$f":"(AZ4*BA4)/144","v":0},null,"Max. Short",{"$f":"IF(OR($AZ$28>41,$AZ$42>41),0,41)","v":41},{"$f":"IF(OR($AZ$28>56,$AZ$42>56),0,56)","v":56},{"$f":"IF(OR($AZ$28>76,$AZ$42>76),0,76)","v":76},{"$f":"IF(OR($AZ$28>76,$AZ$42>76),0,76)","v":76},"Annealed"]
[null,null,{"$f":"MAX(C4:F4)","v":0},{"$f":"IF(AND(SHAPE=B2,C5=1),1,0)","v":0},{"$f":"IF(AND(SHAPEW>0,SHAPEH>0,SHAPE=B2,SHAPEH<>(SHAPEW/2)),1,0)","v":0},{"$f":"IF(AND(SHAPE=105,E5=1),\"HEIGHT MUST BE 1/2 THE WIDTH\",IF(AND(SHAPE=105,SHAPEW>0,C4>0),\"RADIUS MUST BE GREATER THAN \"&C3,IF(AND(SHAPE=105,I7>0,I7<GlassMinW),\"Glass Width is Under Minimum\",IF(AND(SHAPE=105,I6>0,I6<GlassMinH),\"Glass Height is Under Minimum\",\"\"))))","v":""},null,"Glass R:",{"$f":"IF(AND(SHAPEW>0,EXTLINK>1,SHAPE=B2),I3-GLASSOFFSET,0)","v":0},null,null,null,null,null,{"$f":"Y29","v":0},null,null,105,{"$f":"IF(SHAPE=$B$2,1,0)","v":0},{"$f":"IF(S5>0,\"Frame Width:\",0)","v":0},{"$f":"IF(S5>0,I2,0)","v":0},{"$f":"IF(AND(S5>0,D4>0),1,0)","v":0},{"$f":"U6","v":0},"105",{"$f":"U5","v":0},null,null,3,"3S10A",20,13,80,60,132,null,2,105,"105 (Circle Top)",null,null,null,2,"REGENCY","PI7301",1.4375,1.86,null,null,null,null,110,{"$f":"J13","v":0},{"$f":"J14","v":0},{"$f":"(AZ5*BA5)/144","v":0},null,"Max. Long",{"$f":"IF(OR($BA$28>62,$BA$42>62),0,62)","v":62},{"$f":"IF(OR($BA$28>76,$BA$42>76),0,76)","v":76},{"$f":"IF(OR($BA$28>110,$BA$42>110),0,110)","v":110},{"$f":"IF(OR($BA$28>110,$BA$42>110),0,110)","v":110},"Annealed"]
[null,null,null,null,null,null,null,"Glass H:",{"$f":"IF(AND(SHAPEW>0,SHAPE=B2),I4-(GLASSOFFSET*2),0)","v":0},null,null,null,null,null,{"$f":"W29","v":0},null,null,105,{"$f":"IF(SHAPE=$B$2,2,0)","v":0},{"$f":"IF(S6>0,\"Frame Height:\",0)","v":0},{"$f":"IF(S6>0,I4,0)","v":0},null,{"$f":"U14","v":0},"110",{"$f":"U13","v":0},{"$f":"U16","v":0},null,4,"3S21A",20,13,78,60,132,null,3,110,"110 (Circle Top w/Ex Leg)",null,null,null,3,"REGENCY 400","L4807",1.82948,2.3386,null,null,null,null,111,{"$f":"I24","v":0},{"$f":"I24","v":0},0,null,"Max Sq.Ft.",{"$f":"IF(OR($BB$28>12,$BB$42>12),0,12)","v":12},{"$f":"IF(OR($BB$28>22,$BB$42>22),0,22)","v":22},{"$f":"IF(OR($BB$28>42,$BB$42>42),0,42)","v":42},{"$f":"IF(OR($BB$28>42,$BB$42>42),0,42)","v":42},"Annealed"]
[null,null,null,null,null,null,null,"Glass W:",{"$f":"IF(AND(SHAPEW>0,SHAPE=B2,EXTLINK<=3),2*(SQRT(I6*((2*((I2/2)-GLASSOFFSET))-I6))),IF(AND(SHAPEW>0,SHAPE=B2,EXTLINK>3),2*(SQRT(I6*((2*I5)-I6))),0))","v":0},null,null,null,null,null,null,null,null,105,{"$f":"IF(SHAPE=$B$2,3,0)","v":0},{"$f":"IF(S7>0,\"Frame Radius:\",0)","v":0},{"$f":"IF(S7>0,I3,0)","v":0},{"$f":"IF(AND(S7>0,C4>0),1,0)","v":0},{"$f":"U25","v":0},"111",{"$f":"U24","v":0},null,null,5,"3S40A",13,20,54,84,132,null,4,111,"111 (Quarter Arch)",null,null,null,4,"Standard","1.38BM",1.1875,1.375,null,null,null,null,112,{"$f":"J32","v":0},{"$f":"J33","v":0},0,null,"Max. Short",0,{"$f":"IF(OR($AZ$28>42,$AZ$42>42),0,42)","v":42},{"$f":"IF(OR($AZ$28>70,$AZ$42>70),0,70)","v":70},{"$f":"IF(OR($AZ$28>70,$AZ$42>70),0,70)","v":70},"Tempered"]
[null,null,null,null,null,null,null,null,null,null,null,null,null,null,null,null,null,105,{"$f":"IF(SHAPE=$B$2,4,0)","v":0},{"$f":"IF(S8>0,\"Glass Radius:\",0)","v":0},{"$f":"IF(S8>0,I5,0)","v":0},null,{"$f":"U33","v":0},"112",{"$f":"U32","v":0},{"$f":"U35","v":0},null,6,"3S10C (1/4-1/2-1/4)",40,13,144,60,168,null,5,112,"112 (Quarter Arch w/Ex Leg)",null,null,null,5,"Standard w/NF","1.38NF",1.1875,2.238,null,null,null,null,113,{"$f":"J43","v":0},{"$f":"J42","v":0},0,null,"Max. Long",0,{"$f":"IF(OR($BA$28>84,$BA$42>84),0,84)","v":84},{"$f":"IF(OR($BA$28>129,$BA$42>129),0,129)","v":129},{"$f":"IF(OR($BA$28>129,$BA$42>129),0,129)","v":129},"Tempered"]
[null,null,null,null,null,null,null,null,null,null,null,null,null,null,null,null,null,105,{"$f":"IF(SHAPE=$B$2,5,0)","v":0},{"$f":"IF(S9>0,\"Glass Width:\",0)","v":0},{"$f":"IF(S9>0,I7,0)","v":0},{"$f":"IF(AND(U9>0,U9<GlassMinW),1,0)","v":0},{"$f":"U44","v":0},"113",{"$f":"U43","v":0},null,null,7,"3S10C (1/3-1/3-1/3)",30,13,120,60,168,null,6,113,"113 (Eyebrow)",null,null,null,6,"2\" Brickmold","2.0BM",1.875,2,null,null,null,null,114,{"$f":"J51","v":0},{"$f":"J50","v":0},0,null,"Max Sq.Ft.",0,{"$f":"IF(OR($BB$28>24.5,$BB$42>24.5),0,24.5)","v":24.5},{"$f":"IF(OR($BB$28>42,$BB$42>42),0,42)","v":42},{"$f":"IF(OR($BB$28>42,$BB$42>42),0,42)","v":42},"Tempered"]
[null,110,"Min R","Max W","Max UI","Max H","Min Leg",null,"Frame Width:",{"$f":"IF(AND(SHAPEW>0,SHAPEH>0,SHAPE=110,EXTLINK>3),TRUNC((SHAPEW-(OFFSET*2))*16+0.5)/16,IF(AND(SHAPEW>0,SHAPEH>0,SHAPE=110,EXTLINK<=3),SHAPEW,0))","v":0},null,null,null,null,null,null,null,105,{"$f":"IF(SHAPE=$B$2,6,0)","v":0},{"$f":"IF(S10>0,\"Glass Height:\",0)","v":0},{"$f":"IF(S10>0,I6,0)","v":0},{"$f":"IF(AND(U10>0,U10<GlassMinH),1,0)","v":0},{"$f":"U55","v":0},"114",{"$f":"U54","v":0},null,null,8,"3S21C (1/4-1/2-1/4)",40,13,144,60,168,null,7,114,"114 (Eyebrow w/Ex Leg)",null,null,null,7,"2\" Brickmold w/N.F","2.0NF",1.875,2.875,null,null,null,null,115,{"$f":"D65","v":0},{"$f":"D64","v":0},0,null,null,{"$f":"IF(AND(BE4>0,BE5>0,BE6>0),1,0)","v":1},{"$f":"IF(AND(BF4>0,BF5>0,BF6>0),1,0)","v":1},{"$f":"IF(AND(BG4>0,BG5>0,BG6>0),1,0)","v":1},{"$f":"IF(AND(BH4>0,BH5>0,BH6>0),1,0)","v":1},{"$f":"IF(BE10>0,\"≥SS Annealed\",IF(BF10>0,\"≥DS Annealed\",IF(BH10>0,\"TS Annealed\",\"\")))","v":"≥SS Annealed"}]
[null,{"$f":"EXT","v":1},{"$f":"MIN_R","v":""},{"$f":"MAX_W","v":""},{"$f":"MAX_UI","v":""},{"$f":"MAX_H","v":""},6.25E-2,null,"Frame Height:",{"$f":"IF(AND(SHAPEW>0,SHAPEH>0,SHAPE=110,EXTLINK>3),TRUNC((SHAPEH-(OFFSET*2))*16+0.5)/16,IF(AND(SHAPEW>0,SHAPEH>0,SHAPE=110,EXTLINK<=3),SHAPEH,0))","v":0},null,null,null,null,null,null,null,105,{"$f":"IF(SHAPE=$B$2,7,0)","v":0},{"$f":"IF(S11>0,\"Max Width:\",0)","v":0},{"$f":"IF(S11>0,D3,0)","v":0},{"$f":"IF(AND(S11>0,SHAPEW>0,I2>U11),1,0)","v":0},{"$f":"D67","v":0},"115",{"$f":"D66","v":0},null,null,9,"3S21C (1/3-1/3-1/3)",30,13,120,60,168,null,8,115,"115 (Half Eyebrow)",null,null,null,8,"Narrow Brickmold","Narrow",0.5,0.6825,null,null,null,null,116,{"$f":"D79","v":0},{"$f":"D78","v":0},0,null,null,null,{"$f":"IF(AND(BF7>0,BF8>0,BF9>0),1,0)","v":1},{"$f":"IF(AND(BG7>0,BG8>0,BG9>0),1,0)","v":1},{"$f":"IF(AND(BH7>0,BH8>0,BH9>0),1,0)","v":1},{"$f":"IF(BF11>0,\"≥DS Tempered\",IF(BH11>0,\"TS Tempered\",\"\"))","v":"≥DS Tempered"}]
[null,null,{"$f":"IF(AND(SHAPEW>0,SHAPE=B10,(FW/2)<C11),1,0)","v":0},{"$f":"IF(AND(SHAPEW>0,EXTLINK>1,SHAPE=B10,FW>D11),1,0)","v":0},{"$f":"IF(AND(SHAPEW>0,EXTLINK>1,SHAPE=B10,(FW+FH)>E11),1,0)","v":0},{"$f":"IF(AND(SHAPEW>0,EXTLINK>1,SHAPE=B10,FH>D11),1,0)","v":0},{"$f":"IF(AND(SHAPEW>0,SHAPEH>0,SHAPE=110,(FH-FW/2)<G11,(FH-FW/2)>0),1,0)","v":0},null,"Frame Radius:",{"$f":"IF(AND(SHAPEW>0,SHAPEH>0),J10/2,0)","v":0},null,null,null,null,null,null,null,105,{"$f":"IF(SHAPE=$B$2,8,0)","v":0},{"$f":"IF(S12>0,\"Max sq.ft.:\",0)","v":0},{"$f":"IF(S12>0,F3,0)","v":0},{"$f":"IF(AND(S12>0,F4>0),1,0)","v":0},{"$f":"D82","v":0},"116",{"$f":"D81","v":0},null,null,10,"8E10A",21,13,80,60,132,null,9,116,"116 (Half Eyebrow w/Ex Leg)",null,null,null,1,{"$f":"VLOOKUP(AP12,EXTCHART,2,FALSE)","v":"Select"},{"$f":"VLOOKUP(EXTLINK,EXTCHART,3,FALSE)","v":1},{"$f":"IF(EXTLINK>3,VLOOKUP(EXTLINK,EXTCHART,4,FALSE),0)","v":0},{"$f":"VLOOKUP(EXTLINK,EXTCHART,5,FALSE)","v":0},null,null,null,null,117,{"$f":"J91","v":0},{"$f":"J92","v":0},0,null,null,"2.5 mm","3.2 mm","4 mm","5 mm"]
[null,null,{"$f":"MAX(C12:G12)","v":0},{"$f":"IF(AND(SHAPE=B10,C13=1),1,0)","v":0},{"$f":"IF(AND(SHAPEW>0,EXTLINK>1,SHAPEH>0,SHAPE=110,(FH-J17)<>(FW/2),EXTLINK=2),1,IF(AND(SHAPEW>0,EXTLINK>1,SHAPEH>0,SHAPE=110,(SHAPEH-J17)<(SHAPEW/2),EXTLINK>2),1,0))","v":0},{"$f":"IF(AND(SHAPE=110,E13=1),\"HEIGHT MUST BE 1/2 THE WIDTH + Leg\",IF(AND(SHAPE=110,SHAPEW>0,C12>0),\"RADIUS MUST BE GREATER THAN \"&C11,IF(AND(SHAPE=110,J13>0,J13<GlassMinW),\"Glass Width is Under Minimum\",IF(AND(SHAPE=110,J14>0,J14<GlassMinH),\"Glass Height is Under Minimum\",\"\"))))","v":""},null,null,"Glass W:",{"$f":"IF(AND(SHAPEW>0,SHAPEH>0,EXTLINK>1,SHAPE=110),J10-(GLASSOFFSET*2),0)","v":0},null,null,null,null,null,null,null,110,{"$f":"IF(SHAPE=$B$10,1,0)","v":0},{"$f":"IF(S13>0,\"Frame Width:\",0)","v":0},{"$f":"IF(S13>0,J10,0)","v":0},{"$f":"IF(AND(S13>0,D12>0),1,0)","v":0},{"$f":"I85","v":0},"117",{"$f":"I84","v":0},null,null,11,"8E21A",21,13,78,60,132,null,10,117,"117 (Ellipse)",null,null,null,1,null,{"$f":"IF(OR(EXTLINK=2,EXTLINK=3),VLOOKUP(EXTLINK,EXTCHART,3,FALSE),IF(EXTLINK>3,VLOOKUP(REGENCYSELECT,EXTCHART,3,FALSE),0))","v":0},{"$f":"IF(OR(EXTLINK=2,EXTLINK=3),VLOOKUP(EXTLINK,EXTCHART,4,FALSE),IF(EXTLINK>3,VLOOKUP(REGENCYSELECT,EXTCHART,4,FALSE),0))","v":0},null,null,null,null,null,118,{"$f":"I96","v":0},{"$f":"I97","v":0},0,null,"Max. Short",{"$f":"IF(OR($BA$28>41,$BA$42>41),0,41)","v":41},{"$f":"IF(OR($BA$28>56,$BA$42>56),0,56)","v":56},{"$f":"IF(OR($BA$28>76,$BA$42>76),0,76)","v":76},{"$f":"IF(OR($BA$28>76,$BA$42>76),0,76)","v":76},"Annealed"]
[null,null,null,null,null,null,null,null,"Glass H:",{"$f":"IF(AND(SHAPEW>0,SHAPEH>0,EXTLINK>1,SHAPE=110),J11-(GLASSOFFSET*2),0)","v":0},null,null,null,null,null,null,null,110,{"$f":"IF(SHAPE=$B$10,2,0)","v":0},{"$f":"IF(S14>0,\"Frame Height:\",0)","v":0},{"$f":"IF(S14>0,J11,0)","v":0},{"$f":"IF(AND(S14>0,F12>0),1,0)","v":0},{"$f":"I95","v":0},"118",{"$f":"I95","v":0},null,null,12,"8E40A",13,21,54,84,132,null,11,118,"118 (Full Circle)",null,null,null,null,null,null,null,null,null,null,null,null,119,{"$f":"U118","v":0},{"$f":"U119","v":0},0,null,"Max. Long",{"$f":"IF(OR($AZ$28>62,$AZ$42>62),0,62)","v":62},{"$f":"IF(OR($AZ$28>76,$AZ$42>76),0,76)","v":76},{"$f":"IF(OR($AZ$28>110,$AZ$42>110),0,110)","v":110},{"$f":"IF(OR($AZ$28>110,$AZ$42>110),0,110)","v":110},"Annealed"]
[null,null,null,null,null,null,null,null,"Glass Leg H:",{"$f":"IF(AND(SHAPEW>0,SHAPEH>0,EXTLINK>1,SHAPE=110,(J11-J10/2)>0),(J11-J10/2)-GLASSOFFSET,0)","v":0},{"$f":"IF(J15<0,0,J15)","v":0},null,null,null,null,null,null,110,{"$f":"IF(SHAPE=$B$10,3,0)","v":0},{"$f":"IF(S15>0,\"Frame Radius:\",0)","v":0},{"$f":"IF(S15>0,J12,0)","v":0},{"$f":"IF(AND(S15>0,C12>0),1,0)","v":0},{"$f":"D109","v":0},"119",{"$f":"D108","v":0},null,null,13,"8V71F",12,12,120,120,168,null,12,119,"119 (Oval)",null,null,null,null,null,null,null,null,null,null,null,null,120,{"$f":"J118","v":0},{"$f":"J119","v":0},0,null,"Max Sq.Ft.",{"$f":"IF(OR($BB$28>12,$BB$42>12),0,12)","v":12},{"$f":"IF(OR($BB$28>22,$BB$42>22),0,22)","v":22},{"$f":"IF(OR($BB$28>42,$BB$42>42),0,42)","v":42},{"$f":"IF(OR($BB$28>42,$BB$42>42),0,42)","v":42},"Annealed"]
[null,null,null,null,null,null,null,null,"Glass R:",{"$f":"IF(AND(SHAPEW>0,SHAPEH>0,EXTLINK>1,SHAPE=110),J13/2,0)","v":0},null,null,null,null,null,null,null,110,{"$f":"IF(SHAPE=$B$10,4,0)","v":0},{"$f":"IF(S16>0,\"Frame Leg:\",0)","v":0},{"$f":"IF(AND(S16>0,(U14-U13/2)>0),U14-U13/2,0)","v":0},{"$f":"IF(AND(S20>0,G12>0),1,0)","v":0},{"$f":"J115","v":0},"120",{"$f":"J115","v":0},null,null,14,"8V71L",14,14,38,78,114,null,13,120,"120 (Hexagon)",null,null,null,null,null,null,null,null,null,null,null,null,121,{"$f":"G128","v":0},{"$f":"G129","v":0},0,null,"Max. Short",0,{"$f":"IF(OR($BA$28>42,$BA$42>42),0,42)","v":42},{"$f":"IF(OR($BA$28>70,$BA$42>70),0,70)","v":70},{"$f":"IF(OR($BA$28>70,$BA$42>70),0,70)","v":70},"Tempered"]
[null,null,null,null,null,null,null,null,"Frame Leg:",{"$f":"IF(AND(SHAPEW>0,SHAPEH>0,SHAPE=110,(FH-FW/2)>0),FH-FW/2,0)","v":0},null,null,null,null,null,null,null,110,{"$f":"IF(SHAPE=$B$10,5,0)","v":0},{"$f":"IF(S17>0,\"Glass Radius:\",0)","v":0},{"$f":"IF(S17>0,J16,0)","v":0},null,{"$f":"TRUNC((G133)*16+0.5)/16","v":0},"121",{"$f":"TRUNC((G132)*16+0.5)/16","v":0},null,null,15,"8V71R",14,14,38,78,114,null,14,121,"121 (Hexagon w/Ex Leg)",null,null,null,null,null,null,null,null,null,null,null,null,122,{"$f":"I137","v":0},{"$f":"I138","v":0},0,null,"Max. Long",0,{"$f":"IF(OR($AZ$28>84,$AZ$42>84),0,84)","v":84},{"$f":"IF(OR($AZ$28>129,$AZ$42>129),0,129)","v":129},{"$f":"IF(OR($AZ$28>129,$AZ$42>129),0,129)","v":129},"Tempered"]
[null,null,null,null,null,null,null,null,null,null,null,null,null,null,null,null,null,110,{"$f":"IF(SHAPE=$B$10,6,0)","v":0},{"$f":"IF(S18>0,\"Glass Width:\",0)","v":0},{"$f":"IF(S18>0,J13,0)","v":0},{"$f":"IF(AND(U18>0,U18<GlassMinW),1,0)","v":0},{"$f":"I136","v":0},"122",{"$f":"I136","v":0},null,null,16,"3S55A",12,12,37,37,55,null,15,122,"122 (Octagon)",null,null,null,null,null,null,null,null,null,null,null,null,123,{"$f":"D148","v":0},{"$f":"D149","v":0},0,null,"Max Sq.Ft.",0,{"$f":"IF(OR($BB$28>24.5,$BB$42>24.5),0,24.5)","v":24.5},{"$f":"IF(OR($BB$28>42,$BB$42>42),0,42)","v":42},{"$f":"IF(OR($BB$28>42,$BB$42>42),0,42)","v":42},"Tempered"]
[null,null,null,null,null,null,null,null,null,null,null,null,null,null,null,null,null,110,{"$f":"IF(SHAPE=$B$10,7,0)","v":0},{"$f":"IF(S19>0,\"Glass Height:\",0)","v":0},{"$f":"IF(S19>0,J14,0)","v":0},{"$f":"IF(AND(U19>0,U19<GlassMinH),1,0)","v":0},{"$f":"D149","v":0},"123",{"$f":"D148","v":0},null,null,17,"3S56A",14,14,54,36,72,null,16,123,"123 (Octagon w/Ex Leg)",null,null,null,null,"Glass Min. Max.",null,null,null,null,null,null,null,124,{"$f":"#REF!","v":{"$error":"#REF!"}},{"$f":"#REF!","v":{"$error":"#REF!"}},{"$error":"#REF!"},null,null,{"$f":"IF(AND(BE13>0,BE14>0,BE15>0),1,0)","v":1},{"$f":"IF(AND(BF13>0,BF14>0,BF15>0),1,0)","v":1},{"$f":"IF(AND(BG13>0,BG14>0,BG15>0),1,0)","v":1},{"$f":"IF(AND(BH13>0,BH14>0,BH15>0),1,0)","v":1},{"$f":"IF(BE19>0,\"≥SS Annealed\",IF(BF19>0,\"≥DS Annealed\",IF(BH19>0,\"TS Annealed\",\"\")))","v":"≥SS Annealed"}]
[null,111,"Min R","Max W","Max UI","Max Sq.ft",null,"Frame Width:",{"$f":"IF(AND(SHAPEW>0,SHAPE=111,EXTLINK>3),TRUNC((SHAPEW-(OFFSET*2)-K26)*16+0.5)/16,IF(AND(SHAPEW>0,SHAPE=111,EXTLINK<=3),SHAPEW,0))","v":0},null,null,null,null,null,null,null,null,110,{"$f":"IF(SHAPE=$B$10,8,0)","v":0},{"$f":"IF(S20>0,\"Glass Leg Height:\",0)","v":0},{"$f":"IF(S20>0,J15,0)","v":0},null,{"$f":"D162","v":0},"124",{"$f":"D161","v":0},null,null,18,"8V81A",15,14,60,48,98,null,17,124,"124 (Pentagon Equilateral)",null,null,null,null,"Glass Min Width",6,null,null,null,null,null,null,125,{"$f":"G171","v":0},{"$f":"G172","v":0},0,null,null,null,{"$f":"IF(AND(BF16>0,BF17>0,BF18>0),1,0)","v":1},{"$f":"IF(AND(BG16>0,BG17>0,BG18>0),1,0)","v":1},{"$f":"IF(AND(BH16>0,BH17>0,BH18>0),1,0)","v":1},{"$f":"IF(BF20>0,\"≥DS Tempered\",IF(BH20>0,\"TS Tempered\",\"\"))","v":"≥DS Tempered"}]
[null,{"$f":"EXT","v":1},{"$f":"MIN_R","v":""},{"$f":"MAX_W","v":""},{"$f":"MAX_UI","v":""},{"$f":"MAX_SF","v":""},null,"Frame Height:",{"$f":"IF(AND(SHAPEW>0,SHAPE=111,EXTLINK>3),TRUNC((SHAPEW-(OFFSET*2)-K26)*16+0.5)/16,IF(AND(SHAPEW>0,SHAPE=111,EXTLINK<=3),SHAPEW,0))","v":0},"F",{"$f":"IF(AND(SHAPEW>0,EXTLINK>1,SHAPE=B20),2*(ASIN((GLASSOFFSET*2)/(2*I23))),0)","v":0},null,null,null,null,null,null,110,{"$f":"IF(SHAPE=$B$10,9,0)","v":0},{"$f":"IF(S21>0,\"Max Width:\",0)","v":0},{"$f":"IF(S21>0,D11,0)","v":0},{"$f":"IF(AND(S21>0,SHAPEW>0,D12>0),1,0)","v":0},{"$f":"D173","v":0},"125",{"$f":"D172","v":0},null,null,19,"L201","11","20",48,78,126,null,18,125,"125 (Half Pentagon)",null,null,null,null,"Glass Min Height",6,null,null,null,null,null,null,126,{"$f":"G182","v":0},{"$f":"G183","v":0},0,null,"This is not being used"]
[null,null,{"$f":"IF(AND(SHAPEW>0,SHAPE=B20,FW<C21),1,0)","v":0},{"$f":"IF(AND(SHAPEW>0,EXTLINK>1,SHAPE=B20,FW>D21),1,0)","v":0},{"$f":"IF(AND(SHAPEW>0,EXTLINK>1,SHAPE=B20,(FW+FH)>E21),1,0)","v":0},{"$f":"IF(AND(SHAPEW>0,EXTLINK>1,SHAPEH>0,SHAPE=B20,((FW*FH)/144)>F21),1,0)","v":0},null,"Frame R:",{"$f":"IF(AND(SHAPEW>0,SHAPE=111,EXTLINK>3),SHAPEW-OFFSET,IF(AND(SHAPEW>0,SHAPE=111,EXTLINK<=3),SHAPEW,0))","v":0},"d",{"$f":"IF(AND(SHAPEW>0,SHAPE=111),I23*COS(K21/2),0)","v":0},null,null,null,null,null,null,110,{"$f":"IF(SHAPE=$B$10,10,0)","v":0},{"$f":"IF(S22>0,\"Max Height:\",0)","v":0},{"$f":"IF(S22>0,F11,0)","v":0},{"$f":"IF(AND(S22>0,SHAPEH>0,F12:F118),1,0)","v":0},{"$f":"D183","v":0},"126",{"$f":"D182","v":0},null,null,20,"L202","18","9","84",56,140,null,19,126,"126 (Pentagon)",null,null,null,null,null,null,null,null,null,null,null,null,127,{"$f":"D198","v":0},{"$f":"D199","v":0},0,null,{"$f":"IF(RADIUS>\"\",RADIUS,IF(SHAPEW>0,\"Available Glass Options: \"&GLASSOPT1&IF(AND(GLASSOPT1>\"\",GLASSOPT2>\"\"),\" Or \",\"\")&GLASSOPT2&\".\"&IF(EXTLINK=5,\" TIG only in SS & DS. Dual IG in all Available Strengths.\",\" No TIG. Dual IG in all Available Strengths.\"),\"\"))","v":""}]
[null,null,{"$f":"MAX(C22:F22)","v":0},{"$f":"IF(AND(SHAPE=B20,C23=1),1,0)","v":0},{"$f":"IF(AND(SHAPEW>0,SHAPE=111,SHAPEH>0,I21<>I20),1,0)","v":0},{"$f":"IF(AND(SHAPE=111,E23=1),\"HEIGHT MUST BE EQUAL TO THE WIDTH\",IF(AND(SHAPE=111,SHAPEW>0,C22>0),\"RADIUS MUST BE GREATER THAN \"&C21,IF(AND(SHAPE=111,I24>0,I24<GlassMinW),\"Glass Width or Height is Under Minimum\",\"\")))","v":""},null,"Glass R:",{"$f":"IF(AND(SHAPEW>0,SHAPE=111),I22-GLASSOFFSET,0)","v":0},"h",{"$f":"I23-K22","v":0},null,null,null,null,null,null,110,{"$f":"IF(SHAPE=$B$10,11,0)","v":0},{"$f":"IF(S23>0,\"Max UI:\",0)","v":0},{"$f":"IF(S23>0,E11,0)","v":0},{"$f":"IF(AND(S23>0,E12>0),1,0)","v":0},{"$f":"D195","v":0},"127",{"$f":"D194","v":0},null,null,21,"L203",48,"9",108,56,164,null,20,127,"127 (Cathedral)",null,null,null,null,"Minimum Radius",null,null,"S140","S144","S146",null,null,128,{"$f":"G208","v":0},{"$f":"G209","v":0},0]
[null,null,null,null,null,null,null,"Glass W & H:",{"$f":"IF(AND(SHAPEW>0,SHAPE=111,EXTLINK>3),((2*(SQRT(I25*((2*I23)-I25))))/2)-(GLASSOFFSET+OFFSET),IF(AND(SHAPEW>0,EXTLINK<=3,SHAPE=111),I20-((GLASSOFFSET*2)+K23),0))","v":0},"F",{"$f":"IF(AND(SHAPEW>0,EXTLINK>1,SHAPE=111),2*(ASIN((OFFSET*2)/(2*I22))),0)","v":0},null,null,null,null,null,null,111,{"$f":"IF(SHAPE=$B$20,1,0)","v":0},{"$f":"IF(S24>0,\"Frame Width:\",0)","v":0},{"$f":"IF(S24>0,I20,0)","v":0},{"$f":"IF(AND(S30>0,SHAPEW>0,D22>0),1,0)","v":0},{"$f":"D209","v":0},"128",{"$f":"D208","v":0},null,null,22,"L204",12,"9","112","96","154",null,21,128,"128 (Cathedral w/Ex Leg)",null,null,null,null,"SH2201",10,"8V",{"$f":"SH_2201*2","v":20},18.375,14.375,null,null,129,{"$f":"G219","v":0},{"$f":"G220","v":0},0]
[null,null,null,null,null,null,null,"R.T Glass Height:",{"$f":"SHAPEW-((GLASSOFFSET+OFFSET)*2)","v":0},"d",{"$f":"IF(AND(SHAPEW>0,SHAPE=111),I22*COS(K24/2),0)","v":0},null,null,null,null,null,null,111,{"$f":"IF(SHAPE=$B$20,2,0)","v":0},{"$f":"IF(S25>0,\"Frame Height:\",0)","v":0},{"$f":"IF(S25>0,I21,0)","v":0},{"$f":"IF(AND(S30>0,SHAPEW>0,D22>0),1,0)","v":0},{"$f":"D220","v":0},"129",{"$f":"D219","v":0},null,null,23,"L209",38,"9",108,56,164,null,22,129,"129 (Trapezoid)",null,null,null,null,"PWFO1",10,"6J","N/A","N/A","N/A",null,null,130,{"$f":"D233","v":0},{"$f":"D234","v":0},0]
[null,null,null,null,null,null,null,null,null,"h",{"$f":"I22-K25","v":0},null,null,null,null,null,null,111,{"$f":"IF(SHAPE=$B$20,3,0)","v":0},{"$f":"IF(S26>0,\"Frame Radius:\",0)","v":0},{"$f":"IF(S26>0,I22,0)","v":0},{"$f":"IF(AND(S26>0,C22>0),1,0)","v":0},{"$f":"D232","v":0},"130",{"$f":"D231","v":0},null,null,24,"03A0 Comp.",11,22,48,84,126,null,23,130,"130 (Right Triangle)",null,null,null,null,"PW3001",11.75,"8X","N/A","N/A","N/A",null,null,131,{"$f":"G242","v":0},{"$f":"G243","v":0},0]
[null,null,null,null,null,null,null,null,null,null,null,null,null,null,null,null,null,111,{"$f":"IF(SHAPE=$B$20,4,0)","v":0},{"$f":"IF(S27>0,\"Glass Radius:\",0)","v":0},{"$f":"IF(S27>0,I23,0)","v":0},null,{"$f":"D244","v":0},"131",{"$f":"D243","v":0},null,null,25,"03A0 Steel",11,22,52,96,148,null,24,131,"131 (Equilateral Triangle)",null,null,null,null,3180,11.5,"6K",{"$f":"EXCAL*2","v":23},19.625,11,null,null,132,{"$f":"G251","v":0},{"$f":"G252","v":0},0]
[null,null,null,null,null,null,null,null,null,null,null,null,null,null,null,null,null,111,{"$f":"IF(SHAPE=$B$20,5,0)","v":0},{"$f":"IF(S28>0,\"Glass Width:\",0)","v":0},{"$f":"IF(S28>0,I24,0)","v":0},{"$f":"IF(AND(U28>0,U28<GlassMinW),1,0)","v":0},{"$f":"D253","v":0},"132",{"$f":"D252","v":0},null,null,26,"03A2 Comp.",18.5,12,72,56,128,null,25,132,"132 (Isosceles Triangle)",null,null,null,null,5336,12.5,"8Y","N/A","N/A","N/A",null,null,{"$f":"SHAPE","v":"Select"},{"$f":"IF(AND(SHAPELINK>1,SHAPEW>0),VLOOKUP(SHAPE,GLASSCHART,2,FALSE),0)","v":0},{"$f":"IF(AND(SHAPELINK>1,SHAPEW>0),VLOOKUP(SHAPE,GLASSCHART,3,FALSE),0)","v":0},{"$f":"IF(AND(SHAPELINK>1,SHAPEW>0),VLOOKUP(SHAPE,GLASSCHART,4,FALSE),0)","v":0}]
[null,112,"Min R","Max W","Max UI","Max H","Min Leg",null,"Frame Height:",{"$f":"IF(AND(SHAPEW>0,SHAPE=112,EXTLINK>3),TRUNC((SHAPEH-(OFFSET*2)-H37)*16+0.5)/16,IF(AND(SHAPEW>0,SHAPE=112,EXTLINK<=3),SHAPEH,0))","v":0},null,null,null,null,null,null,null,111,{"$f":"IF(SHAPE=$B$20,6,0)","v":0},{"$f":"IF(S29>0,\"Glass Height:\",0)","v":0},{"$f":"IF(S29>0,I24,0)","v":0},{"$f":"IF(AND(U29>0,U29<GlassMinH),1,0)","v":0},{"$f":"MAX(W5:W28)","v":0},null,{"$f":"MAX(Y5:Y28)","v":0},{"$f":"IF(Z6<>0,Z6,IF(Z8<>0,Z8,0))","v":0},null,27,"03A2 Steel",18.5,12,96,72,156,null,1,{"$f":"VLOOKUP($AJ$29,SHAPECHART,2,FALSE)","v":"Select"},{"$f":"VLOOKUP($AJ$29,SHAPECHART,3,FALSE)","v":"Select"},{"$f":"IF(AND(EXTLINK>1,SHAPELINK>1,OR($AJ$29=14,$AJ$29=16,$AJ$29=18,$AJ$29=19,$AJ$29=22)),1,0)","v":0},{"$f":"IF(AND(EXTLINK>1,SHAPELINK>1,OR($AJ$29=7,$AJ$29=9,$AJ$29=18,$AJ$29=21)),1,0)","v":0},null,null,"PI2101",13.75,"6V","N/A","N/A","N/A",null,null,"Glass Options"]
[null,{"$f":"EXT","v":1},{"$f":"MIN_R","v":""},{"$f":"MAX_W","v":""},{"$f":"MAX_UI","v":""},{"$f":"MAX_H","v":""},6.25E-2,null,"Frame R:",{"$f":"IF(AND(SHAPEW>0,SHAPE=112,EXTLINK>3),TRUNC((SHAPEW-OFFSET)*16+0.5)/16,IF(AND(SHAPEW>0,SHAPE=112,EXTLINK<=3),SHAPEW,0))","v":0},null,null,null,null,null,null,null,111,{"$f":"IF(SHAPE=$B$20,7,0)","v":0},{"$f":"IF(S30>0,\"Max Width:\",0)","v":0},{"$f":"IF(S30>0,D21,0)","v":0},{"$f":"IF(AND(S30>0,SHAPEW>0,D22>0),1,0)","v":0},"FH",null,"FW",null,null,28,"03A3 Comp.",52,12,108,56,164,null,null,null,null,"DIM3","DIM4",null,null,"V-Series",12,null,{"$f":"IF(ISERROR(VLOOKUP(EXT,$AQ$24:$AV$29,4,FALSE)),\"N/A\",VLOOKUP(EXT,$AQ$24:$AV$29,4,FALSE))","v":"N/A"},{"$f":"IF(ISERROR(VLOOKUP(EXT,$AQ$24:$AV$29,5,FALSE)),\"N/A\",VLOOKUP(EXT,$AQ$24:$AV$29,5,FALSE))","v":"N/A"},{"$f":"IF(ISERROR(VLOOKUP(EXT,$AQ$24:$AV$29,6,FALSE)),\"N/A\",VLOOKUP(EXT,$AQ$24:$AV$29,6,FALSE))","v":"N/A"},null,null,{"$f":"IF(BI10>\"\",BI10,IF(BI19>\"\",BI19,\"\"))","v":"≥SS Annealed"},null,{"$f":"IF(AND(OR(BI10=\"≥SS Annealed\",BI10=\"≥DS Annealed\",BI11=\"≥DS Tempered\",BI19=\"≥SS Annealed\",BI19=\"≥DS Annealed\",BI20=\"≥DS Tempered\"),OR(EXTLINK=5,PWSELECT>1)),\"TIG\",\"\")","v":""}]
[null,null,{"$f":"IF(AND(SHAPEW>0,SHAPE=B29,FW<C30),1,0)","v":0},{"$f":"IF(AND(SHAPEW>0,EXTLINK>1,SHAPE=B29,FW>D30),1,0)","v":0},{"$f":"IF(AND(SHAPEW>0,EXTLINK>1,SHAPE=B29,(FW+FH)>E30),1,0)","v":0},{"$f":"IF(AND(SHAPEW>0,EXTLINK>1,SHAPE=B29,FH>D30),1,0)","v":0},{"$f":"IF(AND(SHAPEW>0,SHAPE=B29,(FH-FW)<G30,SHAPE=B29,(FH-FW)>0),1,0)","v":0},null,"Glass R:",{"$f":"IF(AND(SHAPEW>0,SHAPE=112),J30-GLASSOFFSET,0)","v":0},null,null,null,null,null,null,null,111,{"$f":"IF(SHAPE=$B$20,8,0)","v":0},{"$f":"IF(S31>0,\"Max sq.ft.:\",0)","v":0},{"$f":"IF(S31>0,F21,0)","v":0},{"$f":"IF(AND(S31>0,F22>0),1,0)","v":0},null,null,null,null,null,29,"03A3 Steel",52,12,120,72,192,null,null,null,null,null,null,null,null,"Pi7301",13,null,null,null,null,null,null,{"$f":"IF(BI11>\"\",BI11,IF(BI20>\"\",BI20,\"\"))","v":"≥DS Tempered"}]
[null,null,{"$f":"MAX(C31:G31)","v":0},{"$f":"IF(AND(SHAPE=B29,C32=1),1,0)","v":0},{"$f":"IF(AND(SHAPEW>0,SHAPEH>0,DIM_4>0,SHAPE=112,FH<>(FW+U35)),1,0)","v":0},{"$f":"IF(AND(SHAPE=112,E32=1),\"HEIGHT MUST BE EQUAL TO THE WIDTH + DIM4\",IF(AND(SHAPE=112,SHAPEW>0,C31>0),\"RADIUS MUST BE GREATER THAN \"&C30,IF(AND(SHAPE=112,J32>0,J32<GlassMinW),\"Glass Width is Under Minimum\",IF(AND(SHAPE=112,J33>0,J33<GlassMinH),\"Glass Height is Under Minimum\",\"\"))))","v":""},null,null,"Glass W:",{"$f":"IF(AND(SHAPEW>0,EXTLINK>1,SHAPE=112),U32-(GLASSOFFSET*2),0)","v":0},null,null,null,null,null,null,null,112,{"$f":"IF(SHAPE=$B$29,1,0)","v":0},{"$f":"IF(S32>0,\"Frame Width:\",0)","v":0},{"$f":"IF(AND(S32>0,EXTLINK>3),TRUNC((SHAPEW-(OFFSET*2))*16+0.5)/16,IF(AND(S32>0,EXTLINK>1,EXTLINK<=3),SHAPEW,0))","v":0},{"$f":"IF(AND(S34>0,C31>0),1,0)","v":0},null,null,null,null,null,30,"03A4",9.5,9.5,112,96,154,null,null,null,null,null,null,null,null,"L4807",13.5]
[null,null,null,null,null,null,null,null,"Glass H:",{"$f":"IF(AND(SHAPEW>0,SHAPE=112,EXTLINK>3),(((2*(SQRT(J32*((2*J31)-J32))))/2))+J34,IF(AND(SHAPEW>0,SHAPE=112,EXTLINK<=3),SHAPEH-((GLASSOFFSET*2)+J37),0))","v":0},null,null,null,null,null,null,null,112,{"$f":"IF(SHAPE=$B$29,2,0)","v":0},{"$f":"IF(S33>0,\"Frame Height:\",0)","v":0},{"$f":"IF(S33>0,J29,0)","v":0},{"$f":"IF(AND(S41>0,SHAPEH>0,F31>0),1,0)","v":0},null,null,null,null,null,31,"03A9 Comp.",52,12,108,56,164,null,null,null,null,null,null,null,null,3954,12.5,null,null,null,null,null,null,"Model","Width","Height","Area"]
[null,null,null,null,null,null,null,null,"Glass Leg H:",{"$f":"IF(AND(SHAPEW>0,SHAPEH>0,SHAPE=112,EXTLINK>1,U35>0),U35-GLASSOFFSET,0)","v":0},null,null,null,null,null,null,null,112,{"$f":"IF(SHAPE=$B$29,3,0)","v":0},{"$f":"IF(S34>0,\"Frame Radius:\",0)","v":0},{"$f":"IF(S34>0,J30,0)","v":0},{"$f":"IF(AND(S34>0,C31>0),1,0)","v":0},null,null,null,null,null,32,"03A9 Steel",52,12,120,72,192,null,null,null,null,null,null,null,null,null,null,null,null,null,null,null,1,"Select"]
[null,null,null,null,null,null,null,{"$f":"IF(AND(SHAPEW>0,EXTLINK>1,SHAPE=112),2*(ASIN((OFFSET*2)/(2*J30))),0)","v":0},"F",{"$f":"IF(AND(SHAPEW>0,EXTLINK>1,SHAPE=112),2*(ASIN((GLASSOFFSET*2)/(2*J31))),0)","v":0},null,null,null,null,null,null,null,112,{"$f":"IF(SHAPE=$B$29,4,0)","v":0},{"$f":"IF(S35>0,\"Frame Leg:\",0)","v":0},{"$f":"IF(AND(S35>0,SHAPEH>0,SHAPEW>0,EXTLINK>3,(SHAPEH-SHAPEW-OFFSET)>0),(SHAPEH-SHAPEW)-OFFSET,IF(AND(S35>0,SHAPEH>0,SHAPEW>0,EXTLINK>1,EXTLINK<=3),SHAPEH-SHAPEW,0))","v":0},{"$f":"IF(AND(S35>0,G31>0),1,0)","v":0},null,null,null,null,null,33,"0970","13","13","96","84","154",null,null,null,null,null,null,null,null,null,null,null,null,null,null,null,2,"0504",{"$f":"IF(AND(SHAPEW>0,SHAPEH>0),SHAPEW-4.625,0)","v":0},{"$f":"IF(AND(SHAPEW>0,SHAPEH>0),SHAPEH-4.625,0)","v":0},{"$f":"(AZ35*BA35)/144","v":0}]
[null,null,null,null,null,null,null,{"$f":"IF(AND(SHAPEW>0,SHAPE=112),J30*COS(H35/2),0)","v":0},"d",{"$f":"IF(AND(SHAPEW>0,SHAPE=112),J31*COS(J35/2),0)","v":0},null,null,null,null,null,null,null,112,{"$f":"IF(SHAPE=$B$29,5,0)","v":0},{"$f":"IF(S36>0,\"Glass Radius:\",0)","v":0},{"$f":"IF(S36>0,J31,0)","v":0},null,null,null,null,null,null,34,"0971","16","19","36","78","114",null,null,null,null,null,null,null,null,null,null,null,null,null,null,null,3,"0614",0,0,0]
[null,null,null,null,null,null,null,{"$f":"J30-H36","v":0},"h",{"$f":"J31-J36","v":0},null,null,null,null,null,null,null,112,{"$f":"IF(SHAPE=$B$29,6,0)","v":0},{"$f":"IF(S37>0,\"Glass Width:\",0)","v":0},{"$f":"IF(S37>0,J32,0)","v":0},{"$f":"IF(AND(U37>0,U37<GlassMinW),1,0)","v":0},null,null,null,null,null,35,"0972","32","19","72","78","150",null,null,null,null,null,null,null,null,null,null,null,null,null,null,null,4,"0970",0,0,0]
[null,null,null,null,null,null,null,null,null,null,null,null,null,null,null,null,null,112,{"$f":"IF(SHAPE=$B$29,7,0)","v":0},{"$f":"IF(S38>0,\"Glass Height:\",0)","v":0},{"$f":"IF(S38>0,J33,0)","v":0},{"$f":"IF(AND(U38>0,U38<GlassMinH),1,0)","v":0},null,null,null,null,null,36,"0973","64","19","120","78","198",null,null,null,null,null,null,null,null,null,null,null,null,null,null,null,5,"8014",0,0,0]
[null,null,null,null,null,null,null,null,null,null,null,null,null,null,null,null,null,112,{"$f":"IF(SHAPE=$B$29,8,0)","v":0},{"$f":"IF(S39>0,\"Glass Leg Height:\",0)","v":0},{"$f":"IF(S39>0,J34,0)","v":0},null,null,null,null,null,null,37,"0974","64","19","120","78","198",null,null,null,null,null,null,null,null,null,null,null,null,null,null,null,6,"8070",0,0,0]
[null,113,"Min R","Max W","Max UI","Max Sq.ft","Cut L","Min H","Frame Radius",{"$f":"IF(AND(SHAPEW>0,SHAPEH>0,SHAPE=113,EXTLINK>3),(((SHAPEW/2)^2+SHAPEH^2)/(2*SHAPEH))-OFFSET,IF(AND(SHAPEW>0,SHAPEH>0,SHAPE=113,EXTLINK<=3),(((SHAPEW/2)^2+SHAPEH^2)/(2*SHAPEH)),0))","v":0},null,null,null,null,null,null,null,112,{"$f":"IF(SHAPE=$B$29,9,0)","v":0},{"$f":"IF(S40>0,\"Max Width:\",0)","v":0},{"$f":"IF(S40>0,D30,0)","v":0},{"$f":"IF(AND(S40>0,SHAPEW>0,D31>0),1,0)","v":0},null,null,null,null,null,38,"0975","80","19","120","78","198",null,null,null,null,null,null,null,null,null,null,null,null,null,null,null,7,"9014",0,0,0]
[null,{"$f":"EXT","v":1},{"$f":"MIN_R","v":""},{"$f":"MAX_W","v":""},{"$f":"MAX_UI","v":""},{"$f":"MAX_SF","v":""},{"$f":"CUT_LENGTH","v":""},{"$f":"MIN_H","v":""},"Glass Radius",{"$f":"IF(AND(SHAPEW>0,SHAPEH>0,EXTLINK>1,SHAPE=113),J40-GLASSOFFSET,0)","v":0},{"$f":"IF(AND(SHAPEW>0,SHAPEH>0,EXTLINK>1,SHAPE=113),2*(SQRT((FH-(EXTOFFSET*2))*(2*(J40-EXTOFFSET)-((FH-(EXTOFFSET*2)))))),0)","v":0},null,null,null,null,null,null,112,{"$f":"IF(SHAPE=$B$29,10,0)","v":0},{"$f":"IF(S41>0,\"Max Height:\",0)","v":0},{"$f":"IF(S41>0,F30,0)","v":0},{"$f":"IF(AND(S41>0,SHAPEH>0,F31>0),1,0)","v":0},null,null,null,null,null,1,"0979","48","19","108","78","186",null,null,null,null,null,null,null,null,null,null,null,null,null,null,null,8,"9070",0,0,0]
[null,null,{"$f":"IF(AND(SHAPEW>0,SHAPEH>0,SHAPE=B40,J40<C41),1,0)","v":0},{"$f":"IF(AND(SHAPEW>0,EXTLINK>1,SHAPE=B40,FW>D41),1,0)","v":0},{"$f":"IF(AND(SHAPEW>0,EXTLINK>1,SHAPEH>0,SHAPE=B40,(FW+FH)>E41),1,0)","v":0},{"$f":"IF(AND(SHAPEW>0,EXTLINK>1,SHAPEH>0,SHAPE=B40,((FW*FH)/144)>F41),1,0)","v":0},{"$f":"IF(AND(SHAPEW>0,SHAPE=B40,SHAPEH>0,J45>G41),1,0)","v":0},{"$f":"IF(AND(SHAPEW>0,SHAPEH>0,SHAPE=113,FH<H41),1,0)","v":0},"Glass Height",{"$f":"IF(AND(SHAPEW>0,SHAPEH>0,SHAPE=113,EXTLINK>3),SHAPEH-(2*(OFFSET+GLASSOFFSET)),IF(AND(SHAPEW>0,SHAPEH>0,EXTLINK<=3,SHAPE=113),SHAPEH-(2*GLASSOFFSET),0))","v":0},{"$f":"IF(AND(SHAPEW>0,SHAPEH>0,EXTLINK>1,SHAPE=113),U44-(2*EXTOFFSET),0)","v":0},null,null,null,null,null,null,112,{"$f":"IF(SHAPE=$B$29,11,0)","v":0},{"$f":"IF(S42>0,\"Max UI:\",0)","v":0},{"$f":"IF(S42>0,E30,0)","v":0},{"$f":"IF(AND(S42>0,E31>0),1,0)","v":0},null,null,null,null,null,null,{"$f":"IF(MODELLINK>1,VLOOKUP(MODELLINK,CHART,2,FALSE),\"\")","v":""},{"$f":"IF(MODELLINK>1,VLOOKUP(MODELLINK,CHART,3,FALSE),\"\")","v":""},{"$f":"IF(MODELLINK>1,VLOOKUP(MODELLINK,CHART,4,FALSE),\"\")","v":""},{"$f":"IF(MODELLINK>1,VLOOKUP(MODELLINK,CHART,5,FALSE),\"\")","v":""},{"$f":"IF(MODELLINK>1,VLOOKUP(MODELLINK,CHART,6,FALSE),\"\")","v":""},{"$f":"IF(MODELLINK>1,VLOOKUP(MODELLINK,CHART,7,FALSE),\"\")","v":""},null,null,null,null,null,null,null,null,null,null,null,null,null,null,null,1,{"$f":"IF(AND(PWSELECT>1,SHAPEW>0,SHAPEH>0),VLOOKUP(PWSELECT,PWTABLE,2,FALSE),0)","v":0},{"$f":"IF(AND(PWSELECT>1,SHAPEW>0,SHAPEH>0),VLOOKUP(PWSELECT,PWTABLE,3,FALSE),0)","v":0},{"$f":"IF(AND(PWSELECT>1,SHAPEW>0,SHAPEH>0),VLOOKUP(PWSELECT,PWTABLE,4,FALSE),0)","v":0},{"$f":"IF(AND(PWSELECT>1,SHAPEW>0,SHAPEH>0),VLOOKUP(PWSELECT,PWTABLE,5,FALSE),0)","v":0}]
[null,null,{"$f":"MAX(C42:H42)","v":0},{"$f":"IF(AND(SHAPE=B40,C43=1),1,0)","v":0},{"$f":"IF(AND(SHAPEW>0,SHAPEH>0,SHAPE=113,FH>=(FW/2)),1,0)","v":0},{"$f":"IF(AND(SHAPE=113,E43=1),\"FRAME HEIGHT MUST BE LESS THAN 1/2 THE WIDTH\",IF(AND(SHAPE=113,SHAPEW>0,C42>0),\"RADIUS MUST BE GREATER THAN \"&C41,IF(AND(SHAPE=113,J43>0,J43<GlassMinW),\"Glass Width is Under Minimum\",IF(AND(SHAPE=113,J42>0,J42<GlassMinH),\"Glass Height is Under Minimum\",\"\"))))","v":""},null,null,"Glass Width",{"$f":"IF(AND(SHAPEW>0,SHAPEH>0,EXTLINK>1,SHAPE=113),2*(SQRT(J42*((2*J41)-J42))),0)","v":0},{"$f":"IF(AND(SHAPEW>0,SHAPEH>0,EXTLINK>1,SHAPE=113),(U43-K41)/2,0)","v":0},null,null,null,null,null,null,113,{"$f":"IF(SHAPE=$B$40,1,0)","v":0},{"$f":"IF(S43>0,\"Frame Width:\",0)","v":0},{"$f":"IF(AND(S43>0,EXTLINK>3),TRUNC((2*(SQRT((U44*((2*J40)-U44)))))*16+0.5)/16,IF(AND(S43>0,EXTLINK>1,EXTLINK<=3),SHAPEW,0))","v":0},{"$f":"IF(AND(S43>0,D42>0),1,0)","v":0}]
[null,null,null,null,null,null,null,null,"Angle of cut",{"$f":"IF(AND(SHAPEW>0,SHAPEH>0,EXTLINK>1,SHAPE=113),DEGREES(ATAN(EXTOFFSET/K43)),0)","v":0},null,null,null,null,null,null,null,113,{"$f":"IF(SHAPE=$B$40,2,0)","v":0},{"$f":"IF(S44>0,\"Frame Height:\",0)","v":0},{"$f":"IF(AND(S44>0,EXTLINK>3),TRUNC((SHAPEH-(2*OFFSET))*16+0.5)/16,IF(AND(S44>0,EXTLINK>1,EXTLINK<=3),SHAPEH,0))","v":0},{"$f":"IF(AND(S44>0,OR(H42>0,E43>0)),1,0)","v":0}]
[null,null,null,null,null,null,null,null,"Cut Length",{"$f":"IF(AND(SHAPEW>0,SHAPEH>0,EXTLINK>1,SHAPE=113),SQRT(EXTOFFSET^2+K43^2),0)","v":0},null,null,null,null,null,null,null,113,{"$f":"IF(SHAPE=$B$40,3,0)","v":0},{"$f":"IF(S43>0,\"Frame Radius:\",0)","v":0},{"$f":"IF(S43>0,J40,0)","v":0},{"$f":"IF(AND(S45>0,C42>0),1,0)","v":0}]
[null,null,null,null,null,null,null,null,null,null,null,null,null,null,null,null,null,113,{"$f":"IF(SHAPE=$B$40,4,0)","v":0},{"$f":"IF(S44>0,\"Glass Radius:\",0)","v":0},{"$f":"IF(S44>0,J41,0)","v":0},null,null,null,null,null,null,null,null,null,null,null,null,null,null,null,null,null,null,null,null,null,"Mezzo",3954,2.09375,2.605]
[null,null,null,null,null,null,null,null,null,null,null,null,null,null,null,null,null,113,{"$f":"IF(SHAPE=$B$40,5,0)","v":0},{"$f":"IF(S45>0,\"Glass Width:\",0)","v":0},{"$f":"IF(S45>0,J43,0)","v":0},{"$f":"IF(AND(U47>0,U47<GlassMinW),1,0)","v":0},null,null,null,null,null,null,null,null,null,null,null,null,null,null,null,null,null,null,null,null,"New Construction","SH2201",1,2.1619999999999999]
[null,114,"Min R","Max W","Max UI","Min Leg","Cut L",null,"Frame Radius",{"$f":"IF(AND(SHAPEW>0,SHAPEH>0,DIM_4>0,SHAPE=114,EXTLINK>3),(((SHAPEW/2)^2+(SHAPEH-DIM_4)^2)/(2*(SHAPEH-DIM_4)))-OFFSET,IF(AND(SHAPEW>0,SHAPEH>0,DIM_4>0,SHAPE=114,EXTLINK<=3),(((SHAPEW/2)^2+(SHAPEH-DIM_4)^2)/(2*(SHAPEH-DIM_4))),0))","v":0},null,null,null,null,null,null,null,113,{"$f":"IF(SHAPE=$B$40,6,0)","v":0},{"$f":"IF(S46>0,\"Glass Height:\",0)","v":0},{"$f":"IF(S46>0,J42,0)","v":0},{"$f":"IF(AND(U48>0,U48<GlassMinH),1,0)","v":0},null,null,null,null,null,null,null,null,null,null,null,null,null,null,null,null,null,null,null,null,"New Cons. Gold/Silver","V-Series",1.8125,2.25]
[null,{"$f":"EXT","v":1},{"$f":"MIN_R","v":""},{"$f":"MAX_W","v":""},{"$f":"MAX_UI","v":""},{"$f":"MIN_LEG","v":""},{"$f":"CUT_LENGTH","v":""},null,"Glass Radius",{"$f":"IF(AND(SHAPEW>0,SHAPEH>0,DIM_4>0,EXTLINK>1,SHAPE=114),J48-GLASSOFFSET,0)","v":0},{"$f":"IF(AND(SHAPEW>0,SHAPEH>0,DIM_4>0,EXTLINK>1,SHAPE=114),J48-EXTOFFSET,0)","v":0},null,null,null,null,null,null,113,{"$f":"IF(SHAPE=$B$40,7,0)","v":0},{"$f":"IF(S47>0,\"Angle of Cut:\",0)","v":0},{"$f":"IF(S47>0,J44,0)","v":0},{"$f":"IF(AND(S49>0,U49<MIN_ANGLE),1,0)","v":0},null,null,null,null,null,null,null,null,null,null,null,null,null,null,null,null,null,null,null,null,"0700","SH2201",1,1.5369999999999999]
[null,null,{"$f":"IF(AND(SHAPEW>0,SHAPEH>0,SHAPE=B48,J48<C49),1,0)","v":0},{"$f":"IF(AND(SHAPEW>0,EXTLINK>1,SHAPEH>0,SHAPE=B48,OR(FW>D49,FH>D49)),1,0)","v":0},{"$f":"IF(AND(SHAPEW>0,EXTLINK>1,SHAPEH>0,SHAPE=B48,DIM_4>0,(FW+FH)>E49),1,0)","v":0},{"$f":"IF(AND(SHAPEW>0,SHAPEH>0,SHAPE=B48,DIM_4>0,J56<F49),1,0)","v":0},{"$f":"IF(AND(SHAPEW>0,SHAPE=B48,SHAPEH>0,OR(J53>G49,J54>G49)),1,0)","v":0},null,"Glass Height",{"$f":"IF(AND(SHAPEW>0,SHAPEH>0,DIM_4>0,EXTLINK>1,SHAPE=114),FH-(2*GLASSOFFSET),0)","v":0},{"$f":"IF(AND(SHAPEW>0,SHAPEH>0,DIM_4>0,EXTLINK>1,SHAPE=114),SHAPEH-(2*EXTOFFSET),0)","v":0},null,null,null,null,null,null,113,{"$f":"IF(SHAPE=$B$40,8,0)","v":0},{"$f":"IF(S48>0,\"Cut Length:\",0)","v":0},{"$f":"IF(S48>0,J45,0)","v":0},{"$f":"IF(AND(S50>0,G42>0),1,0)","v":0},null,null,null,null,null,null,null,null,null,null,null,null,null,null,null,null,null,null,null,null,"Casement/U.Maxx/8000/9000","PWFO1",1.125,1.5613999999999999]
[null,null,{"$f":"MAX(C50:G50)","v":0},{"$f":"IF(AND(SHAPE=B48,C51=1),1,0)","v":0},{"$f":"IF(AND(SHAPEW>0,SHAPEH>0,SHAPE=B48,(FH-J56)>=(FW/2)),1,0)","v":0},{"$f":"IF(AND(SHAPE=114,E51=1),\"FRAME HEIGHT MINUS DIM4 MUST BE LESS THAN 1/2 THE WIDTH\",IF(AND(SHAPE=114,SHAPEW>0,C50>0),\"RADIUS MUST BE GREATER THAN \"&C49,IF(AND(SHAPE=114,J51>0,J51<GlassMinW),\"Glass Width is Under Minimum\",IF(AND(SHAPE=114,J50>0,J50<GlassMinH),\"Glass Height is Under Minimum\",\"\"))))","v":""},null,null,"Glass Width",{"$f":"IF(AND(SHAPEW>0,SHAPEH>0,DIM_4>0,EXTLINK>1,SHAPE=114),FW-(2*GLASSOFFSET),0)","v":0},{"$f":"IF(AND(SHAPEW>0,SHAPEH>0,DIM_4>0,EXTLINK>1,SHAPE=114),FW-(2*EXTOFFSET),0)","v":0},null,null,null,null,null,null,113,{"$f":"IF(SHAPE=$B$40,9,0)","v":0},{"$f":"IF(S48>0,\"Min. Height:\",0)","v":0},{"$f":"IF(S49>0,H41,0)","v":0},{"$f":"IF(AND(S51>0,SHAPEH>0,H42>0),1,0)","v":0},null,null,null,null,null,null,null,null,null,null,null,null,null,null,null,null,null,null,null,null,"Geneva","PW3001",1.25,1.7849999999999999]
[null,null,null,null,null,null,null,null,"Glass Leg Height",{"$f":"IF(AND(SHAPEW>0,EXTLINK>1,DIM_4>0,SHAPE=114),J56-(GLASSOFFSET+L53),0)","v":0},{"$f":"IF(AND(SHAPEW>0,EXTLINK>1,DIM_4>0,SHAPE=114),J56-(EXTOFFSET+L54),0)","v":0},{"$f":"C53-C54","v":{"$error":"#DIV/0!"}},"Difference",null,null,null,null,113,{"$f":"IF(SHAPE=$B$40,10,0)","v":0},{"$f":"IF(S50>0,\"Max Width:\",0)","v":0},{"$f":"IF(S50>0,D41,0)","v":0},{"$f":"IF(AND(S52>0,SHAPEW>0,D42>0),1,0)","v":0},null,null,null,null,null,null,null,null,null,null,null,null,null,null,null,null,null,null,null,null,"Centurion",5336,1.375,1.915]
[null,null,{"$f":"IF(EXTLINK>3,((J48+OFFSET)*(COS((2*(ASIN(SHAPEW/(2*(J48+OFFSET)))))/2))),IF(EXTLINK<=3,(J48*(COS((2*(ASIN(SHAPEW/(2*J48))))/2))),0))","v":{"$error":"#DIV/0!"}},"d(Shape)",null,null,null,null,"Cut L @ Sill & Vert",{"$f":"IF(AND(SHAPEW>0,SHAPEH>0,DIM_4>0,EXTLINK>1,SHAPE=114),SQRT(EXTOFFSET^2+((FW-K51)/2)^2),0)","v":0},{"$f":"IF(AND(SHAPEW>0,SHAPEH>0,DIM_4>0,EXTLINK>1,SHAPE=114),SQRT(EXTOFFSET^2+((U54-K51)/2)^2),0)","v":0},{"$f":"C54-C55","v":{"$error":"#DIV/0!"}},"Difference",null,null,null,null,113,{"$f":"IF(SHAPE=$B$40,11,0)","v":0},{"$f":"IF(S51>0,\"Max UI:\",0)","v":0},{"$f":"IF(S51>0,E41,0)","v":0},{"$f":"IF(AND(S51>0,E42>0),1,0)","v":0},null,null,null,null,null,null,null,null,null,null,null,null,null,null,null,null,null,null,null,null,"Impact 3100","PI2101",2.125,2.4350000000000001]
[null,null,{"$f":"(J48*(COS((2*(ASIN(FW/(2*J48))))/2)))","v":{"$error":"#DIV/0!"}},"d(Frame)",null,null,null,null,"Cut L @ Leg & Arc:",{"$f":"IF(AND(SHAPEW>0,SHAPEH>0,DIM_4>0,EXTLINK>1,SHAPE=114),SQRT(EXTOFFSET^2+((J56-EXTOFFSET)-K52)^2),0)","v":0},null,{"$f":"C54-L55","v":{"$error":"#DIV/0!"}},"Difference",null,null,null,null,114,{"$f":"IF(SHAPE=$B$48,1,0)","v":0},{"$f":"IF(S54>0,\"Frame Width:\",0)","v":0},{"$f":"IF(AND(S54>0,EXTLINK>3),TRUNC((SHAPEW-(OFFSET*2))*16+0.5)/16,IF(AND(S54>0,EXTLINK>1,EXTLINK<=3),SHAPEW,0))","v":0},{"$f":"IF(AND(S54>0,D50>0),1,0)","v":0},null,null,null,null,null,null,null,null,null,null,null,null,null,null,null,null,null,null,null,null,"Geneva","PW3001",1.25,1.7849999999999999]
[null,null,{"$f":"(J49*COS((2*(ASIN(J51/(2*J49))))/2))","v":{"$error":"#DIV/0!"}},"d(Glass)",null,null,null,null,"Angle of Cut @ Leg & Arc:",{"$f":"IF(AND(SHAPEW>0,SHAPEH>0,DIM_4>0,EXTLINK>1,SHAPE=114),(DEGREES(ACOS(EXTOFFSET/J54)))+90,0)","v":0},null,{"$f":"((J48-EXTOFFSET)*(COS((2*(ASIN(K51/(2*(J48-EXTOFFSET)))))/2)))","v":-1.86},"d (Cut-1)",null,null,null,null,114,{"$f":"IF(SHAPE=$B$48,2,0)","v":0},{"$f":"IF(S55>0,\"Frame Height:\",0)","v":0},{"$f":"IF(AND(S55>0,EXTLINK>3),TRUNC((SHAPEH-(2*OFFSET))*16+0.5)/16,IF(AND(S55>0,EXTLINK>1,EXTLINK<=3),SHAPEH,0))","v":0},{"$f":"IF(AND(S55>0,OR(D50>0,E51>0)),1,0)","v":0},null,null,null,null,null,null,null,null,null,null,null,null,null,null,null,null,null,null,null,null,"Centurion",5336,1.375,1.915]
[null,null,null,null,null,null,null,null,"Frame Leg Height",{"$f":"IF(AND(SHAPEW>0,EXTLINK>1,DIM_4>0,SHAPE=114,EXTLINK>3),DIM_4-(OFFSET+L52),IF(AND(SHAPEW>0,EXTLINK>1,DIM_4>0,SHAPE=114,EXTLINK<=3),DIM_4,0))","v":0},null,null,null,null,null,null,null,114,{"$f":"IF(SHAPE=$B$48,3,0)","v":0},{"$f":"IF(S56>0,\"Frame Radius:\",0)","v":0},{"$f":"IF(S56>0,J48,0)","v":0},{"$f":"IF(AND(S56>0,C50>0),1,0)","v":0},null,null,null,null,null,null,null,null,null,null,null,null,null,null,null,null,null,null,null,null,"Impact 3100","PI2101",2.125,2.4350000000000001]
[null,null,null,null,null,null,null,null,null,null,null,null,null,null,null,null,null,114,{"$f":"IF(SHAPE=$B$48,4,0)","v":0},{"$f":"IF(S57>0,\"Frame Leg:\",0)","v":0},{"$f":"IF(S57>0,J56,0)","v":0},{"$f":"IF(AND(S57>0,F50>0),1,0)","v":0},null,null,null,null,null,null,"0201","11","20","52","84","132",null,null,null,null,null,null,null,null,"REGENCY Pi7301","PI7301",1.4375,1.86]
[null,115,"Min R","Max W","Min Leg","Max UI","Cut L","Max H","Min H",null,null,null,null,null,null,null,null,114,{"$f":"IF(SHAPE=$B$48,5,0)","v":0},{"$f":"IF(S58>0,\"Glass Radius:\",0)","v":0},{"$f":"IF(S58>0,J49,0)","v":0},null,null,null,null,null,null,null,"0202","18","9","84","72","148",null,null,null,null,null,null,null,null,"Excalibur / I-Series",3180,1.75,1.75]
[null,{"$f":"EXT","v":1},{"$f":"MIN_R","v":""},{"$f":"MAX_W","v":""},{"$f":"MIN_LEG","v":""},{"$f":"MAX_UI","v":""},{"$f":"CUT_LENGTH","v":""},{"$f":"MAX_H","v":""},{"$f":"MIN_H1","v":""},null,null,null,null,null,null,null,null,114,{"$f":"IF(SHAPE=$B$48,6,0)","v":0},{"$f":"IF(S59>0,\"Glass Width:\",0)","v":0},{"$f":"IF(S59>0,J51,0)","v":0},{"$f":"IF(AND(U59>0,U59<GlassMinW),1,0)","v":0},null,null,null,null,null,null,"0203","47.5","9","120","72","192"]
[null,null,{"$f":"IF(AND(SHAPEW>0,SHAPEH>0,SHAPE=B58,D62<C59),1,0)","v":0},{"$f":"IF(AND(SHAPEW>0,EXTLINK>1,SHAPE=B58,FW>D59),1,0)","v":0},{"$f":"IF(AND(SHAPEW>0,SHAPEH>0,SHAPE=B58,OR(FW<E59,FH<E59)),1,0)","v":0},{"$f":"IF(AND(SHAPEW>0,EXTLINK>1,SHAPEH>0,SHAPE=B58,(FW+FH)>F59),1,0)","v":0},{"$f":"IF(AND(SHAPEW>0,SHAPEH>0,SHAPE=B58,OR(H65>G59,H64>G59)),1,0)","v":0},{"$f":"IF(AND(SHAPEH>0,EXTLINK>1,SHAPE=115,FH>H59),1,0)","v":0},{"$f":"IF(AND(SHAPEH>0,EXTLINK>1,SHAPE=115,OR(FH<I59,FW<I59)),1,0)","v":0},null,null,null,null,null,null,null,null,114,{"$f":"IF(SHAPE=$B$48,7,0)","v":0},{"$f":"IF(S60>0,\"Glass Height:\",0)","v":0},{"$f":"IF(S60>0,J50,0)","v":0},{"$f":"IF(AND(U60>0,U60<GlassMinH),1,0)","v":0},null,null,null,null,null,null,"0204",9,"9","112","96","154"]
[null,null,{"$f":"MAX(C60:I60)","v":0},{"$f":"IF(AND(SHAPE=B58,C61=1),1,0)","v":0},{"$f":"IF(AND(SHAPEW>0,SHAPEH>0,SHAPEH=SHAPEW),1,0)","v":0},{"$f":"IF(AND(SHAPE=115,E61=1),\"THIS IS A QUARTER ROUND\",IF(AND(SHAPE=115,SHAPEW>0,C60>0),\"RADIUS MUST BE GREATER THAN \"&C59,IF(AND(SHAPE=115,D65>0,D65<GlassMinW),\"Glass Width is Under Minimum\",IF(AND(SHAPE=115,D64>0,D64<GlassMinH),\"Glass Height is Under Minimum\",\"\"))))","v":""},null,null,null,null,null,null,null,null,null,null,null,114,{"$f":"IF(SHAPE=$B$48,8,0)","v":0},{"$f":"IF(S61>0,\"Glass Leg:\",0)","v":0},{"$f":"IF(S61>0,J52,0)","v":0},null,null,null,null,null,null,null,"0209","37.25","9","120","72","192"]
[null,null,"Frame Radius",{"$f":"IF(AND(SHAPEW>0,SHAPEH>0,EXTLINK>1,SHAPE=115),FRADIUS115,0)","v":0},null,null,null,null,null,null,null,null,null,null,null,null,null,114,{"$f":"IF(SHAPE=$B$48,9,0)","v":0},{"$f":"IF(S62>0,\"Angle @ Sill & Leg:\",0)","v":0},{"$f":"IF(S62>0,45,0)","v":0},null,null,null,null,null,null,null,"02A0","11","20","52","84","132"]
[null,null,"Glass Radius",{"$f":"IF(AND(SHAPEW>0,SHAPEH>0,EXTLINK>1,SHAPE=115),GRADIUS115,0)","v":0},{"$f":"IF(AND(SHAPEW>0,SHAPEH>0,EXTLINK>1,SHAPE=115),ERADIUS115,0)","v":0},null,"Cut Angle",{"$f":"IF(AND(SHAPEW>0,SHAPEH>0,EXTLINK>1,SHAPE=115),90-(DEGREES(ACOS(EXTOFFSET/H65))),0)","v":0},null,null,null,null,null,null,null,null,null,114,{"$f":"IF(SHAPE=$B$48,10,0)","v":0},{"$f":"IF(S63>0,\"Cut L @ Sill & Leg:\",0)","v":0},{"$f":"IF(S63>0,J53,0)","v":0},{"$f":"IF(AND(S63>0,J53>CUT_LENGTH),1,0)","v":0},null,null,null,null,null,null,"02A2","18","12","84","66","148"]
[null,null,"Glass Height",{"$f":"IF(AND(SHAPEW>0,SHAPEH>0,EXTLINK>1,SHAPE=115),FH-(Data!O19+GLASSOFFSET),0)","v":0},{"$f":"IF(AND(SHAPEW>0,SHAPEH>0,EXTLINK>1,SHAPE=115),FH-(Data!V19+EXTOFFSET),0)","v":0},null,"CUT Length",{"$f":"IF(AND(SHAPEW>0,SHAPEH>0,EXTLINK>1,SHAPE=115),SQRT(EXTOFFSET^2+(Data!W19-Data!I19)^2),0)","v":0},null,null,null,null,null,null,null,null,null,114,{"$f":"IF(SHAPE=$B$48,11,0)","v":0},{"$f":"IF(S64>0,\"Angle @ Leg & Arc:\",0)","v":0},{"$f":"IF(S64>0,J55,0)","v":0},{"$f":"IF(AND(S64>0,J55<MIN_ANGLE),1,0)","v":0},null,null,null,null,null,null,"02A3","46","12","116","66","182"]
[null,null,"Glass Width",{"$f":"IF(AND(SHAPEW>0,SHAPEH>0,EXTLINK>1,SHAPE=115),FW-(Data!P19+GLASSOFFSET),0)","v":0},{"$f":"IF(AND(SHAPEW>0,SHAPEH>0,EXTLINK>1,SHAPE=115),FW-(Data!W19+EXTOFFSET),0)","v":0},null,"Cut L @ Peak",{"$f":"IF(AND(SHAPEW>0,SHAPEH>0,EXTLINK>1,SHAPE=115),SQRT(EXTOFFSET^2+(Data!V19-Data!H19)^2),0)","v":0},null,null,null,null,null,null,null,null,null,114,{"$f":"IF(SHAPE=$B$48,12,0)","v":0},{"$f":"IF(S65>0,\"Cut L @ Leg & Arc:\",0)","v":0},{"$f":"IF(S65>0,J54,0)","v":0},{"$f":"IF(AND(S63>0,J54>CUT_LENGTH),1,0)","v":0},null,null,null,null,null,null,"02A4","9","9","96","96","154"]
[null,null,"Frame Width",{"$f":"IF(AND(SHAPEW>0,SHAPEH>0,SHAPE=115,EXTLINK>3),TRUNC((SHAPEW-(Data!I19+OFFSET))*16+0.5)/16,IF(AND(SHAPEW>0,SHAPEH>0,SHAPE=115,EXTLINK<=3),SHAPEW,0))","v":0},null,null,"Cut Angle @ Peak",{"$f":"IF(AND(SHAPEW>0,SHAPEH>0,EXTLINK>1,SHAPE=115),90-(DEGREES(ACOS(EXTOFFSET/H64))),0)","v":0},null,null,null,null,null,null,null,null,null,114,{"$f":"IF(SHAPE=$B$48,13,0)","v":0},{"$f":"IF(S66>0,\"Max Width:\",0)","v":0},{"$f":"IF(S66>0,D49,0)","v":0},{"$f":"IF(AND(S66>0,FW>U66),1,0)","v":0},null,null,null,null,null,null,"02A9","37.25","12",120,"66","182"]
[null,null,"Frame Height",{"$f":"IF(AND(SHAPEW>0,SHAPEH>0,SHAPE=115,EXTLINK>3),TRUNC((SHAPEH-(Data!H19+OFFSET))*16+0.5)/16,IF(AND(SHAPEW>0,SHAPEH>0,SHAPE=115,EXTLINK<=3),SHAPEH,0))","v":0},null,null,"Difference Glass",{"$f":"IF(AND(SHAPEW>0,SHAPEH>0,EXTLINK>1,SHAPE=115,EXTLINK>3),D63-(D63*(COS((2*(ASIN(((OFFSET)*2)/(2*D63))))/2))),IF(AND(SHAPEW>0,SHAPEH>0,EXTLINK>1,SHAPE=115,EXTLINK<=3),D63-(D63*(COS((2*(ASIN((GLASSOFFSET*2)/(2*D63))))/2))),0))","v":0},null,null,null,null,null,null,null,null,null,114,{"$f":"IF(SHAPE=$B$48,14,0)","v":0},{"$f":"IF(S67>0,\"Max Height:\",0)","v":0},{"$f":"IF(S67>0,D49,0)","v":0},{"$f":"IF(AND(S67>0,FH>U67),1,0)","v":0},null,null,null,null,null,null,"0301","14.25","25.25","48","78","126"]
[null,null,null,null,null,null,"Difference Cut",{"$f":"IF(AND(SHAPEW>0,SHAPEH>0,EXTLINK>1,SHAPE=115),E63-(E63*(COS((2*(ASIN(((OFFSET+EXTOFFSET)*2)/(2*E63))))/2))),0)","v":0},null,null,null,null,null,null,null,null,null,114,{"$f":"IF(SHAPE=$B$48,15,0)","v":0},{"$f":"IF(S68>0,\"Max UI:\",0)","v":0},{"$f":"IF(S68>0,E49,0)","v":0},{"$f":"IF(AND(S68>0,E50>0),1,0)","v":0},null,null,null,null,null,null,"3001 Comp.",12,"20",48,84,126]
[null,null,null,null,null,null,null,null,null,null,null,null,null,null,null,null,null,115,{"$f":"IF(SHAPE=$B$58,1,0)","v":0},{"$f":"IF(S69>0,\"Frame Width:\",0)","v":0},{"$f":"IF(S69>0,D66,0)","v":0},{"$f":"IF(AND(S69>0,D60>0),1,0)","v":0},null,null,null,null,null,null,"3001 Steel",12,"20","52",96,148]
[null,null,null,null,null,null,null,null,null,null,null,null,null,null,null,null,null,115,{"$f":"IF(SHAPE=$B$58,2,0)","v":0},{"$f":"IF(S70>0,\"Frame Height:\",0)","v":0},{"$f":"IF(S70>0,D67,0)","v":0},{"$f":"IF(AND(S70>0,OR(H60>0,I60>0)),1,0)","v":0},null,null,null,null,null,null,"3002 Comp.",18.5,11.25,72,56,128]
[null,116,"Min R","Max W","Max UI","Cut L","Dim. 4",null,null,null,null,null,null,null,null,null,null,115,{"$f":"IF(SHAPE=$B$58,3,0)","v":0},{"$f":"IF(S71>0,\"Frame Radius:\",0)","v":0},{"$f":"IF(S71>0,D62,0)","v":0},{"$f":"IF(AND(S71>0,C60>0),1,0)","v":0},null,null,null,null,null,null,"3002 Steel",18.5,11.25,"84","72",156]
[null,{"$f":"EXT","v":1},{"$f":"MIN_R","v":""},{"$f":"MAX_W","v":""},{"$f":"MAX_UI","v":""},{"$f":"CUT_LENGTH","v":""},{"$f":"MIN_LEG","v":""},null,null,null,null,null,null,null,null,null,null,115,{"$f":"IF(SHAPE=$B$58,4,0)","v":0},{"$f":"IF(S72>0,\"Glass Radius:\",0)","v":0},{"$f":"IF(S72>0,D63,0)","v":0},null,null,null,null,null,null,null,"3003 Comp.",47.5,11.25,108,56,164]
[null,null,{"$f":"IF(AND(SHAPEW>0,SHAPEH>0,SHAPE=116,D76<C72),1,0)","v":0},{"$f":"IF(AND(SHAPEW>0,EXTLINK>1,SHAPE=116,FW>D72),1,0)","v":0},{"$f":"IF(AND(SHAPEW>0,SHAPEH>0,EXTLINK>1,SHAPE=116,(FW+FH)>E72),1,0)","v":0},{"$f":"IF(AND(SHAPEW>0,SHAPEH>0,SHAPE=116,H78>F72),1,0)","v":0},{"$f":"IF(AND(SHAPEW>0,SHAPE=B71,H79<G72),1,0)","v":0},null,null,null,null,null,null,null,null,null,null,115,{"$f":"IF(SHAPE=$B$58,5,0)","v":0},{"$f":"IF(S73>0,\"Glass Width:\",0)","v":0},{"$f":"IF(S73>0,D65,0)","v":0},{"$f":"IF(AND(U73>0,U73<GlassMinW),1,0)","v":0},null,null,null,null,null,null,"3003 Steel",47.5,11.25,120,72,"192"]
[null,null,{"$f":"MAX(C73:G73)","v":0},{"$f":"IF(AND(SHAPE=B71,C74=1),1,0)","v":0},null,{"$f":"IF(AND(SHAPE=116,SHAPEW>0,C73>0),\"RADIUS MUST BE GREATER THAN \"&C72,IF(AND(SHAPE=116,D79>0,D79<GlassMinW),\"Glass Width is Under Minimum\",IF(AND(SHAPE=116,D78>0,D78<GlassMinH),\"Glass Height is Under Minimum\",IF(AND(SHAPE=116,SHAPEW>0,SHAPEH>0,DIM_4>0,SHAPEW=(SHAPEH-DIM_4)),\"This is a 1/4 Round with Extended Leg\",\"\"))))","v":""},null,null,null,null,null,null,null,null,null,null,null,115,{"$f":"IF(SHAPE=$B$58,6,0)","v":0},{"$f":"IF(S74>0,\"Glass Height:\",0)","v":0},{"$f":"IF(S74>0,D64,0)","v":0},{"$f":"IF(AND(U74>0,U74<GlassMinH),1,0)","v":0},null,null,null,null,null,null,3004,9.5,9.5,"112","96",154]
[null,null,null,null,null,null,null,null,null,null,null,null,null,null,null,null,null,115,{"$f":"IF(SHAPE=$B$58,7,0)","v":0},{"$f":"IF(S75>0,\"Angle @ Sill & Arc:\",0)","v":0},{"$f":"IF(S75>0,H66,0)","v":0},{"$f":"IF(AND(S75>0,OR(H63<MIN_ANGLE,H66<MIN_ANGLE)),1,0)","v":0},null,null,null,null,null,null,"3009 Comp.",37.25,11.25,108,56,164]
[null,null,"Frame Radius",{"$f":"IF(AND(SHAPEW>0,SHAPEH>0,EXTLINK>1,DIM_4>0,SHAPE=116),FRADIUS116,0)","v":0},null,null,"Angle @ Peak",{"$f":"IF(AND(SHAPEW>0,SHAPEH>0,DIM_4>0,EXTLINK>1,SHAPE=116),DEGREES(ASIN(EXTOFFSET/H78)),0)","v":0},null,null,null,null,null,null,null,null,null,115,{"$f":"IF(SHAPE=$B$58,8,0)","v":0},{"$f":"IF(S76>0,\"Cut L @ Sill & Arc:\",0)","v":0},{"$f":"IF(S76>0,H64,0)","v":0},{"$f":"IF(AND(S76>0,SHAPE=114,G60>0),1,0)","v":0},null,null,null,null,null,null,"3009 Steel",37.25,11.25,120,72,"192"]
[null,null,"Glass Radius",{"$f":"IF(AND(SHAPEW>0,SHAPEH>0,EXTLINK>1,DIM_4>0,SHAPE=116),GRADIUS116,0)","v":0},null,null,"Cut L @ Sill & Vert",{"$f":"IF(AND(SHAPEW>0,SHAPEH>0,EXTLINK>1,DIM_4>0,SHAPE=116),SQRT(EXTOFFSET^2+EXTOFFSET^2),0)","v":0},null,null,null,null,null,null,null,null,null,115,{"$f":"IF(SHAPE=$B$58,9,0)","v":0},{"$f":"IF(S77>0,\"Angle @ Peak:\",0)","v":0},{"$f":"IF(S77>0,H63,0)","v":0},{"$f":"IF(AND(S77>0,OR(H63<MIN_ANGLE,H66<MIN_ANGLE)),1,0)","v":0},null,null,null,null,null,null,"0614","13","13","96","84","154"]
[null,null,"Glass Height",{"$f":"IF(AND(SHAPEW>0,SHAPEH>0,EXTLINK>1,DIM_4>0,SHAPE=116),FH-(GLASSOFFSET+Data!N29),0)","v":0},null,null,"Cut L @ Peak",{"$f":"IF(AND(SHAPEH>0,EXTLINK>1,DIM_4>0,SHAPE=116),SQRT(EXTOFFSET^2+Data!S29^2),0)","v":0},null,null,null,null,null,null,null,null,null,115,{"$f":"IF(SHAPE=$B$58,10,0)","v":0},{"$f":"IF(S78>0,\"Cut L @ Peak:\",0)","v":0},{"$f":"IF(S78>0,H65,0)","v":0},{"$f":"IF(AND(S78>0,G60>0),1,0)","v":0},null,null,null,null,null,null,"0700","14.375","23.75","52",72,120]
[null,null,"Glass Width",{"$f":"IF(AND(SHAPEW>0,SHAPEH>0,EXTLINK>1,DIM_4>0,SHAPE=116),Data!J29,0)","v":0},null,null,"Frame Leg:",{"$f":"IF(AND(SHAPEW>0,SHAPE=B71,DIM_4>0,EXTLINK>1),TRUNC((Data!F29)*16+0.5)/16,0)","v":0},null,null,null,null,null,null,null,null,null,115,{"$f":"IF(SHAPE=$B$58,11,0)","v":0},{"$f":"IF(S79>0,\"Min Height:\",0)","v":0},{"$f":"IF(S79>0,I59,0)","v":0},{"$f":"IF(AND(S79>0,SHAPEW>0,I60>0),1,0)","v":0},null,null,null,null,null,null,"0701","14.375","35.5","52","108","156"]
[null,null,"Glass Leg Height",{"$f":"IF(AND(SHAPEW>0,SHAPE=116,DIM_4>0,EXTLINK>1),Data!L29,0)","v":0},null,null,null,null,null,null,null,null,null,null,null,null,null,115,{"$f":"IF(SHAPE=$B$58,12,0)","v":0},{"$f":"IF(S80>0,\"Max Width:\",0)","v":0},{"$f":"IF(S80>0,D59,0)","v":0},{"$f":"IF(AND(S80>0,D60>0),1,0)","v":0},null,null,null,null,null,null,"0702","23.5","14.25","72","60","132"]
[null,null,"Frame Width:",{"$f":"IF(AND(SHAPEW>0,SHAPE=116,DIM_4>0,EXTLINK>3),TRUNC((SHAPEW-(OFFSET*2))*16+0.5)/16,IF(AND(SHAPEW>0,SHAPE=116,DIM_4>0,EXTLINK<=3),SHAPEW,0))","v":0},null,null,null,null,null,null,null,null,null,null,null,null,null,115,{"$f":"IF(SHAPE=$B$58,13,0)","v":0},{"$f":"IF(S81>0,\"Max Height:\",0)","v":0},{"$f":"IF(S81>0,H59,0)","v":0},{"$f":"IF(AND(S81>0,H60),1,0)","v":0},null,null,null,null,null,null,"0703","48","14.25","108","60","168"]
[null,null,"Frame Height:",{"$f":"IF(AND(SHAPEW>0,SHAPEH>0,DIM_4>0,SHAPE=116,EXTLINK>3),TRUNC((SHAPEH-(OFFSET+Data!H29))*16+0.5)/16,IF(AND(SHAPEW>0,SHAPEH>0,DIM_4>0,SHAPE=116,EXTLINK<=3),SHAPEH,0))","v":0},null,null,null,null,null,null,null,null,null,null,null,null,null,115,{"$f":"IF(SHAPE=$B$58,14,0)","v":0},{"$f":"IF(S82>0,\"Max UI:\",0)","v":0},{"$f":"IF(S82>0,F59,0)","v":0},{"$f":"IF(AND(S82>0,F60>0),1,0)","v":0},null,null,null,null,null,null,"0704","12","12",96,"84","154"]
[null,null,null,null,null,null,null,null,null,null,null,null,null,null,null,null,null,116,{"$f":"IF(SHAPE=$B$71,1,0)","v":0},{"$f":"IF(S83>0,\"Frame Width:\",0)","v":0},{"$f":"IF(S83>0,D81,0)","v":0},{"$f":"IF(AND(S83>0,FW>D72),1,0)","v":0},null,null,null,null,null,null,"0709","34.75","14.25","108","60","168"]
[null,117,"Min R","Max W","Max UI",null,null,"Frame Width:",{"$f":"IF(AND(SHAPEW>0,SHAPEH>0,EXTLINK>1,SHAPE=117),TRUNC((Data!I36)*16+0.5)/16,0)","v":0},null,null,null,null,null,null,null,null,116,{"$f":"IF(SHAPE=$B$71,2,0)","v":0},{"$f":"IF(S84>0,\"Frame Height:\",0)","v":0},{"$f":"IF(S84>0,D82,0)","v":0},{"$f":"IF(AND(S84>0,FH>D72),1,0)","v":0},null,null,null,null,null,null,"07HP","14.375","23.75","52","77","129"]
[null,{"$f":"EXT","v":1},{"$f":"MIN_R","v":""},{"$f":"MAX_W","v":""},{"$f":"MAX_UI","v":""},null,null,"Frame Height:",{"$f":"IF(AND(SHAPEW>0,SHAPEH>0,EXTLINK>1,SHAPE=117),TRUNC((Data!J36)*16+0.5)/16,0)","v":0},null,null,null,null,null,null,null,null,116,{"$f":"IF(SHAPE=$B$71,3,0)","v":0},{"$f":"IF(S85>0,\"Frame Radius:\",0)","v":0},{"$f":"IF(S85>0,D76,0)","v":0},{"$f":"IF(AND(S85>0,C73>0),1,0)","v":0},null,null,null,null,null,null,"0901","15","22","48","84","132"]
[null,null,{"$f":"IF(AND(SHAPEW>0,SHAPEH>0,SHAPE=B84,OR(I86<C85,I87<C85)),1,0)","v":0},{"$f":"IF(AND(SHAPEW>0,EXTLINK>1,SHAPE=B84,FW>D85),1,0)","v":0},{"$f":"IF(AND(SHAPEW>0,SHAPEH>0,EXTLINK>1,SHAPE=B84,(FW+FH)>E85),1,0)","v":0},null,null,"Frame Major R:",{"$f":"IF(AND(SHAPEW>0,SHAPEH>0,EXTLINK>1,SHAPE=117),Data!K36,0)","v":0},null,null,null,null,null,null,null,null,116,{"$f":"IF(SHAPE=$B$71,4,0)","v":0},{"$f":"IF(S86>0,\"Frame Leg:\",0)","v":0},{"$f":"IF(S86>0,H79,0)","v":0},{"$f":"IF(AND(S86>0,G73>0),1,0)","v":0},null,null,null,null,null,null,"0902","21.5","15.5","84",66,"148"]
[null,null,{"$f":"MAX(C86:F86)","v":0},{"$f":"IF(AND(SHAPE=B84,C87=1),1,0)","v":0},{"$f":"IF(AND(SHAPEW>0,SHAPEH>0,EXTLINK>1,SHAPE=117,SHAPEH>=SHAPEW/2),1,0)","v":0},{"$f":"IF(AND(SHAPE=117,SHAPEW>0,C86>0),\"RADIUS MUST BE GREATER THAN \"&C85,IF(AND(SHAPE=117,J91>0,J91<GlassMinW),\"Glass Width is Under Minimum\",IF(AND(SHAPE=117,J92>0,J92<GlassMinH),\"Glass Height is Under Minimum\",\"\")))","v":""},null,"Frame Minor R:",{"$f":"IF(AND(SHAPEW>0,SHAPEH>0,EXTLINK>1,SHAPE=117),Data!L36,0)","v":0},null,null,null,null,null,null,null,null,116,{"$f":"IF(SHAPE=$B$71,5,0)","v":0},{"$f":"IF(S87>0,\"Glass Radius:\",0)","v":0},{"$f":"IF(S87>0,D77,0)","v":0},null,null,null,null,null,null,null,"0903","39.75","15.5","108","66","164"]
[null,null,null,null,null,null,null,"Glass Width:",{"$f":"IF(AND(SHAPEW>0,SHAPEH>0,EXTLINK>1,SHAPE=117),Data!M36,0)","v":0},null,null,null,null,null,null,null,null,116,{"$f":"IF(SHAPE=$B$71,6,0)","v":0},{"$f":"IF(S88>0,\"Glass Width:\",0)","v":0},{"$f":"IF(S88>0,D79,0)","v":0},{"$f":"IF(AND(U88>0,U88<GlassMinW),1,0)","v":0},null,null,null,null,null,null,"0907","12","12","37","37",61]
[null,null,null,null,null,null,null,"Glass Height:",{"$f":"IF(AND(SHAPEW>0,SHAPEH>0,EXTLINK>1,SHAPE=117),Data!N36,0)","v":0},null,null,null,null,null,null,null,null,116,{"$f":"IF(SHAPE=$B$71,7,0)","v":0},{"$f":"IF(S89>0,\"Glass Height:\",0)","v":0},{"$f":"IF(S89>0,D78,0)","v":0},{"$f":"IF(AND(U89>0,U89<GlassMinH),1,0)","v":0},null,null,null,null,null,null,"0909","30.25","15.5","120","66","164"]
[null,null,null,null,null,null,null,"Glass Major R:",{"$f":"IF(AND(SHAPEW>0,SHAPEH>0,EXTLINK>1,SHAPE=117),Data!O36,0)","v":0},null,null,null,null,null,null,null,null,116,{"$f":"IF(SHAPE=$B$71,8,0)","v":0},{"$f":"IF(S90>0,\"Glass Leg:\",0)","v":0},{"$f":"IF(S90>0,D80,0)","v":0},null,null,null,null,null,null,null,"0914","14.5","13","96","84","154"]
[null,null,null,null,null,null,null,"Glass Minor R:",{"$f":"IF(AND(SHAPEW>0,SHAPEH>0,EXTLINK>1,SHAPE=117),Data!P36,0)","v":0},null,null,null,null,null,null,null,null,116,{"$f":"IF(SHAPE=$B$71,9,0)","v":0},{"$f":"IF(S91>0,\"Angle @ Peak:\",0)","v":0},{"$f":"IF(S91>0,H76,0)","v":0},null,null,null,null,null,null,null,"0951","19","16","48","48","96"]
[null,null,null,null,null,null,null,null,null,null,null,null,null,null,null,null,null,116,{"$f":"IF(SHAPE=$B$71,10,0)","v":0},{"$f":"IF(S92>0,\"Cut L @ Peak:\",0)","v":0},{"$f":"IF(S92>0,H78,0)","v":0},{"$f":"IF(AND(S92>0,H78>10.25),1,0)","v":0},null,null,null,null,null,null,"0952","19","32","48","96","144"]
[null,null,null,null,null,null,null,null,null,null,null,null,null,null,null,null,null,116,{"$f":"IF(SHAPE=$B$71,11,0)","v":0},{"$f":"IF(S93>0,\"Max Width:\",0)","v":0},{"$f":"IF(S93>0,D72,0)","v":0},{"$f":"IF(AND(S93>0,SHAPEW>0,SHAPEW>U93),1,0)","v":0},null,null,null,null,null,null,"0953","19","48","48","96","144"]
[null,118,"Min R","Max W","Max UI",null,null,null,null,null,null,null,null,null,null,null,null,116,{"$f":"IF(SHAPE=$B$71,12,0)","v":0},{"$f":"IF(S94>0,\"Max Height:\",0)","v":0},{"$f":"IF(S94>0,D72,0)","v":0},{"$f":"IF(AND(S94>0,SHAPEH>0,SHAPEH>U94),1,0)","v":0},null,null,null,null,null,null,"0954","19","32","48","96","144"]
[null,{"$f":"EXT","v":1},{"$f":"MIN_R","v":""},{"$f":"MAX_W","v":""},{"$f":"MAX_UI","v":""},null,null,"Frame Height:",{"$f":"IF(AND(SHAPEW>0,EXTLINK>1,SHAPE=118,EXTLINK<=3),SHAPEW,IF(AND(SHAPEW>0,SHAPE=118,EXTLINK>3),TRUNC((SHAPEW-(OFFSET*2))*16+0.5)/16,0))","v":0},null,null,null,null,null,null,null,null,116,{"$f":"IF(SHAPE=$B$71,13,0)","v":0},{"$f":"IF(S95>0,\"Max UI:\",0)","v":0},{"$f":"IF(S95>0,E72,0)","v":0},{"$f":"IF(AND(S95>0,E73>0),1,0)","v":0},null,null,null,null,null,null,"0955","19","32","48","96","144"]
[null,null,{"$f":"IF(AND(SHAPEW>0,SHAPE=118,(FW/2)<C95),1,0)","v":0},{"$f":"IF(AND(SHAPEW>0,EXTLINK>1,SHAPE=118,FW>D95),1,0)","v":0},{"$f":"IF(AND(SHAPEW>0,SHAPE=118,EXTLINK>1,(FW+FH)>E95),1,0)","v":0},null,null,"Glass Width:",{"$f":"IF(AND(SHAPEW>0,EXTLINK>1,SHAPE=118),I95-(GLASSOFFSET*2),0)","v":0},null,null,null,null,null,null,null,null,117,{"$f":"IF(SHAPE=$B$84,1,0)","v":0},{"$f":"IF(S96>0,\"Frame Width:\",0)","v":0},{"$f":"IF(S96>0,FW,0)","v":0},{"$f":"IF(AND(S96>0,U96>D85),1,0)","v":0}]
[null,null,{"$f":"MAX(C96:F96)","v":0},{"$f":"IF(AND(SHAPE=B94,C97=1),1,0)","v":0},null,{"$f":"IF(AND(SHAPE=118,SHAPEW>0,C96>0),\"RADIUS MUST BE GREATER THAN\"&\" \"&C95,IF(AND(SHAPE=118,SHAPEW>0,SHAPEH>0,SHAPEW<>SHAPEH),\"WIDTH AND HEIGHT MUST BE EQUAL\",IF(AND(SHAPE=118,I96>0,I96<GlassMinW),\"Glass Width is Under Minimum\",IF(AND(SHAPE=118,I97>0,I97<GlassMinH),\"Glass Height is Under Minimum\",\"\"))))","v":""},null,"Glass Height:",{"$f":"IF(AND(SHAPEW>0,EXTLINK>1,SHAPE=118),I95-(GLASSOFFSET*2),0)","v":0},null,null,null,null,null,null,null,null,117,{"$f":"IF(SHAPE=$B$84,2,0)","v":0},{"$f":"IF(S97>0,\"Frame Height:\",0)","v":0},{"$f":"IF(S97>0,FH,0)","v":0}]
[null,null,null,null,null,null,null,"Frame Radius:",{"$f":"IF(AND(SHAPEW>0,EXTLINK>1,SHAPE=118),I95/2,0)","v":0},null,null,null,null,null,null,null,null,117,{"$f":"IF(SHAPE=$B$84,3,0)","v":0},{"$f":"IF(S98>0,\"Frame Major R:\",0)","v":0},{"$f":"IF(S98>0,I86,0)","v":0},{"$f":"IF(AND(S98>0,U98<C85),1,0)","v":0}]
[null,null,null,null,null,null,null,"Glass Radius:",{"$f":"IF(AND(SHAPEW>0,EXTLINK>1,SHAPE=118),(I96/2),0)","v":0},null,null,null,null,null,null,null,null,117,{"$f":"IF(SHAPE=$B$84,4,0)","v":0},{"$f":"IF(S99>0,\"Frame Minor R:\",0)","v":0},{"$f":"IF(S99>0,I87,0)","v":0},{"$f":"IF(AND(S99>0,U99<C85),1,0)","v":0}]
[null,null,null,null,null,null,null,null,null,null,null,null,null,null,null,null,null,117,{"$f":"IF(SHAPE=$B$84,5,0)","v":0},{"$f":"IF(S100>0,\"Glass Major R:\",0)","v":0},{"$f":"IF(S100>0,I90,0)","v":0}]
[null,null,null,null,null,null,null,null,null,null,null,null,null,null,null,null,null,117,{"$f":"IF(SHAPE=$B$84,6,0)","v":0},{"$f":"IF(S101>0,\"Glass Minor R:\",0)","v":0},{"$f":"IF(S101>0,I91,0)","v":0}]
[null,null,null,null,null,null,null,null,null,null,null,null,null,null,null,null,null,117,{"$f":"IF(SHAPE=$B$84,7,0)","v":0},{"$f":"IF(S102>0,\"Glass Width:\",0)","v":0},{"$f":"IF(S102>0,I88,0)","v":0},{"$f":"IF(AND(U102>0,U102<GlassMinW),1,0)","v":0}]
[null,119,"Min R","Max W","Max H","Max UI","Max sq.ft",null,null,null,null,null,null,null,null,null,null,117,{"$f":"IF(SHAPE=$B$84,8,0)","v":0},{"$f":"IF(S103>0,\"Glass Height:\",0)","v":0},{"$f":"IF(S103>0,I89,0)","v":0},{"$f":"IF(AND(U103>0,U103<GlassMinH),1,0)","v":0},null,null,null,null,null,null,"09A1","15","22","48","84","132"]
[null,{"$f":"EXT","v":1},{"$f":"MIN_R","v":""},{"$f":"MAX_W","v":""},{"$f":"MAX_H","v":""},{"$f":"MAX_UI","v":""},{"$f":"MAX_SF","v":""},null,null,null,null,null,null,null,null,null,null,117,{"$f":"IF(SHAPE=$B$84,9,0)","v":0},{"$f":"IF(S104>0,\"Max Width:\",0)","v":0},{"$f":"IF(S104>0,D85,0)","v":0},{"$f":"IF(AND(S104>0,SHAPEW>0,FW>U104),1,0)","v":0},null,null,null,null,null,null,"09A2","21.5","15.5","84","66","148"]
[null,null,{"$f":"IF(AND(SHAPEW>0,SHAPE=119,OR(D110<C104,D111<C104)),1,0)","v":0},{"$f":"IF(AND(SHAPEW>0,EXTLINK>1,SHAPE=119,FW>D104),1,0)","v":0},{"$f":"IF(AND(SHAPEH>0,EXTLINK>1,SHAPE=119,FH>E104),1,0)","v":0},{"$f":"IF(AND(SHAPEW>0,SHAPEH>0,SHAPE=119,EXTLINK>1,(FW8+FH)>F104),1,0)","v":0},{"$f":"IF(AND(SHAPEW>0,SHAPEH>0,SHAPE=119,EXTLINK>1,((FW*FH)/144)>G104),1,0)","v":0},null,null,null,null,null,null,null,null,null,null,117,{"$f":"IF(SHAPE=$B$84,10,0)","v":0},{"$f":"IF(S105>0,\"Max UI:\",0)","v":0},{"$f":"IF(S105>0,E85,0)","v":0},{"$f":"IF(AND(S105>0,E86>0),1,0)","v":0},null,null,null,null,null,null,"09A3","39.75","15.5","108","66","164"]
[null,null,{"$f":"MAX(C105:G105)","v":0},{"$f":"IF(AND(SHAPE=B103,C106=1),1,0)","v":0},null,{"$f":"IF(AND(SHAPE=119,SHAPEW>0,C105>0),\"RADIUS MUST BE GREATER THAN \"&C104,IF(AND(SHAPE=119,SHAPEW>0,SHAPEH>0,SHAPEW=SHAPEH),\"THIS IS A CIRCLE\",IF(AND(SHAPE=119,U118>0,U118<GlassMinW),\"Glass Width is Under Minimum\",IF(AND(SHAPE=119,U119>0,U119<GlassMinH),\"Glass Height is Under Minimum\",\"\"))))","v":""},null,null,null,null,null,null,null,null,null,null,null,118,{"$f":"IF(SHAPE=$B$94,1,0)","v":0},{"$f":"IF(S106>0,\"Frame Width:\",0)","v":0},{"$f":"IF(S106>0,FW,0)","v":0},null,null,null,null,null,null,null,"09A7","12","12","37","37",61]
[null,null,null,null,null,null,null,null,null,null,null,null,null,null,null,null,null,118,{"$f":"IF(SHAPE=$B$94,2,0)","v":0},{"$f":"IF(S107>0,\"Frame Height:\",0)","v":0},{"$f":"IF(S107>0,FH,0)","v":0},null,null,null,null,null,null,null,"09A9","30.25","15.5","120","66","164"]
[null,null,"Frame Width:",{"$f":"IF(AND(SHAPEW>0,SHAPEH>0,EXTLINK>1,SHAPE=119),TRUNC((Data!I44)*16+0.5)/16,0)","v":0},null,"Glass Width:",{"$f":"IF(AND(SHAPEW>0,SHAPEH>0,EXTLINK>1,SHAPE=119),Data!M44,0)","v":0},null,null,null,null,null,null,null,null,null,null,118,{"$f":"IF(SHAPE=$B$94,3,0)","v":0},{"$f":"IF(S108>0,\"Frame Radius:\",0)","v":0},{"$f":"IF(S108>0,I98,0)","v":0},{"$f":"IF(AND(S108>0,C96>0),1,0)","v":0},null,null,null,null,null,null,"09B1","15","22","48","84","132"]
[null,null,"Frame Height:",{"$f":"IF(AND(SHAPEW>0,SHAPEH>0,EXTLINK>1,SHAPE=119),TRUNC((Data!J44)*16+0.5)/16,0)","v":0},null,"Glass Height:",{"$f":"IF(AND(SHAPEW>0,SHAPEH>0,EXTLINK>1,SHAPE=119),Data!N44,0)","v":0},null,null,null,null,null,null,null,null,null,null,118,{"$f":"IF(SHAPE=$B$94,4,0)","v":0},{"$f":"IF(S109>0,\"Glass Radius:\",0)","v":0},{"$f":"IF(S109>0,I99,0)","v":0},null,null,null,null,null,null,null,"09B2","21.5","15.5","84","66","148"]
[null,null,"Frame Major R:",{"$f":"IF(AND(SHAPEW>0,SHAPEH>0,EXTLINK>1,SHAPE=119),Data!K44,0)","v":0},null,"Glass Major R:",{"$f":"IF(AND(SHAPEW>0,SHAPEH>0,EXTLINK>1,SHAPE=119),Data!O44,0)","v":0},null,null,null,null,null,null,null,null,null,null,118,{"$f":"IF(SHAPE=$B$94,5,0)","v":0},{"$f":"IF(S110>0,\"Glass Width:\",0)","v":0},{"$f":"IF(S110>0,I96,0)","v":0},{"$f":"IF(AND(U110>0,U110<GlassMinW),1,0)","v":0},null,null,null,null,null,null,"09B3","39.75","15.5","108","66","164"]
[null,null,"Frame Minor R:",{"$f":"IF(AND(SHAPEW>0,SHAPEH>0,EXTLINK>1,SHAPE=119),Data!L44,0)","v":0},null,"Glass Minor R:",{"$f":"IF(AND(SHAPEW>0,SHAPEH>0,EXTLINK>1,SHAPE=119),Data!P44,0)","v":0},null,null,null,null,null,null,null,null,null,null,118,{"$f":"IF(SHAPE=$B$94,6,0)","v":0},{"$f":"IF(S111>0,\"Glass Height:\",0)","v":0},{"$f":"IF(S111>0,I97,0)","v":0},{"$f":"IF(AND(U111>0,U111<GlassMinH),1,0)","v":0},null,null,null,null,null,null,"09B7","12","12","37","37",61]
[null,null,null,null,null,null,null,null,null,null,null,null,null,null,null,null,null,118,{"$f":"IF(SHAPE=$B$94,7,0)","v":0},{"$f":"IF(S112>0,\"Max Width:\",0)","v":0},{"$f":"IF(S112>0,D95,0)","v":0},{"$f":"IF(AND(S112>0,SHAPEW>0,SHAPEW>U112),1,0)","v":0},null,null,null,null,null,null,"09B9","30.25","15.5","120","66","164"]
[null,null,null,null,null,null,null,null,null,null,null,null,null,null,null,null,null,118,{"$f":"IF(SHAPE=$B$94,8,0)","v":0},{"$f":"IF(S113>0,\"Max UI:\",0)","v":0},{"$f":"IF(S113>0,E95,0)","v":0},{"$f":"IF(AND(S113>0,E96>0),1,0)","v":0},null,null,null,null,null,null,"09L1","15","22","44","77","121"]
[null,null,null,null,null,null,null,null,null,null,null,null,null,null,null,null,null,119,{"$f":"IF(SHAPE=$B$103,1,0)","v":0},{"$f":"IF(S114>0,\"Frame Width:\",0)","v":0},{"$f":"IF(S114>0,FW,0)","v":0},{"$f":"IF(AND(S114>0,SHAPEW>0,SHAPEH>0,FW<C104),1,0)","v":0},null,null,null,null,null,null,"09L2","21.5","15.5","72","56","128"]
[null,120,"Min Side","Max W","Max UI","Max sq.ft",null,null,"Frame Width:",{"$f":"IF(AND(SHAPEW>0,EXTLINK>1,SHAPE=120,EXTLINK<=3),SHAPEW,IF(AND(SHAPEW>0,SHAPE=120,EXTLINK>3),TRUNC(((SHAPEW-(OFFSET*2)))*16+0.5)/16,0))","v":0},null,null,null,null,null,null,null,119,{"$f":"IF(SHAPE=$B$103,2,0)","v":0},{"$f":"IF(S115>0,\"Frame Height:\",0)","v":0},{"$f":"IF(S115>0,FH,0)","v":0},{"$f":"IF(AND(S115>0,SHAPEW>0,SHAPEH>0,FH<C104),1,0)","v":0},null,null,null,null,null,null,"09L3","39.75","15.5","108","56","164"]
[null,{"$f":"EXT","v":1},{"$f":"MIN_LEG","v":""},{"$f":"MAX_W","v":""},{"$f":"MAX_UI","v":""},{"$f":"MAX_SF","v":""},null,null,"Leg Length:",{"$f":"IF(AND(SHAPEW>0,EXTLINK>3,SHAPE=120),((TAN(30*(PI()/180)))*(SHAPEW-(OFFSET*2))/2)*2,IF(AND(SHAPEW>0,EXTLINK<=3,SHAPE=120),((TAN(30*(PI()/180)))*SHAPEW/2)*2,0))","v":0},null,null,null,null,null,null,null,119,{"$f":"IF(SHAPE=$B$103,3,0)","v":0},{"$f":"IF(S116>0,\"Frame Major R:\",0)","v":0},{"$f":"IF(S116>0,D110,0)","v":0},{"$f":"IF(AND(S116>0,SHAPEW>0,SHAPEH>0,U116<C104),1,0)","v":0},null,null,null,null,null,null,"09L4","14.5","13","96","84","154"]
[null,null,{"$f":"IF(AND(SHAPEW>0,SHAPE=120,J116<C116),1,0)","v":0},{"$f":"IF(AND(SHAPEW>0,EXTLINK>1,SHAPE=120,FW>D116),1,0)","v":0},{"$f":"IF(AND(SHAPEW>0,SHAPEH>0,EXTLINK>1,SHAPE=120,(FW+FH)>E116),1,0)","v":0},{"$f":"IF(AND(SHAPEW>0,SHAPEH>0,EXTLINK>1,SHAPE=120,((FW*FH)/144)>F116),1,0)","v":0},null,null,"Glass Leg Length:",{"$f":"IF(AND(SHAPEW>0,EXTLINK>1,SHAPE=120),(((FW/2)-GLASSOFFSET)*TAN(RADIANS(30)))*2,0)","v":0},null,null,null,null,null,null,null,119,{"$f":"IF(SHAPE=$B$103,4,0)","v":0},{"$f":"IF(S117>0,\"Frame Minor R:\",0)","v":0},{"$f":"IF(S117>0,D111,0)","v":0},{"$f":"IF(AND(S117>0,SHAPEW>0,SHAPEH>0,U117<C104),1,0)","v":0},null,null,null,null,null,null,"09L9","30.25","15.5","108","56","164"]
[null,null,{"$f":"MAX(C117:F117)","v":0},{"$f":"IF(AND(SHAPE=B115,C118=1),1,0)","v":0},null,{"$f":"IF(AND(SHAPE=120,SHAPEW>0,SHAPEH>0,SHAPEW<>SHAPEH),\"WIDTH AND HEIGHT MUST BE EQUAL\",IF(AND(SHAPE=120,J118>0,J118<GlassMinW),\"Glass Width is Under Minimum\",IF(AND(SHAPE=120,J119>0,J119<GlassMinH),\"Glass Height is Under Minimum\",\"\")))","v":""},null,null,"Glass Width:",{"$f":"IF(AND(SHAPEW>0,EXTLINK>1,SHAPE=120),J115-(GLASSOFFSET*2),0)","v":0},null,null,null,null,null,null,null,119,{"$f":"IF(SHAPE=$B$103,5,0)","v":0},{"$f":"IF(S118>0,\"Glass Major R:\",0)","v":0},{"$f":"IF(S118>0,G110,0)","v":0},null,null,null,null,null,null,null,"1105","59.375","79.5","59.375","79.5","140"]
[null,null,null,null,null,null,null,null,"H-Leg/DimA:",{"$f":"IF(AND(SHAPEW>0,EXTLINK>1,SHAPE=120),(((FW/2)-GLASSOFFSET)*TAN(RADIANS(30)))*2,0)","v":0},null,null,null,null,null,null,null,119,{"$f":"IF(SHAPE=$B$103,6,0)","v":0},{"$f":"IF(S119>0,\"Glass Minor R:\",0)","v":0},{"$f":"IF(S119>0,G111,0)","v":0},null,null,null,null,null,null,null,"1106","71.375","79.5","71.375","79.5","152"]
[null,null,null,null,null,null,null,null,"Glass Height:",{"$f":"J119+(2*J121)","v":0},null,null,null,null,null,null,null,119,{"$f":"IF(SHAPE=119,7,0)","v":0},{"$f":"IF(S120>0,\"Glass Width:\",0)","v":0},{"$f":"IF(AND(S120>0,SHAPEW>0,SHAPEH>0),G108,0)","v":0},{"$f":"IF(AND(U120>0,U120<GlassMinW),1,0)","v":0},null,null,null,null,null,null,"1108","95.375","79.5","95.375","79.5","176"]
[null,null,null,null,null,null,null,null,null,{"$f":"J119*SIN(RADIANS(30))","v":0},null,null,null,null,null,null,null,119,{"$f":"IF(SHAPE=$B$103,8,0)","v":0},{"$f":"IF(S121>0,\"Glass Height:\",0)","v":0},{"$f":"IF(AND(S121>0,SHAPEW>0,SHAPEH>0),G109,0)","v":0},{"$f":"IF(AND(U121>0,U121<GlassMinH),1,0)","v":0},null,null,null,null,null,null,"1109","107.375","79.5","107.375","79.5","188"]
[null,null,null,null,null,null,null,null,null,null,null,null,null,null,null,null,null,119,{"$f":"IF(SHAPE=$B$103,9,0)","v":0},{"$f":"IF(S122>0,\"Max Width:\",0)","v":0},{"$f":"IF(S122>0,D104,0)","v":0},{"$f":"IF(AND(S122>0,SHAPEW>0,FW>U122),1,0)","v":0},null,null,null,null,null,null,"11c5","59.5","79.5","59.5","79.5","140"]
[null,121,"Min Angle","Max Cut","Max W","Max H","Min Side","Max UI",null,null,null,null,null,null,null,null,null,119,{"$f":"IF(SHAPE=$B$103,10,0)","v":0},{"$f":"IF(S123>0,\"Max Height:\",0)","v":0},{"$f":"IF(S123>0,E104,0)","v":0},{"$f":"IF(AND(S123>0,SHAPEH>0,FH>U123),1,0)","v":0},null,null,null,null,null,null,"11c6","71.5","79.5","71.5","79.5","152"]
[null,{"$f":"EXT","v":1},{"$f":"MIN_ANGLE","v":""},{"$f":"CUT_LENGTH","v":""},{"$f":"MAX_W","v":""},{"$f":"MAX_H","v":""},{"$f":"MIN_LEG","v":""},{"$f":"MAX_UI","v":""},null,null,null,null,null,null,null,null,null,119,{"$f":"IF(SHAPE=$B$103,11,0)","v":0},{"$f":"IF(S124>0,\"Max UI:\",0)","v":0},{"$f":"IF(S124>0,F104,0)","v":0},{"$f":"IF(AND(S124>0,F105>0),1,0)","v":0},null,null,null,null,null,null,"11c8","95.5","79.5","95.5","79.5","176"]
[null,null,{"$f":"IF(AND(SHAPEW>0,SHAPE=121,OR(D128<C124,D131<C124)),1,0)","v":0},{"$f":"IF(AND(SHAPEW>0,SHAPEH>0,DIM_3>0,SHAPE=121,OR(D129>D124,D130>D124,H129>D124,H130>D124)),1,0)","v":0},{"$f":"IF(AND(SHAPEW>0,EXTLINK>1,SHAPE=121,FW>E124),1,0)","v":0},{"$f":"IF(AND(SHAPEH>0,EXTLINK>1,SHAPE=121,FH>F124),1,0)","v":0},{"$f":"IF(AND(SHAPEW>0,DIM_3>0,SHAPE=121,OR(DIM_3<G124,D132<G124)),1,0)","v":0},{"$f":"IF(AND(SHAPEW>0,SHAPEH>0,EXTLINK>1,SHAPE=121,(FW+FH)>H124),1,0)","v":0},null,null,null,null,null,null,null,null,null,120,{"$f":"IF(SHAPE=120,1,0)","v":0},{"$f":"IF(S125>0,\"Frame Width:\",0)","v":0},{"$f":"IF(S125>0,J115,0)","v":0},null,null,null,null,null,null,null,"11c9","107.5","79.5","107.5","79.5","188"]
[null,null,{"$f":"MAX(C125:H125)","v":0},{"$f":"IF(AND(SHAPE=B123,C126=1),1,0)","v":0},null,{"$f":"IF(AND(SHAPE=121,G128>0,G128<GlassMinW),\"Glass Width is Under Minimum\",IF(AND(SHAPE=121,G129>0,G129<GlassMinH),\"Glass Height is Under Minimum\",\"\"))","v":""},null,null,null,null,null,null,null,null,null,null,null,120,{"$f":"IF(SHAPE=120,2,0)","v":0},{"$f":"IF(S126>0,\"Frame Leg:\",0)","v":0},{"$f":"IF(S126>0,J116,0)","v":0},{"$f":"IF(AND(S126>0,C117>0),1,0)","v":0},null,null,null,null,null,null,"11i5","59.5","79.5","59.5","79.5","140"]
[null,null,null,null,null,null,null,null,null,null,null,null,null,null,null,null,null,120,{"$f":"IF(SHAPE=120,3,0)","v":0},{"$f":"IF(S127>0,\"Min Leg:\",0)","v":0},{"$f":"IF(S127>0,C116,0)","v":0},{"$f":"IF(AND(S127>0,C117>0),1,0)","v":0},null,null,null,null,null,null,"11i6","71.5","79.5","71.5","79.5","152"]
[null,null,"outer peak angle",{"$f":"IF(AND(SHAPEW>0,SHAPEH>0,DIM_3>0,EXTLINK>1,SHAPE=121),90-DEGREES(ATAN(((SHAPEW-DIM_3)/2)/(SHAPEH/2))),0)","v":0},null,"Glass Width:",{"$f":"IF(AND(SHAPEW>0,SHAPEH>0,EXTLINK>1,DIM_3>0,SHAPE=121),G132-(2*H132),0)","v":0},{"$f":"IF(AND(SHAPEW>0,SHAPEH>0,EXTLINK>1,DIM_3>0,SHAPE=121),ROUND((12*TAN(RADIANS(D128))),1)&\" /12\",0)","v":0},null,null,null,null,null,null,null,null,null,120,{"$f":"IF(SHAPE=120,4,0)","v":0},{"$f":"IF(S128>0,\"Glass Width:\",0)","v":0},{"$f":"IF(S128>0,J118,0)","v":0},{"$f":"IF(AND(U128>0,U128<GlassMinW),1,0)","v":0},null,null,null,null,null,null,"11i8","95.5","79.5","95.5","79.5","176"]
[null,null,"outer peak Hor. Cut",{"$f":"IF(AND(SHAPEW>0,SHAPEH>0,EXTLINK>1,DIM_3>0,SHAPE=121),EXTOFFSET/SIN(RADIANS(D128)),0)","v":0},null,"Glass Height:",{"$f":"IF(AND(SHAPEW>0,SHAPEH>0,EXTLINK>1,DIM_3>0,SHAPE=121),G133-(2*GLASSOFFSET),0)","v":0},{"$f":"IF(AND(SHAPEW>0,SHAPEH>0,SHAPE=121,DIM_3>0,AP12=3,SHAPE=121),(OFFSET+0.625)/SIN(RADIANS(D128)),0)","v":0},null,null,null,null,null,null,null,null,null,120,{"$f":"IF(SHAPE=120,5,0)","v":0},{"$f":"IF(S129>0,\"Glass Height:\",0)","v":0},{"$f":"IF(S129>0,J120,0)","v":0},{"$f":"IF(AND(U129>0,U129<GlassMinH),1,0)","v":0},null,null,null,null,null,null,"11T5","59.375","89.5","59.375","93.5","154"]
[null,null,"Bottom & Top Cut",{"$f":"IF(AND(SHAPEW>0,SHAPEH>0,EXTLINK>1,DIM_3>0,SHAPE=121),EXTOFFSET/(COS(RADIANS(90-D131))),0)","v":0},null,"Glass Dim3:",{"$f":"IF(AND(SHAPEW>0,SHAPEH>0,EXTLINK>1,DIM_3>0,SHAPE=121),D133-((SQRT(I132^2-GLASSOFFSET^2))*2),0)","v":0},{"$f":"IF(AND(SHAPEW>0,SHAPEH>0,DIM_3>0,SHAPE=121,AP12=3),(OFFSET+0.625)/(COS(RADIANS(90-D131))),0)","v":0},null,null,null,null,null,null,null,null,null,120,{"$f":"IF(SHAPE=120,6,0)","v":0},{"$f":"IF(S130>0,\"Glass Leg:\",0)","v":0},{"$f":"IF(S130>0,J119,0)","v":0},null,null,null,null,null,null,null,"11T6","71.375","89.5","71.375","93.5","166"]
[null,null,"Angles at long legs",{"$f":"IF(AND(SHAPEW>0,SHAPEH>0,EXTLINK>1,DIM_3>0,SHAPE=121),90-D128/2,0)","v":0},null,"Glass Slant Leg:",{"$f":"IF(AND(SHAPEW>0,SHAPEH>0,EXTLINK>1,DIM_3>0,SHAPE=121),SQRT(((G128/2)-(G130/2))^2+(G129/2)^2),0)","v":0},{"$f":"IF(AND(SHAPEW>0,SHAPEH>0,EXTLINK>1,DIM_3>0,SHAPE=121),OFFSET/SIN(RADIANS(D128)),0)","v":0},{"$f":"IF(AND(SHAPEW>0,SHAPEH>0,EXTLINK>1,DIM_3>0,SHAPE=121),OFFSET/(COS(RADIANS(90-D131))),0)","v":0},null,null,null,null,null,null,null,null,120,{"$f":"IF(SHAPE=120,7,0)","v":0},{"$f":"IF(S131>0,\"Max Width:\",0)","v":0},{"$f":"IF(S131>0,D116,0)","v":0},{"$f":"IF(AND(S131>0,SHAPEW>0,SHAPEW>U131),1,0)","v":0},null,null,null,null,null,null,"11T8","95.375","89.5","95.375","93.5","190"]
[null,null,"Slanted leg Length",{"$f":"IF(AND(SHAPEW>0,SHAPEH>0,EXTLINK>1,DIM_3>0,SHAPE=121),SQRT(((SHAPEW-DIM_3)/2)^2+(SHAPEH/2)^2),0)","v":0},null,"Frame Width:",{"$f":"IF(AND(SHAPEW>0,SHAPEH>0,DIM_3>0,SHAPE=121,EXTLINK>3),SHAPEW-(H131*2),IF(AND(SHAPEW>0,SHAPEH>0,EXTLINK>1,DIM_3>0,SHAPE=121,EXTLINK<=3),SHAPEW,0))","v":0},{"$f":"IF(AND(SHAPEW>0,SHAPEH>0,EXTLINK>1,DIM_3>0,SHAPE=121),GLASSOFFSET/SIN(RADIANS(D128)),0)","v":0},{"$f":"IF(AND(SHAPEW>0,SHAPEH>0,EXTLINK>1,DIM_3>0,SHAPE=121),GLASSOFFSET/(COS(RADIANS(90-D131))),0)","v":0},null,null,null,null,null,null,null,null,120,{"$f":"IF(SHAPE=120,8,0)","v":0},{"$f":"IF(S132>0,\"Max UI:\",0)","v":0},{"$f":"IF(S132>0,E116,0)","v":0},{"$f":"IF(AND(S132>0,E117>0),1,0)","v":0},null,null,null,null,null,null,"11T9","107.375","89.5","107.375","93.5","202"]
[null,null,"Dim3:",{"$f":"IF(AND(SHAPEW>0,SHAPEH>0,EXTLINK>1,DIM_3>0,SHAPE=121,EXTLINK>3),DIM_3-((SQRT(I131^2-OFFSET^2))*2),IF(AND(SHAPEW>0,SHAPEH>0,EXTLINK>1,DIM_3>0,SHAPE=121,EXTLINK<=3),DIM_3,0))","v":0},null,"Frame Height:",{"$f":"IF(AND(SHAPEW>0,SHAPEH>0,DIM_3>0,SHAPE=121,EXTLINK>3),SHAPEH-(OFFSET*2),IF(AND(SHAPEW>0,SHAPEH>0,EXTLINK>1,DIM_3>0,SHAPE=121,EXTLINK<=3),SHAPEH,0))","v":0},null,null,null,null,null,null,null,null,null,null,121,{"$f":"IF(SHAPE=121,1,0)","v":0},{"$f":"IF(S133>0,\"Frame Width:\",0)","v":0},{"$f":"IF(S133>0,FW,0)","v":0},null,null,null,null,null,null,null,"2001","11","20","52","84","132"]
[null,null,null,null,null,null,null,null,null,null,null,null,null,null,null,null,null,121,{"$f":"IF(SHAPE=121,2,0)","v":0},{"$f":"IF(S134>0,\"Frame Height:\",0)","v":0},{"$f":"IF(AND(S134>0,DIM_3>0),FH,0)","v":0},null,null,null,null,null,null,null,"2002","18","9","84","72","148"]
[null,122,"Min Side","Max W","Max UI","Max sq.ft",null,"Leg Length",{"$f":"IF(AND(SHAPEW>0,EXTLINK>1,SHAPE=122,EXTLINK>3),((TAN(22.5*(PI()/180)))*SHAPEW/2)*2,IF(AND(SHAPEW>0,EXTLINK>1,SHAPE=122,EXTLINK<=3),((TAN(22.5*(PI()/180)))*I136/2)*2,0))","v":0},null,null,null,null,null,null,null,null,121,{"$f":"IF(SHAPE=121,3,0)","v":0},{"$f":"IF(S135>0,\"Roof Pitch:\",0)","v":0},{"$f":"IF(S135>0,H128,0)","v":0},null,null,null,null,null,null,null,"2003","47.5","9","120","72","192"]
[null,{"$f":"EXT","v":1},{"$f":"MIN_LEG","v":""},{"$f":"MAX_W","v":""},{"$f":"MAX_UI","v":""},{"$f":"MAX_SF","v":""},null,"Frame H:",{"$f":"IF(AND(SHAPEW>0,EXTLINK>1,SHAPE=122,EXTLINK<=3),SHAPEW,IF(AND(SHAPEW>0,SHAPE=122,EXTLINK>3),TRUNC((SHAPEW-(OFFSET*2))*16+0.5)/16,0))","v":0},null,null,null,null,null,null,null,null,121,{"$f":"IF(SHAPE=121,4,0)","v":0},{"$f":"IF(S136>0,\"Horizontal Leg:\",0)","v":0},{"$f":"IF(AND(S136>0,DIM_3>0),D133,0)","v":0},{"$f":"IF(AND(S136>0,DIM_3>0,D133<G124),1,0)","v":0},null,null,null,null,null,null,"2004","9","9","112","96","154"]
[null,null,{"$f":"IF(AND(SHAPEW>0,SHAPE=122,I135<C136),1,0)","v":0},{"$f":"IF(AND(SHAPEW>0,EXTLINK>1,SHAPE=122,FW>D136),1,0)","v":0},{"$f":"IF(AND(SHAPEW>0,SHAPEH>0,EXTLINK>1,SHAPE=122,(FW+FH)>E136),1,0)","v":0},{"$f":"IF(AND(SHAPEW>0,SHAPEH>0,SHAPE=122,((FW*FH)/144)>F136),1,0)","v":0},null,"Glass W:",{"$f":"IF(AND(SHAPEW>0,EXTLINK>1,SHAPE=122),I136-(GLASSOFFSET*2),0)","v":0},null,null,null,null,null,null,null,null,121,{"$f":"IF(SHAPE=121,5,0)","v":0},{"$f":"IF(S137>0,\"Slanted Leg:\",0)","v":0},{"$f":"IF(S137>0,D132,0)","v":0},{"$f":"IF(AND(S137>0,DIM_3>0,D132<G124),1,0)","v":0},null,null,null,null,null,null,"2009","37.25","9","120","72","192"]
[null,null,{"$f":"MAX(C137:F137)","v":0},{"$f":"IF(AND(SHAPE=122,C138=1),1,0)","v":0},null,{"$f":"IF(AND(SHAPE=122,SHAPEW>0,SHAPEH>0,SHAPEW<>SHAPEH),\"WIDTH AND HEIGHT MUST BE EQUAL\",IF(AND(SHAPE=122,I137>0,I137<GlassMinW),\"Glass Width is Under Minimum\",IF(AND(SHAPE=122,I138>0,I138<GlassMinH),\"Glass Height is Under Minimum\",\"\")))","v":""},null,"Glass H:",{"$f":"IF(AND(SHAPEW>0,EXTLINK>1,SHAPE=122),I136-(GLASSOFFSET*2),0)","v":0},null,null,null,null,null,null,null,null,121,{"$f":"IF(SHAPE=121,6,0)","v":0},{"$f":"IF(S138>0,\"Outer Peak Angle:\",0)","v":0},{"$f":"IF(S138>0,D128,0)","v":0},{"$f":"IF(AND(S138>0,DIM_3>0,C125>0,D128<C124),1,0)","v":0},null,null,null,null,null,null,"3100","22.5","25.75","54","76","126"]
[null,null,null,null,null,null,null,"Glass Legs:",{"$f":"IF(AND(SHAPEW>0,EXTLINK>1,SHAPE=122),(((I136/2)-GLASSOFFSET)*TAN(RADIANS(22.5)))*2,0)","v":0},null,null,null,null,null,null,null,null,121,{"$f":"IF(SHAPE=121,7,0)","v":0},{"$f":"IF(S139>0,\"Outer Peak Cut L:\",0)","v":0},{"$f":"IF(S139>0,D129,0)","v":0},{"$f":"IF(AND(S139>0,D125>0,DIM_3>0,MAX(K124:L124)>D124),1,0)","v":0},null,null,null,null,null,null,"3102","26.5","22",73,63,136]
[null,null,null,null,null,null,null,null,null,null,null,null,null,null,null,null,null,121,{"$f":"IF(SHAPE=121,8,0)","v":0},{"$f":"IF(S140>0,\"Top & Bott Angles:\",0)","v":0},{"$f":"IF(S140>0,D131,0)","v":0},{"$f":"IF(AND(S140>0,DIM_3>0,C125>0,D131<C124),1,0)","v":0},null,null,null,null,null,null,"3104","12","12","52.5","76","128"]
[null,null,null,null,null,null,null,null,null,null,null,null,null,null,null,null,null,121,{"$f":"IF(SHAPE=121,9,0)","v":0},{"$f":"IF(S141>0,\"Top & Bott Cut L:\",0)","v":0},{"$f":"IF(S141>0,D130,0)","v":0},{"$f":"IF(AND(S141>0,D125>0,MAX(K125:L125)>D124),1,0)","v":0},null,null,null,null,null,null,"3109","44.5","22",110,63,173]
[null,null,null,null,null,null,null,null,null,null,null,null,null,null,null,null,null,121,{"$f":"IF(SHAPE=121,10,0)","v":0},{"$f":"IF(S142>0,\"Glass Width:\",0)","v":0},{"$f":"IF(S142>0,G128,0)","v":0},{"$f":"IF(AND(U142>0,U142<GlassMinW),1,0)","v":0},null,null,null,null,null,null,"5102","48","72","96","96","192"]
[null,123,"Min Cut","Min Side","Max W","Max UI","Min Angle",null,null,null,null,null,null,null,null,null,null,121,{"$f":"IF(SHAPE=121,11,0)","v":0},{"$f":"IF(S143>0,\"Glass Height:\",0)","v":0},{"$f":"IF(S143>0,G129,0)","v":0},{"$f":"IF(AND(U143>0,U143<GlassMinH),1,0)","v":0},null,null,null,null,null,null,"5103","84","72","108","96","204"]
[null,{"$f":"EXT","v":1},{"$f":"CUT_LENGTH","v":""},{"$f":"MIN_LEG","v":""},{"$f":"MAX_W","v":""},{"$f":"MAX_UI","v":""},{"$f":"MIN_ANGLE","v":""},null,null,null,null,null,null,null,null,null,null,121,{"$f":"IF(SHAPE=121,12,0)","v":0},{"$f":"IF(S144>0,\"Glass Hor. Leg:\",0)","v":0},{"$f":"IF(S144>0,G130,0)","v":0},null,null,null,null,null,null,null,"5105","58.625","79.5","58.625","79.5","140"]
[null,null,null,{"$f":"IF(AND(SHAPEW>0,SHAPEH>0,DIM_3>0,SHAPE=123,OR(D150<D144,D151<D144,D152<D144)),1,0)","v":0},{"$f":"IF(AND(SHAPEW>0,EXTLINK>1,SHAPE=123,OR(FW>E144,FH>E144)),1,0)","v":0},{"$f":"IF(AND(SHAPEW>0,SHAPEH>0,SHAPE=123,EXTLINK>1,(FW+FH)>F144),1,0)","v":0},null,null,null,null,null,null,null,null,null,null,null,121,{"$f":"IF(SHAPE=121,13,0)","v":0},{"$f":"IF(S145>0,\"Glass Slanted Leg:\",0)","v":0},{"$f":"IF(S145>0,G131,0)","v":0},null,null,null,null,null,null,null,"5106","70.625","79.5","70.625","79.5","152"]
[null,null,{"$f":"MAX(C145:G145)","v":0},{"$f":"IF(AND(SHAPE=B143,C146=1),1,0)","v":0},null,{"$f":"IF(AND(SHAPE=123,D148>0,D148<GlassMinW),\"Glass Width is Under Minimum\",IF(AND(SHAPE=123,D149>0,D149<GlassMinH),\"Glass Height is Under Minimum\",\"\"))","v":""},null,null,null,null,null,null,null,null,null,null,null,121,{"$f":"IF(SHAPE=121,14,0)","v":0},{"$f":"IF(S146>0,\"Max W & H:\",0)","v":0},{"$f":"IF(S146>0,E124,0)","v":0},{"$f":"IF(AND(S146>0,SHAPEW>0,SHAPEW>U146),1,0)","v":0},null,null,null,null,null,null,"5108","94.25","79.5","94.25","79.5","176"]
[null,null,"Roof Pitch:",{"$f":"IF(AND(SHAPEW>0,SHAPEH>0,EXTLINK>1,DIM_3>0,SHAPE=123),ROUND((TAN(RADIANS(90-Data!G53))*12),1)&\" /12\",0)","v":0},null,null,null,null,null,null,null,null,null,null,null,null,null,121,{"$f":"IF(SHAPE=121,15,0)","v":0},{"$f":"IF(S147>0,\"Max UI:\",0)","v":0},{"$f":"IF(S147>0,H124,0)","v":0},{"$f":"IF(AND(S147>0,H125>0),1,0)","v":0},null,null,null,null,null,null,"5109","105.5","79.5","105.5","79.5","188"]
[null,null,"Frame Width:",{"$f":"IF(AND(SHAPEW>0,SHAPEH>0,DIM_3>0,SHAPE=123,EXTLINK>3),SHAPEW-(2*OFFSET),IF(AND(SHAPEW>0,SHAPEH>0,EXTLINK>1,DIM_3>0,SHAPE=123,EXTLINK<=3),SHAPEW,0))","v":0},null,"Glass Width:",{"$f":"IF(AND(SHAPEW>0,SHAPEH>0,EXTLINK>1,DIM_3>0,SHAPE=123),FW-(GLASSOFFSET*2),0)","v":0},null,null,null,null,null,null,null,null,null,null,122,{"$f":"IF(SHAPE=122,1,0)","v":0},{"$f":"IF(S148>0,\"Frame Height:\",0)","v":0},{"$f":"IF(S148>0,I136,0)","v":0},null,null,null,null,null,null,null,"5175","74.5","79.5","74.5","79.5","155"]
[null,null,"Frame Height:",{"$f":"IF(AND(SHAPEW>0,SHAPEH>0,DIM_3>0,SHAPE=123,EXTLINK>3),SHAPEH-(2*OFFSET),IF(AND(SHAPEW>0,SHAPEH>0,EXTLINK>1,DIM_3>0,SHAPE=123,EXTLINK<=3),SHAPEH,0))","v":0},null,"Glass Height:",{"$f":"IF(AND(SHAPEW>0,SHAPEH>0,EXTLINK>1,DIM_3>0,SHAPE=123),FH-(GLASSOFFSET*2),0)","v":0},null,null,null,null,null,null,null,null,null,null,122,{"$f":"IF(SHAPE=122,2,0)","v":0},{"$f":"IF(S149>0,\"Frame Leg:\",0)","v":0},{"$f":"IF(S149>0,I135,0)","v":0},{"$f":"IF(AND(S149>0,C137>0),1,0)","v":0},null,null,null,null,null,null,"51i5","58.625","79.5","58.625","79.5","140"]
[null,null,{"$f":"IF(AND(SHAPEW>0,SHAPEH>0,EXTLINK>1,DIM_3>0,SHAPE=123,SHAPEW>=SHAPEH),\"Vertical Leg:\",IF(AND(SHAPEW>0,SHAPEH>0,EXTLINK>1,DIM_3>0,SHAPE=123,SHAPEW<SHAPEH),\"Horizontal Leg:\",\"\"))","v":""},{"$f":"IF(AND(SHAPEW>0,SHAPEH>0,EXTLINK>1,DIM_3>0,SHAPE=123,EXTLINK<=3),Data!C53,IF(AND(SHAPEW>0,SHAPEH>0,DIM_3>0,SHAPE=123,EXTLINK>3),Data!J53,0))","v":0},null,{"$f":"IF(AND(SHAPEW>0,SHAPEH>0,EXTLINK>1,DIM_3>0,SHAPE=123,SHAPEW>=SHAPEH),\"Glass Vertical Leg:\",IF(AND(SHAPEW>0,SHAPEH>0,EXTLINK>1,DIM_3>0,SHAPE=123,SHAPEW<SHAPEH),\"Glass Horizontal Leg:\",\"\"))","v":""},{"$f":"IF(AND(SHAPEW>0,SHAPEH>0,EXTLINK>1,DIM_3>0,SHAPE=123),Data!Q53,0)","v":0},null,null,null,null,null,null,null,null,null,null,122,{"$f":"IF(SHAPE=122,3,0)","v":0},{"$f":"IF(S150>0,\"Min. Leg:\",0)","v":0},{"$f":"IF(S150>0,C136,0)","v":0},{"$f":"IF(AND(S150>0,C137>0),1,0)","v":0},null,null,null,null,null,null,"51i6","70.625","79.5","70.625","79.5","152"]
[null,null,"Slanted Leg:",{"$f":"IF(AND(SHAPEW>0,SHAPEH>0,EXTLINK>1,DIM_3>0,SHAPE=123,EXTLINK<=3),Data!F53,IF(AND(SHAPEW>0,SHAPEH>0,DIM_3>0,SHAPE=123,EXTLINK>3),Data!M53,0))","v":0},null,"Glass Slanted Leg:",{"$f":"IF(AND(SHAPEW>0,SHAPEH>0,EXTLINK>1,DIM_3>0,SHAPE=123),Data!R53,0)","v":0},null,null,null,null,null,null,null,null,null,null,122,{"$f":"IF(SHAPE=122,4,0)","v":0},{"$f":"IF(S151>0,\"Glass Width:\",0)","v":0},{"$f":"IF(S151>0,I137,0)","v":0},{"$f":"IF(AND(U151>0,U151<GlassMinW),1,0)","v":0},null,null,null,null,null,null,"51i8","95.5","79.5","95.5","79.5","176"]
[null,null,{"$f":"IF(AND(SHAPEW>0,SHAPEH>0,EXTLINK>1,DIM_3>0,SHAPE=123,SHAPEW<SHAPEH),\"Dim3:\",IF(AND(SHAPEW>0,SHAPEH>0,EXTLINK>1,DIM_3>0,SHAPE=123,SHAPEW>=SHAPEH),\"Dim3:\",\"\"))","v":""},{"$f":"IF(AND(SHAPEW>0,SHAPEH>0,EXTLINK>1,DIM_3>0,SHAPE=123),Data!N53,0)","v":0},null,{"$f":"IF(AND(SHAPEW>0,SHAPEH>0,EXTLINK>1,DIM_3>0,SHAPE=123,SHAPEW<SHAPEH),\"Glass Vertical Leg:\",IF(AND(SHAPEW>0,SHAPEH>0,EXTLINK>1,DIM_3>0,SHAPE=123,SHAPEW>=SHAPEH),\"Glass Horizontal Leg:\",\"\"))","v":""},{"$f":"IF(AND(SHAPEW>0,SHAPEH>0,EXTLINK>1,DIM_3>0,SHAPE=123),Data!S53,0)","v":0},null,null,null,null,null,null,null,null,null,null,122,{"$f":"IF(SHAPE=122,5,0)","v":0},{"$f":"IF(S152>0,\"Glass Height:\",0)","v":0},{"$f":"IF(S152>0,I138,0)","v":0},{"$f":"IF(AND(U152>0,U152<GlassMinH),1,0)","v":0},null,null,null,null,null,null,"5202","48","72","94.5","94.5","189"]
[null,null,null,null,null,null,null,null,null,null,null,null,null,null,null,null,null,122,{"$f":"IF(SHAPE=122,6,0)","v":0},{"$f":"IF(S153>0,\"Glass Leg:\",0)","v":0},{"$f":"IF(S153>0,I139,0)","v":0},null,null,null,null,null,null,null,"5203","84","72","138.9375","94.5","234"]
[null,null,null,null,null,null,null,null,null,null,null,null,null,null,null,null,null,122,{"$f":"IF(SHAPE=122,7,0)","v":0},{"$f":"IF(S154>0,\"Max Width:\",0)","v":0},{"$f":"IF(S154>0,D136,0)","v":0},{"$f":"IF(AND(S154>0,SHAPEW>0,SHAPEW>U154),1,0)","v":0},null,null,null,null,null,null,"5205","59.0625","79.5","59.0625","79.5","156"]
[null,null,null,null,null,null,null,null,null,null,null,null,null,null,null,null,null,122,{"$f":"IF(SHAPE=122,8,0)","v":0},{"$f":"IF(S155>0,\"Max UI:\",0)","v":0},{"$f":"IF(S155>0,E136,0)","v":0},{"$f":"IF(AND(S155>0,E137>0),1,0)","v":0},null,null,null,null,null,null,"5206","70.875","79.5","70.875","79.5","168"]
[null,124,"Min Cut","Min Side","Max H","Max UI",null,"Unit Height:",{"$f":"IF(AND(SHAPEW>0,EXTLINK>1,SHAPE=124),(SHAPEW*COS(RADIANS(54)))+(SHAPEW*SIN(RADIANS(72))),0)","v":0},null,null,null,null,null,null,null,null,123,{"$f":"IF(SHAPE=123,1,0)","v":0},{"$f":"IF(S156>0,\"Roof Pitch:\",0)","v":0},{"$f":"IF(S156>0,D147,0)","v":0},null,null,null,null,null,null,null,"5208","94.25","79.5","94.25","79.5","192"]
[null,{"$f":"EXT","v":1},{"$f":"CUT_LENGTH","v":""},{"$f":"MIN_LEG","v":""},{"$f":"MAX_W","v":""},{"$f":"MAX_UI","v":""},null,"Cut Length:",{"$f":"IF(AND(SHAPEW>0,EXTLINK>1,SHAPE=124),OFFSET/SIN(RADIANS(54)),0)","v":0},null,null,null,null,null,null,null,null,123,{"$f":"IF(SHAPE=123,2,0)","v":0},{"$f":"IF(S157>0,\"Frame Width:\",0)","v":0},0,{"$f":"IF(AND(S157>0,FW>E144),1,0)","v":0},null,null,null,null,null,null,"5209","103.5","79.5","103.5","79.5","204"]
[null,null,null,{"$f":"IF(AND(SHAPEW>0,SHAPE=124,D163<D157),1,0)","v":0},{"$f":"IF(AND(SHAPEW>0,SHAPE=124,EXTLINK>1,FH>E157),1,0)","v":0},{"$f":"IF(AND(SHAPEW>0,SHAPE=124,EXTLINK>1,(FW+FH)>F157),1,0)","v":0},null,"Cut Length2:",{"$f":"IF(AND(SHAPEW>0,EXTLINK>1,SHAPE=124),GLASSOFFSET/SIN(RADIANS(54)),0)","v":0},null,null,null,null,null,null,null,null,123,{"$f":"IF(SHAPE=123,3,0)","v":0},{"$f":"IF(S158>0,\"Frame Height:\",0)","v":0},0,{"$f":"IF(AND(S157>0,FH>E144),1,0)","v":0},null,null,null,null,null,null,"5210","118.125","79.5","118.125","79.5","216"]
[null,null,{"$f":"MAX(C158:F158)","v":0},{"$f":"IF(AND(SHAPE=B156,C159=1),1,0)","v":0},null,{"$f":"IF(AND(SHAPE=124,F161>0,F161<GlassMinW),\"Glass Width is Under Minimum\",IF(AND(SHAPE=124,F162>0,F162<GlassMinH),\"Glass Height is Under Minimum\",\"\"))","v":""},null,null,{"$f":"OFFSET/TAN(RADIANS(54))","v":0},null,null,null,null,null,null,null,null,123,{"$f":"IF(SHAPE=123,4,0)","v":0},{"$f":"IF(S159>0,C150,0)","v":0},0,{"$f":"IF(AND(S159>0,D145>0),1,0)","v":0},null,null,null,null,null,null,"5212","138.9375","79.5","138.9375","79.5","240"]
[null,null,null,null,null,null,null,null,{"$f":"GLASSOFFSET/TAN(RADIANS(54))","v":0},null,null,null,null,null,null,null,null,123,{"$f":"IF(SHAPE=123,5,0)","v":0},{"$f":"IF(S160>0,\"Slanted Leg:\",0)","v":0},0,{"$f":"IF(AND(S160>0,D145>0),1,0)","v":0},null,null,null,null,null,null,"6102","48","72","96","96","180"]
[null,null,"Frame Width:",{"$f":"IF(AND(SHAPEW>0,EXTLINK>1,SHAPE=124,EXTLINK<=3),SHAPEW,IF(AND(SHAPEW>0,SHAPE=124,EXTLINK>3),TRUNC((SHAPEW-(I159*2))*16+0.5)/16,0))","v":0},"Glass Width:",{"$f":"IF(AND(SHAPEW>0,EXTLINK>1,SHAPE=124,EXTLINK<=3),J163+(I163*2),IF(AND(SHAPEW>0,SHAPE=124,EXTLINK>3),SHAPEW-(I161*2),0))","v":0},null,null,{"$f":"(OFFSET+GLASSOFFSET)/TAN(RADIANS(54))","v":0},null,null,null,null,null,null,null,null,123,{"$f":"IF(SHAPE=123,6,0)","v":0},{"$f":"IF(S161>0,C152,0)","v":0},0,{"$f":"IF(AND(S161>0,D145>0),1,0)","v":0},null,null,null,null,null,null,"6103","84","72","144","96","228"]
[null,null,"Frame Height:",{"$f":"IF(AND(SHAPEW>0,EXTLINK>1,SHAPE=124,EXTLINK<=3),I156,IF(AND(SHAPEW>0,SHAPE=124,EXTLINK>3),I156-(OFFSET+I157),0))","v":0},"Glass Height:",{"$f":"IF(AND(SHAPEW>0,EXTLINK>1,SHAPE=124),D162-(I158+GLASSOFFSET),0)","v":0},null,"DimA-B:",{"$f":"IF(AND(SHAPEW>0,EXTLINK>1,SHAPE=124),J163*SIN(RADIANS(72)),0)","v":0},null,null,null,null,null,null,null,null,123,{"$f":"IF(SHAPE=123,7,0)","v":0},{"$f":"IF(S162>0,\"Glass Width:\",0)","v":0},{"$f":"IF(S162>0,G148,0)","v":0},{"$f":"IF(AND(U162>0,U162<GlassMinW),1,0)","v":0},null,null,null,null,null,null,"6104","96","72","144","96","240"]
[null,null,"Leg Length:",{"$f":"IF(AND(SHAPEW>0,EXTLINK>1,SHAPE=124,EXTLINK<=3),SHAPEW,IF(AND(SHAPEW>0,SHAPE=124,EXTLINK>3),D161,0))","v":0},"Glass Leg:",{"$f":"IF(AND(SHAPEW>0,EXTLINK>1,SHAPE=124),D163-(I160*2),0)","v":0},null,"DimC-D:",{"$f":"IF(AND(SHAPEW>0,EXTLINK>1,SHAPE=124),J163*COS(RADIANS(72)),0)","v":0},{"$f":"IF(AND(SHAPEW>0,EXTLINK>1,SHAPE=124),SHAPEW-(2*(1/TAN(RADIANS(54)))),0)","v":0},null,null,null,null,null,null,null,123,{"$f":"IF(SHAPE=123,8,0)","v":0},{"$f":"IF(S163>0,\"Glass Height:\",0)","v":0},{"$f":"IF(S163>0,G149,0)","v":0},{"$f":"IF(AND(U163>0,U163<GlassMinH),1,0)","v":0},null,null,null,null,null,null,"6105","58.625","79.5","58.625","79.5","139"]
[null,null,null,null,null,null,null,"DimE:",{"$f":"IF(AND(SHAPEW>0,EXTLINK>1,SHAPE=124),J163*SIN(RADIANS(54)),0)","v":0},null,null,null,null,null,null,null,null,123,{"$f":"IF(SHAPE=123,9,0)","v":0},{"$f":"IF(S164>0,F150,0)","v":0},{"$f":"IF(S164>0,D148,0)","v":0},null,null,null,null,null,null,null,"6106","70.625","79.5","70.625","79.5","151"]
[null,null,null,null,null,null,null,null,null,null,null,null,null,null,null,null,null,123,{"$f":"IF(SHAPE=123,10,0)","v":0},{"$f":"IF(S165>0,\"Glass Slanted Leg:\",0)","v":0},{"$f":"IF(S165>0,G151,0)","v":0},null,null,null,null,null,null,null,"6108","94.25","79.5","94.25","79.5","175"]
[null,125,"Min Side","Min Cut","Max W","Max UI","Min Angle",null,null,null,null,null,null,null,null,null,null,123,{"$f":"IF(SHAPE=123,11,0)","v":0},{"$f":"IF(S166>0,F152,0)","v":0},{"$f":"IF(S166>0,G152,0)","v":0},null,null,null,null,null,null,null,"6109","105.5","79.5","105.5","79.5","186"]
[null,{"$f":"EXT","v":1},{"$f":"MIN_LEG","v":""},{"$f":"CUT_LENGTH","v":""},{"$f":"MAX_W","v":""},{"$f":"MAX_UI","v":""},{"$f":"MIN_ANGLE","v":""},null,null,null,null,null,null,null,null,null,null,123,{"$f":"IF(SHAPE=123,12,0)","v":0},{"$f":"IF(S167>0,\"Max Width:\",0)","v":0},{"$f":"IF(S167>0,E144,0)","v":0},{"$f":"IF(AND(S157>0,FW>E144),1,0)","v":0},null,null,null,null,null,null,"6112","139.5","79.5","139.5","79.5","220"]
[null,null,{"$f":"IF(AND(SHAPEW>0,SHAPEH>0,DIM_3>0,DIM_4>0,EXTLINK>1,SHAPE=125,OR(D174<C167,D175<C167,D176<C167)),1,0)","v":0},null,{"$f":"IF(AND(SHAPEW>0,EXTLINK>1,SHAPE=125,OR(FW>E167,FH>E167)),1,0)","v":0},{"$f":"IF(AND(SHAPEW>0,SHAPEH>0,EXTLINK>1,SHAPE=125,(FW+FH)>F167),1,0)","v":0},null,null,null,null,null,null,null,null,null,null,null,123,{"$f":"IF(SHAPE=123,13,0)","v":0},{"$f":"IF(S168>0,\"Max Height:\",0)","v":0},{"$f":"IF(S168>0,E144,0)","v":0},{"$f":"IF(AND(S157>0,FH>E144),1,0)","v":0},null,null,null,null,null,null,"6122","140.875","79.5","140.875","79.5","221"]
[null,null,{"$f":"MAX(C168:G168)","v":0},{"$f":"IF(AND(SHAPE=B166,C169=1),1,0)","v":0},null,{"$f":"IF(AND(SHAPE=125,G171>0,G171<GlassMinW),\"Glass Width is Under Minimum\",IF(AND(SHAPE=125,G172>0,G172<GlassMinH),\"Glass Height is Under Minimum\",\"\"))","v":""},null,null,null,null,null,null,null,null,null,null,null,123,{"$f":"IF(SHAPE=123,14,0)","v":0},{"$f":"IF(S169>0,\"Max UI:\",0)","v":0},{"$f":"IF(S169>0,F144,0)","v":0},{"$f":"IF(AND(S169>0,F145>0),1,0)","v":0},null,null,null,null,null,null,"6175","74.5","79.5","74.5","79.5","154"]
[null,null,null,null,null,null,null,null,null,null,null,null,null,null,null,null,null,124,{"$f":"IF(SHAPE=124,1,0)","v":0},{"$f":"IF(S170>0,\"Frame Width:\",0)","v":0},{"$f":"IF(S170>0,FW,0)","v":0},{"$f":"IF(AND(S170>0,D158>0),1,0)","v":0},null,null,null,null,null,null,"6202","48","72","96","96","192"]
[null,null,"Roof Pitch:",{"$f":"IF(AND(SHAPEH>0,SHAPEW>0,DIM_3>0,DIM_4>0,EXTLINK>1,SHAPE=125),ROUND((12*((SHAPEH-DIM_3)/(SHAPEW-DIM_4))),1)&\" / 12\",0)","v":0},null,"Glass Width:",{"$f":"IF(AND(SHAPEH>0,SHAPEW>0,DIM_3>0,DIM_4>0,EXTLINK>1,SHAPE=125),FW-(GLASSOFFSET*2),0)","v":0},null,"Angle:",{"$f":"IF(AND(SHAPEH>0,SHAPEW>0,DIM_3>0,DIM_4>0,EXTLINK>1,SHAPE=125),90-DEGREES(ATAN((SHAPEH-DIM_3)/(SHAPEW-DIM_4))),0)","v":0},null,null,null,null,null,null,null,124,{"$f":"IF(SHAPE=124,2,0)","v":0},{"$f":"IF(S171>0,\"Frame Height:\",0)","v":0},{"$f":"IF(S171>0,FH,0)","v":0},{"$f":"IF(AND(S171>0,FH>E157),1,0)","v":0},null,null,null,null,null,null,"6203","84","72","144","96","240"]
[null,null,"Frame Width:",{"$f":"IF(AND(SHAPEH>0,SHAPEW>0,DIM_3>0,DIM_4>0,EXTLINK>1,SHAPE=125,EXTLINK<=3),SHAPEW,IF(AND(SHAPEH>0,SHAPEW>0,DIM_3>0,DIM_4>0,SHAPE=125,EXTLINK>3),SHAPEW-(OFFSET*2),0))","v":0},null,"Glass Height:",{"$f":"IF(AND(SHAPEH>0,SHAPEW>0,DIM_3>0,DIM_4>0,EXTLINK>1,SHAPE=125),FH-(GLASSOFFSET*2),0)","v":0},null,"V/Slant Deduct:",{"$f":"IF(AND(SHAPEH>0,SHAPEW>0,DIM_3>0,DIM_4>0,EXTLINK>1,SHAPE=125),OFFSET*TAN(RADIANS(J171/2)),0)","v":0},null,null,null,null,null,null,null,124,{"$f":"IF(SHAPE=124,3,0)","v":0},{"$f":"IF(S172>0,\"Leg Length:\",0)","v":0},{"$f":"IF(S172>0,D163,0)","v":0},{"$f":"IF(AND(S172>0,D158>0),1,0)","v":0},null,null,null,null,null,null,"6204","96","72","144","96","240"]
[null,null,"Frame Height:",{"$f":"IF(AND(SHAPEH>0,SHAPEW>0,DIM_3>0,DIM_4>0,EXTLINK>1,SHAPE=125,EXTLINK<=3),SHAPEH,IF(AND(SHAPEH>0,SHAPEW>0,DIM_3>0,DIM_4>0,SHAPE=125,EXTLINK>3),SHAPEH-(OFFSET*2),0))","v":0},null,"Glass Dim3:",{"$f":"IF(AND(SHAPEH>0,SHAPEW>0,DIM_3>0,DIM_4>0,EXTLINK>1,SHAPE=125),D174-(GLASSOFFSET+J174),0)","v":0},null,"H/Slant Deduct:",{"$f":"IF(AND(SHAPEH>0,SHAPEW>0,DIM_3>0,DIM_4>0,EXTLINK>1,SHAPE=125),OFFSET*TAN(RADIANS((90-J171)/2)),0)","v":0},null,null,null,null,null,null,null,124,{"$f":"IF(SHAPE=124,4,0)","v":0},{"$f":"IF(S173>0,\"Glass Width:\",0)","v":0},{"$f":"IF(S173>0,F161,0)","v":0},{"$f":"IF(AND(U173>0,U173<GlassMinW),1,0)","v":0},null,null,null,null,null,null,"6205","58.625","79.5","58.625","79.5","139"]
[null,null,"Vertical Leg (Dim3):",{"$f":"IF(AND(SHAPEH>0,SHAPEW>0,DIM_3>0,DIM_4>0,EXTLINK>1,SHAPE=125,EXTLINK<=3),DIM_3,IF(AND(SHAPEH>0,SHAPEW>0,DIM_3>0,DIM_4>0,SHAPE=125,EXTLINK>3),TRUNC((DIM_3-(OFFSET+J172))*32+0.5)/32,0))","v":0},null,"Glass Dim4:",{"$f":"IF(AND(SHAPEH>0,SHAPEW>0,DIM_3>0,DIM_4>0,EXTLINK>1,SHAPE=125),D175-(GLASSOFFSET+J175),0)","v":0},null,"Glass V/Slant Deduct:",{"$f":"IF(AND(SHAPEH>0,SHAPEW>0,DIM_3>0,DIM_4>0,EXTLINK>1,SHAPE=125),GLASSOFFSET*TAN(RADIANS(J171/2)),0)","v":0},null,null,null,null,null,null,null,124,{"$f":"IF(SHAPE=124,5,0)","v":0},{"$f":"IF(S174>0,\"Glass Height:\",0)","v":0},{"$f":"IF(S174>0,F162,0)","v":0},{"$f":"IF(AND(U174>0,U174<GlassMinH),1,0)","v":0},null,null,null,null,null,null,"6206","70.625","79.5","70.625","79.5","151"]
[null,null,"Horizontal Leg (Dim4):",{"$f":"IF(AND(SHAPEH>0,SHAPEW>0,DIM_3>0,DIM_4>0,EXTLINK>1,SHAPE=125,EXTLINK<=3),DIM_4,IF(AND(SHAPEH>0,SHAPEW>0,DIM_3>0,DIM_4>0,SHAPE=125,EXTLINK>3),TRUNC((DIM_4-(OFFSET+J173))*32+0.5)/32,0))","v":0},null,"DimC:",{"$f":"IF(AND(SHAPEH>0,SHAPEW>0,DIM_3>0,DIM_4>0,EXTLINK>1,SHAPE=125),G171-(DIM_4-J173-GLASSOFFSET),0)","v":0},null,"Glass H/Slant Deduct:",{"$f":"IF(AND(SHAPEH>0,SHAPEW>0,DIM_3>0,DIM_4>0,EXTLINK>1,SHAPE=125),GLASSOFFSET*TAN(RADIANS((90-J171)/2)),0)","v":0},null,null,null,null,null,null,null,124,{"$f":"IF(SHAPE=124,6,0)","v":0},{"$f":"IF(S175>0,\"Glass Leg:\",0)","v":0},{"$f":"IF(S175>0,F163,0)","v":0},null,null,null,null,null,null,null,"6208","94.25","79.5","94.25","79.5","175"]
[null,null,"Slanted Leg:",{"$f":"IF(AND(SHAPEH>0,SHAPEW>0,DIM_3>0,DIM_4>0,SHAPE=125,EXTLINK>3),SQRT((SHAPEW-DIM_4)^2+(SHAPEH-DIM_3)^2),IF(AND(SHAPEH>0,SHAPEW>0,DIM_3>0,DIM_4>0,EXTLINK>1,SHAPE=125,EXTLINK<=3),SQRT((FW-D175)^2+(FH-D174)^2),0))","v":0},null,null,null,null,null,null,null,null,null,null,null,null,null,124,{"$f":"IF(SHAPE=124,7,0)","v":0},{"$f":"IF(S176>0,\"Max Height:\",0)","v":0},{"$f":"IF(S176>0,E157,0)","v":0},{"$f":"IF(AND(S176>0,SHAPEW>0,FH>E157),1,0)","v":0},null,null,null,null,null,null,"6209","105.5","79.5","105.5","79.5","186"]
[null,null,null,null,null,null,null,null,null,null,null,null,null,null,null,null,null,124,{"$f":"IF(SHAPE=124,8,0)","v":0},{"$f":"IF(S177>0,\"Max UI:\",0)","v":0},{"$f":"IF(S177>0,F157,0)","v":0},{"$f":"IF(AND(S177>0,F158>0),1,0)","v":0},null,null,null,null,null,null,"6212","139.5","79.5","139.5","79.5","220"]
[null,126,"Min Side","Min Cut","Max W","Max UI","Min Angle",null,null,null,null,null,null,null,null,null,null,125,{"$f":"IF(SHAPE=125,1,0)","v":0},{"$f":"IF(S178>0,\"Roof Pitch:\",0)","v":0},{"$f":"IF(S178>0,D171,0)","v":0},null,null,null,null,null,null,null,"6222","140.875","79.5","140.875","79.5","221"]
[null,{"$f":"EXT","v":1},{"$f":"MIN_LEG","v":""},{"$f":"CUT_LENGTH","v":""},{"$f":"MAX_W","v":""},{"$f":"MAX_UI","v":""},{"$f":"MIN_ANGLE","v":""},null,null,null,null,null,null,null,null,null,null,125,{"$f":"IF(SHAPE=125,2,0)","v":0},{"$f":"IF(S179>0,\"Frame Width:\",0)","v":0},{"$f":"IF(S179>0,FW,0)","v":0},{"$f":"IF(AND(S179>0,OR(C168>0,E168>0)),1,0)","v":0},null,null,null,null,null,null,"6275","74.5","79.5","74.5","79.5","154"]
[null,null,{"$f":"IF(AND(SHAPEW>0,SHAPEH>0,DIM_3>0,SHAPE=126,OR(FW<C179,D184<C179,D185<C179)),1,0)","v":0},{"$f":"IF(AND(SHAPEW>0,SHAPEH>0,DIM_3>0,SHAPE=126,D187>D179),1,0)","v":0},{"$f":"IF(AND(SHAPEW>0,SHAPE=126,EXTLINK>1,OR(FW>E179,FH>E179)),1,0)","v":0},{"$f":"IF(AND(SHAPEW>0,SHAPEH>0,SHAPE=126,EXTLINK>1,(FW+FH)>F179),1,0)","v":0},{"$f":"IF(AND(SHAPEW>0,SHAPEH>0,DIM_3>0,SHAPE=126,D188<G179),1,0)","v":0},null,null,null,null,null,null,null,null,null,null,125,{"$f":"IF(SHAPE=125,3,0)","v":0},{"$f":"IF(S180>0,\"Frame Height:\",0)","v":0},{"$f":"IF(S180>0,FH,0)","v":0},{"$f":"IF(AND(S180>0,OR(C168>0,E168>0)),1,0)","v":0},null,null,null,null,null,null,"6302","48","72","96","96","192"]
[null,null,{"$f":"MAX(C180:G180)","v":0},{"$f":"IF(AND(SHAPE=126,C181=1),1,0)","v":0},null,{"$f":"IF(AND(SHAPE=126,G182>0,G182<GlassMinW),\"Glass Width is Under Minimum\",IF(AND(SHAPE=126,G183>0,G183<GlassMinH),\"Glass Height is Under Minimum\",\"\"))","v":""},null,null,"Slant Leg Deduct:",{"$f":"IF(AND(SHAPEW>0,SHAPEH>0,DIM_3>0,EXTLINK>1,SHAPE=126),SQRT(J185^2-OFFSET^2),0)","v":0},null,null,null,null,null,null,null,125,{"$f":"IF(SHAPE=125,4,0)","v":0},{"$f":"IF(S181>0,\"V. Leg (Dim3):\",0)","v":0},{"$f":"IF(AND(S181>0,DIM_3>0),TRUNC((D174)*16+0.5)/16,0)","v":0},{"$f":"IF(AND(S181>0,DIM_3>0,C168>0),1,0)","v":0},null,null,null,null,null,null,"6303","84","72","144","96","240"]
[null,null,"Frame Width:",{"$f":"IF(AND(SHAPEW>0,SHAPEH>0,DIM_3>0,EXTLINK>1,SHAPE=126,EXTLINK<=3),SHAPEW,IF(AND(SHAPEW>0,SHAPEH>0,DIM_3>0,SHAPE=126,EXTLINK>3),SHAPEW-(OFFSET*2),0))","v":0},null,"Glass Width:",{"$f":"IF(AND(SHAPEW>0,SHAPEH>0,DIM_3>0,EXTLINK>1,SHAPE=126),FW-(GLASSOFFSET*2),0)","v":0},null,"Leg Angle:",{"$f":"IF(AND(SHAPEW>0,SHAPEH>0,DIM_3>0,EXTLINK>1,SHAPE=126),RADIANS((90-DEGREES(ATAN((SHAPEH-DIM_3)/(SHAPEW/2))))/2),0)","v":0},null,null,null,null,null,null,null,125,{"$f":"IF(SHAPE=125,5,0)","v":0},{"$f":"IF(S182>0,\"H. Leg (Dim4):\",0)","v":0},{"$f":"IF(AND(S182>0,DIM_4>0),TRUNC((D175)*16+0.5)/16,0)","v":0},{"$f":"IF(AND(S182>0,DIM_4>0,C168>0),1,0)","v":0},null,null,null,null,null,null,"6304","96","72","144","96","240"]
[null,null,"Frame Height:",{"$f":"IF(AND(SHAPEW>0,SHAPEH>0,DIM_3>0,EXTLINK>1,SHAPE=126,EXTLINK<=3),SHAPEH,IF(AND(SHAPEW>0,SHAPEH>0,DIM_3>0,SHAPE=126,EXTLINK>3),TRUNC((SHAPEH-(OFFSET+J185))*32+0.5)/32,0))","v":0},null,"Glass Height:",{"$f":"IF(AND(SHAPEW>0,SHAPEH>0,DIM_3>0,EXTLINK>1,SHAPE=126),FH-GLASSOFFSET-J186,0)","v":0},null,"Leg Deduct:",{"$f":"IF(AND(SHAPEW>0,SHAPEH>0,DIM_3>0,EXTLINK>1,SHAPE=126),TAN(J182)*OFFSET,0)","v":0},null,null,null,null,null,null,null,125,{"$f":"IF(SHAPE=125,6,0)","v":0},{"$f":"IF(S183>0,\"Slanted Leg:\",0)","v":0},{"$f":"IF(AND(S183>0,DIM_3>0,DIM_4>0),D176,0)","v":0},{"$f":"IF(AND(S183>0,DIM_3>0,DIM_4>0,C168>0),1,0)","v":0},null,null,null,null,null,null,"6305","58.625","79.5","58.625","79.5","140"]
[null,null,"Frame Leg (Dim3):",{"$f":"IF(AND(SHAPEW>0,SHAPEH>0,DIM_3>0,EXTLINK>1,SHAPE=126,EXTLINK<=3),DIM_3,IF(AND(SHAPEW>0,SHAPEH>0,DIM_3>0,SHAPE=126,EXTLINK>3),TRUNC((DIM_3-(OFFSET+J183))*32+0.5)/32,0))","v":0},null,"Glass Leg Height:",{"$f":"IF(AND(SHAPEW>0,SHAPEH>0,DIM_3>0,EXTLINK>1,SHAPE=126),D184-(GLASSOFFSET+J187),0)","v":0},null,"Roof Pitch:",{"$f":"IF(AND(SHAPEW>0,SHAPEH>0,DIM_3>0,EXTLINK>1,SHAPE=126),90-DEGREES(ATAN((SHAPEH-DIM_3)/(SHAPEW/2))),0)","v":0},null,null,null,null,null,null,null,125,{"$f":"IF(SHAPE=125,7,0)","v":0},{"$f":"IF(S184>0,\"Glass Width:\",0)","v":0},{"$f":"IF(S184>0,G171,0)","v":0},{"$f":"IF(AND(S184>0,G171<GlassMinW),1,0)","v":0},null,null,null,null,null,null,"6306","70.625","79.5","70.625","79.5","152"]
[null,null,"Slanted Leg:",{"$f":"IF(AND(SHAPEW>0,SHAPEH>0,DIM_3>0,EXTLINK>1,SHAPE=126,EXTLINK<=3),SQRT((SHAPEH-DIM_3)^2+(SHAPEW/2)^2),IF(AND(SHAPEW>0,SHAPEH>0,DIM_3>0,SHAPE=126,EXTLINK>3),(SQRT((SHAPEH-DIM_3)^2+(SHAPEW/2)^2))-(J181+J183),0))","v":0},null,"DimC-D:",{"$f":"IF(AND(SHAPEW>0,SHAPEH>0,DIM_3>0,EXTLINK>1,SHAPE=126),G182/2,0)","v":0},null,"Offset @ Peak:",{"$f":"IF(AND(SHAPEW>0,SHAPEH>0,EXTLINK>1,DIM_3>0,SHAPE=126),OFFSET/(SIN(RADIANS(J184))),0)","v":0},null,null,null,null,null,null,null,125,{"$f":"IF(SHAPE=125,8,0)","v":0},{"$f":"IF(S185>0,\"Glass Height:\",0)","v":0},{"$f":"IF(S185>0,G172,0)","v":0},{"$f":"IF(AND(S185>0,G172<GlassMinH),1,0)","v":0},null,null,null,null,null,null,"6308","94.25","79.5","94.25","79.5","176"]
[null,null,"Roof Pitch:",{"$f":"IF(AND(SHAPEH>0,DIM_3>0,SHAPEW>0,EXTLINK>1,SHAPE=126),ROUND((12*((SHAPEH-DIM_3)/(SHAPEW/2))),1)&\" /12\",0)","v":0},null,null,null,null,"Glass Offset @ Peak:",{"$f":"IF(AND(SHAPEW>0,SHAPEH>0,EXTLINK>1,DIM_3>0,SHAPE=126),GLASSOFFSET/(SIN(RADIANS(J184))),0)","v":0},null,null,null,null,null,null,null,125,{"$f":"IF(SHAPE=125,9,0)","v":0},{"$f":"IF(S186>0,\"Glass Dim3:\",0)","v":0},{"$f":"IF(S186>0,G173,0)","v":0},null,null,null,null,null,null,null,"6309","105.5","79.5","105.5","79.5","188"]
[null,null,"Cut L @ Peak:",{"$f":"IF(AND(SHAPEW>0,SHAPEH>0,EXTLINK>1,DIM_3>0,SHAPE=126),EXTOFFSET/(SIN(RADIANS(J184))),0)","v":0},null,null,null,null,"Glass Leg Deduct:",{"$f":"IF(AND(SHAPEW>0,SHAPEH>0,DIM_3>0,EXTLINK>1,SHAPE=126),TAN(J182)*GLASSOFFSET,0)","v":0},null,null,null,null,null,null,null,125,{"$f":"IF(SHAPE=125,10,0)","v":0},{"$f":"IF(S187>0,\"Glass Dim4:\",0)","v":0},{"$f":"IF(S187>0,G174,0)","v":0},null,null,null,null,null,null,null,"6312","139.5","79.5","139.5","79.5","224"]
[null,null,"Peak Cut Angle:",{"$f":"IF(AND(SHAPEW>0,SHAPEH>0,DIM_3>0,EXTLINK>1,SHAPE=126),90-DEGREES(ATAN((SHAPEH-DIM_3)/(SHAPEW/2))),0)","v":0},null,null,null,null,null,null,null,null,null,null,null,null,null,125,{"$f":"IF(SHAPE=125,11,0)","v":0},{"$f":"IF(S188>0,\"Max Width:\",0)","v":0},{"$f":"IF(S188>0,E167,0)","v":0},{"$f":"IF(AND(S188>0,SHAPEW>0,FW>U188),1,0)","v":0},null,null,null,null,null,null,"6322","140.875","79.5","140.875","79.5","224"]
[null,null,null,null,null,null,null,null,null,null,null,null,null,null,null,null,null,125,{"$f":"IF(SHAPE=125,12,0)","v":0},{"$f":"IF(S189>0,\"Max Height:\",0)","v":0},{"$f":"IF(S189>0,E167,0)","v":0},{"$f":"IF(AND(S189>0,SHAPEH>0,FH>U189),1,0)","v":0},null,null,null,null,null,null,"6402","48","72","96","96","192"]
[null,127,"Min R","Max W","Max H","Max UI","Cut L","Min W","F",{"$f":"IF(AND(SHAPEW>0,SHAPEH>0,EXTLINK>1,SHAPE=127),2*(ASIN((OFFSET*2)/(2*D196))),0)","v":0},null,null,null,null,null,null,null,125,{"$f":"IF(SHAPE=125,13,0)","v":0},{"$f":"IF(S190>0,\"Max UI:\",0)","v":0},{"$f":"IF(S190>0,F167,0)","v":0},{"$f":"IF(AND(S190>0,F168>0),1,0)","v":0},null,null,null,null,null,null,"6403","84","72",144,"96","240"]
[null,{"$f":"EXT","v":1},{"$f":"MIN_R","v":""},{"$f":"MAX_W","v":""},{"$f":"MAX_H","v":""},{"$f":"MAX_UI","v":""},{"$f":"CUT_LENGTH","v":""},18,"d",{"$f":"IF(AND(SHAPEW>0,SHAPEH>0,EXTLINK>1,SHAPE=127),(D196*(COS(J190/2)))-OFFSET,0)","v":0},null,null,null,null,null,null,null,126,{"$f":"IF(SHAPE=126,1,0)","v":0},{"$f":"IF(S191>0,\"Roof Pitch:\",0)","v":0},{"$f":"IF(S191>0,D186,0)","v":0},null,null,null,null,null,null,null,"6404","96","72","144","96","240"]
[null,null,{"$f":"IF(AND(SHAPEW>0,SHAPE=127,D196<C191),1,0)","v":0},{"$f":"IF(AND(SHAPEW>0,SHAPE=127,EXTLINK>1,FW>D191),1,0)","v":0},{"$f":"IF(AND(SHAPEH>0,SHAPE=127,EXTLINK>1,FH>E191),1,0)","v":0},{"$f":"IF(AND(SHAPEW>0,SHAPEH>0,SHAPE=127,EXTLINK>1,(FW+FH)>F191),1,0)","v":0},{"$f":"IF(AND(SHAPEW>0,SHAPEH>0,SHAPE=127,OR(G195>G191,G196>G191)),1,0)","v":0},{"$f":"IF(AND(SHAPEW>0,SHAPEH>0,SHAPE=127,EXTLINK>1,FW<H191),1,0)","v":0},"FW Deduct:",{"$f":"D196-J191","v":0},null,null,null,null,null,null,null,126,{"$f":"IF(SHAPE=126,2,0)","v":0},{"$f":"IF(S192>0,\"Frame Width:\",0)","v":0},{"$f":"IF(S192>0,D182,0)","v":0},{"$f":"IF(AND(S192>0,SHAPEW>0,SHAPEH>0,DIM_3>0,OR(D182<C179,D182>E179)),1,0)","v":0},null,null,null,null,null,null,"6405","58.625","79.5","58.625","79.5","155"]
[null,null,{"$f":"MAX(C192:H192)","v":0},{"$f":"IF(AND(SHAPE=B190,C193=1),1,0)","v":0},{"$f":"IF(AND(SHAPEW>0,SHAPEH>0,SHAPE=127,SHAPEH<=(SHAPEW/2)),1,0)","v":0},{"$f":"IF(AND(SHAPE=127,E193=1),\"FRAME HEIGHT MUST BE GREATER THAN 1/2 THE WIDTH\",IF(AND(SHAPE=127,SHAPEW>0,C192>0),\"RADIUS MUST BE GREATER THAN \"&C191,IF(AND(SHAPE=127,D198>0,D198<GlassMinW),\"Glass Width is Under Minimum\",IF(AND(SHAPE=127,D199>0,D199<GlassMinH),\"Glass Height is Under Minimum\",\"\"))))","v":""},null,null,"F",{"$f":"IF(AND(SHAPEW>0,SHAPEH>0,EXTLINK>1,SHAPE=127),2*(ASIN((GLASSOFFSET*2)/(2*D197))),0)","v":0},null,null,null,null,null,null,null,126,{"$f":"IF(SHAPE=126,3,0)","v":0},{"$f":"IF(S193>0,\"Frame Height:\",0)","v":0},{"$f":"IF(AND(S193>0,DIM_3>0),D183,0)","v":0},{"$f":"IF(AND(S193>0,SHAPEW>0,SHAPEH>0,DIM_3>0,D183>E179),1,0)","v":0},null,null,null,null,null,null,"6406","70.625","79.5","70.625","79.5","167"]
[null,null,"Frame Width:",{"$f":"IF(AND(SHAPEW>0,SHAPEH>0,EXTLINK>1,SHAPE=127,EXTLINK<=3),SHAPEW,IF(AND(SHAPEW>0,SHAPEH>0,SHAPE=127,EXTLINK>3),TRUNC((SHAPEW-(J192*2))*16+0.5)/16,0))","v":0},null,null,null,null,"d",{"$f":"IF(AND(SHAPEW>0,SHAPEH>0,EXTLINK>1,SHAPE=127),(D197*(COS(J193/2)))-GLASSOFFSET,0)","v":0},null,null,null,null,null,null,null,126,{"$f":"IF(SHAPE=126,4,0)","v":0},{"$f":"IF(S194>0,\"Frame Leg (Dim3):\",0)","v":0},{"$f":"IF(S194>0,D184,0)","v":0},{"$f":"IF(AND(S194>0,SHAPEW>0,SHAPEH>0,DIM_3>0,D184<C179),1,0)","v":0},null,null,null,null,null,null,"6408","94.5","79.5","94.5","79.5","190"]
[null,null,"Frame Height:",{"$f":"IF(AND(SHAPEW>0,SHAPEH>0,EXTLINK>1,SHAPE=127,EXTLINK<=3),SHAPEH,IF(AND(SHAPEW>0,SHAPEH>0,SHAPE=127,EXTLINK>3),TRUNC((((2*(SQRT(((SHAPEW/2)-OFFSET)*((2*D196)-((SHAPEW/2)-OFFSET)))))/2)-OFFSET)*16+0.5)/16,0))","v":0},null,"Cut @ Peak:",{"$f":"IF(AND(SHAPEW>0,SHAPEH>0,SHAPE=127,EXTLINK>3),(D195-J198)+OFFSET,IF(AND(SHAPEW>0,SHAPEH>0,EXTLINK>1,SHAPE=127,EXTLINK<=3),D195-J198,0))","v":0},null,"GW Deduct:",{"$f":"D197-J194","v":0},null,null,null,null,null,null,null,126,{"$f":"IF(SHAPE=126,5,0)","v":0},{"$f":"IF(S195>0,\"Frame Slanted Leg:\",0)","v":0},{"$f":"IF(AND(S195>0,DIM_3>0),D185,0)","v":0},{"$f":"IF(AND(S195>0,SHAPEW>0,SHAPEH>0,DIM_3>0,D185<C179),1,0)","v":0},null,null,null,null,null,null,"6409","105.5","79.5","105.5","79.5","201"]
[null,null,"Frame Radius:",{"$f":"IF(AND(SHAPEW>0,SHAPEH>0,EXTLINK>1,SHAPE=127,EXTLINK<=3),((SHAPEH)^2+(SHAPEW/2)^2)/(2*(SHAPEW/2)),IF(AND(SHAPEW>0,SHAPEH>0,SHAPE=127,EXTLINK>3),((SHAPEH)^2+(SHAPEW/2)^2)/(2*(SHAPEW/2))-OFFSET,0))","v":0},null,"Cut @ Corners:",{"$f":"IF(AND(SHAPEW>0,SHAPEH>0,EXTLINK>1,SHAPE=127),SQRT(EXTOFFSET^2+(Data!W64-Data!I64)^2),0)","v":0},null,"Ext. R:",{"$f":"IF(AND(SHAPEW>0,SHAPEH>0,EXTLINK>1,SHAPE=127),D196-EXTOFFSET,0)","v":0},null,null,null,null,null,null,null,126,{"$f":"IF(SHAPE=126,6,0)","v":0},{"$f":"IF(S196>0,\"Peak Cut Length:\",0)","v":0},{"$f":"IF(S196>0,D187,0)","v":0},{"$f":"IF(AND(S196>0,U196>D179),1,0)","v":0},null,null,null,null,null,null,"6412","139.5","79.5","139.5","79.5","235"]
[null,null,"Glass Radius:",{"$f":"IF(AND(SHAPEW>0,SHAPEH>0,EXTLINK>1,SHAPE=127),D196-GLASSOFFSET,0)","v":0},null,null,null,null,"Ext. h:",{"$f":"IF(AND(SHAPEW>0,SHAPEH>0,SHAPE=127,EXTLINK>3),(SHAPEW/2)-(OFFSET+EXTOFFSET),IF(AND(SHAPEW>0,SHAPEH>0,EXTLINK>1,SHAPE=127,EXTLINK<=3),(SHAPEW/2)-EXTOFFSET,0))","v":0},null,null,null,null,null,null,null,126,{"$f":"IF(SHAPE=126,7,0)","v":0},{"$f":"IF(S197>0,\"Peak Cut Angle:\",0)","v":0},{"$f":"IF(S197>0,D188,0)","v":0},{"$f":"IF(AND(S197>0,U197<D179),1,0)","v":0},null,null,null,null,null,null,"6422","140.875","79.5","140.875","79.5","237"]
[null,null,"Glass Width:",{"$f":"IF(AND(SHAPEW>0,SHAPEH>0,EXTLINK>1,SHAPE=127),FW-(J195*2),0)","v":0},null,null,null,null,null,{"$f":"(2*SQRT(J197*((2*J196)-J197)))/2","v":0},null,null,null,null,null,null,null,126,{"$f":"IF(SHAPE=126,8,0)","v":0},{"$f":"IF(S198>0,\"Glass Width:\",0)","v":0},{"$f":"IF(S198>0,G182,0)","v":0},{"$f":"IF(AND(U198>0,U198<GlassMinW),1,0)","v":0},null,null,null,null,null,null,"6475","74.5","79.5","74.5","79.5","155"]
[null,null,"Glass Height:",{"$f":"IF(AND(SHAPEW>0,SHAPEH>0,EXTLINK>1,SHAPE=127),(SQRT((D197-(((SHAPEW/2)-GLASSOFFSET)/2))*(8*((SHAPEW/2)-GLASSOFFSET))))/2-GLASSOFFSET,0)","v":0},null,null,null,null,null,null,null,null,null,null,null,null,null,126,{"$f":"IF(SHAPE=126,9,0)","v":0},{"$f":"IF(S199>0,\"Glass Height:\",0)","v":0},{"$f":"IF(S199>0,G183,0)","v":0},{"$f":"IF(AND(U199>0,U199<GlassMinH),1,0)","v":0},null,null,null,null,null,null,"6502","48","72","96","96","192"]
[null,null,null,null,null,null,null,null,null,null,null,null,null,null,null,null,null,126,{"$f":"IF(SHAPE=126,10,0)","v":0},{"$f":"IF(S200>0,\"Glass Leg:\",0)","v":0},{"$f":"IF(S200>0,G184,0)","v":0},null,null,null,null,null,null,null,"6503","84","72","144","96","240"]
[null,null,null,null,null,null,null,null,null,null,null,null,null,null,null,null,null,126,{"$f":"IF(SHAPE=126,11,0)","v":0},{"$f":"IF(S201>0,\"Max Width:\",0)","v":0},{"$f":"IF(S201>0,E179,0)","v":0},{"$f":"IF(AND(S201>0,SHAPEW>0,FW>U201),1,0)","v":0},null,null,null,null,null,null,"6504","96","72","144","96","240"]
[null,128,"Min R","Max W","Min Leg","Max UI","Cut L","Min W",null,null,null,null,null,null,null,null,null,126,{"$f":"IF(SHAPE=126,12,0)","v":0},{"$f":"IF(S202>0,\"Max Height:\",0)","v":0},{"$f":"IF(S202>0,E179,0)","v":0},{"$f":"IF(AND(S202>0,SHAPEH>0,FH>U202),1,0)","v":0},null,null,null,null,null,null,"6505","58.63","79.50","58.63","95.50","155"]
[null,{"$f":"EXT","v":1},{"$f":"MIN_R","v":""},{"$f":"MAX_W","v":""},{"$f":"MIN_LEG","v":""},{"$f":"MAX_UI","v":""},{"$f":"CUT_LENGTH","v":""},18,null,null,null,null,null,null,null,null,null,126,{"$f":"IF(SHAPE=126,13,0)","v":0},{"$f":"IF(S203>0,\"Max UI:\",0)","v":0},{"$f":"IF(S203>0,F179,0)","v":0},{"$f":"IF(AND(S203>0,F180>0),1,0)","v":0},null,null,null,null,null,null,"6506","70.63","79.50","70.63","95.50","167"]
[null,null,{"$f":"IF(AND(SHAPEW>0,SHAPEH>0,DIM_4>0,EXTLINK>1,SHAPE=128,D207<C203),1,0)","v":0},{"$f":"IF(AND(SHAPEW>0,SHAPE=128,EXTLINK>1,SHAPEH>0,DIM_4>0,OR(FW>D203,FH>D203)),1,0)","v":0},{"$f":"IF(AND(SHAPEH>0,SHAPE=128,EXTLINK>1,D210<E203),1,0)","v":0},{"$f":"IF(AND(SHAPEW>0,SHAPEH>0,SHAPE=128,EXTLINK>1,(FW+FH)>F203),1,0)","v":0},{"$f":"IF(AND(SHAPEW>0,SHAPEH>0,DIM_4>0,EXTLINK>1,SHAPE=128,K208>G191),1,0)","v":0},{"$f":"IF(AND(SHAPEW>0,SHAPEH>0,SHAPE=128,SHAPE=127,EXTLINK>1,FW<H203),1,0)","v":0},null,"F",{"$f":"IF(AND(SHAPEW>0,SHAPEH>0,DIM_4>0,SHAPE=128),2*(ASIN((GLASSOFFSET*2)/(2*G207))),0)","v":0},null,null,null,null,null,null,127,{"$f":"IF(SHAPE=127,1,0)","v":0},{"$f":"IF(S204>0,\"Frame Width:\",0)","v":0},{"$f":"IF(S204>0,FW,0)","v":0},{"$f":"IF(AND(S204>0,SHAPEW>0,SHAPEH>0,D192>0),1,0)","v":0},null,null,null,null,null,null,"6508","94.50","79.50","94.50","95.50","190"]
[null,null,{"$f":"MAX(C204:G204)","v":0},{"$f":"IF(AND(SHAPE=B202,C205=1),1,0)","v":0},{"$f":"IF(AND(SHAPEW>0,SHAPEH>0,(SHAPEH-DIM_4)<=(SHAPEW/2)),1,0)","v":0},{"$f":"IF(AND(SHAPE=128,E205=1),\"FRAME HEIGHT MINUS DIM4, MUST BE GREATER THAN 1/2 THE WIDTH\",IF(AND(SHAPE=128,SHAPEW>0,C204>0),\"RADIUS MUST BE GREATER THAN \"&C203,IF(AND(SHAPE=128,G208>0,G208<GlassMinW),\"Glass Width is Under Minimum\",IF(AND(SHAPE=128,G209>0,G209<GlassMinH),\"Glass Height is Under Minimum\",\"\"))))","v":""},null,null,null,"Ext. R:",{"$f":"IF(AND(SHAPEW>0,SHAPEH>0,EXTLINK>1,SHAPE=128),D207-EXTOFFSET,0)","v":0},null,null,null,null,null,null,127,{"$f":"IF(SHAPE=127,2,0)","v":0},{"$f":"IF(S205>0,\"Frame Height:\",0)","v":0},{"$f":"IF(S205>0,FH,0)","v":0},{"$f":"IF(AND(S205>0,E192>0),1,0)","v":0},null,null,null,null,null,null,"6509","105.50","79.50","105.50","95.50","201"]
[null,null,null,null,null,null,null,null,null,"Ext. h:",{"$f":"IF(AND(SHAPEW>0,SHAPEH>0,SHAPE=128,EXTLINK>3),(SHAPEW/2)-(OFFSET+EXTOFFSET),IF(AND(SHAPEW>0,SHAPEH>0,EXTLINK>1,SHAPE=128,EXTLINK<=3),(SHAPEW/2)-EXTOFFSET,0))","v":0},null,null,null,null,null,null,127,{"$f":"IF(SHAPE=127,3,0)","v":0},{"$f":"IF(S206>0,\"Frame Radius:\",0)","v":0},{"$f":"IF(S206>0,D196,0)","v":0},{"$f":"IF(AND(S206>0,SHAPEW>0,SHAPEH>0,C192>0),1,0)","v":0},null,null,null,null,null,null,"6512","139.50","79.50","139.50","95.50","235"]
[null,null,"Frame Radius:",{"$f":"IF(AND(SHAPEW>0,SHAPEH>0,DIM_4>0,EXTLINK>1,SHAPE=128,EXTLINK<=3),(((SHAPEH-DIM_4))^2+(SHAPEW/2)^2)/(2*(SHAPEW/2)),IF(AND(SHAPEW>0,SHAPEH>0,DIM_4>0,SHAPE=128,EXTLINK>3),((((SHAPEH-DIM_4))^2+(SHAPEW/2)^2)/(2*(SHAPEW/2)))-OFFSET,0))","v":0},null,"Glass Radius:",{"$f":"IF(AND(SHAPEW>0,SHAPEH>0,DIM_4>0,EXTLINK>1,SHAPE=128),D207-GLASSOFFSET,0)","v":0},null,null,null,{"$f":"IF(AND(SHAPEW>0,SHAPEH>0,DIM_4>0),(2*SQRT(K206*((2*K205)-K206)))/2,0)","v":0},null,null,null,null,null,null,127,{"$f":"IF(SHAPE=127,4,0)","v":0},{"$f":"IF(S207>0,\"Peak Cut Length:\",0)","v":0},{"$f":"IF(S207>0,G195,0)","v":0},{"$f":"IF(AND(S207>0,U207>G191),1,0)","v":0},null,null,null,null,null,null,"6522","140.88","79.50","140.88","95.50","237"]
[null,null,"Frame Width:",{"$f":"IF(AND(SHAPEW>0,SHAPEH>0,DIM_4>0,EXTLINK>1,SHAPE=128,EXTLINK<=3),SHAPEW,IF(AND(SHAPEW>0,SHAPEH>0,DIM_4>0,SHAPE=128,EXTLINK>3),SHAPEW-(OFFSET*2),0))","v":0},null,"Glass Width:",{"$f":"IF(AND(SHAPEW>0,SHAPEH>0,DIM_4>0,EXTLINK>1,SHAPE=128),FW-(GLASSOFFSET*2),0)","v":0},null,null,"Cut @ Peak:",{"$f":"IF(AND(SHAPEW>0,SHAPEH>0,DIM_4>0,SHAPE=128,EXTLINK>3),((D209-DIM_4)-K207)+OFFSET,IF(AND(SHAPEW>0,SHAPEH>0,EXTLINK>1,SHAPE=128,EXTLINK<=3),(D209-D210)-K207,0))","v":0},null,null,null,null,null,null,127,{"$f":"IF(SHAPE=127,5,0)","v":0},{"$f":"IF(S208>0,\"Corner Cut Length:\",0)","v":0},{"$f":"IF(S208>0,G196,0)","v":0},{"$f":"IF(AND(S208>0,U208>G191),1,0)","v":0},null,null,null,null,null,null,"8001","16","25.25","52","84","136"]
[null,null,"Frame Height:",{"$f":"IF(AND(SHAPEW>0,SHAPEH>0,DIM_4>0,EXTLINK>1,SHAPE=128,EXTLINK<=3),SHAPEH,IF(AND(SHAPEW>0,SHAPEH>0,DIM_4>0,SHAPE=128,EXTLINK>3),TRUNC((((2*(SQRT(((SHAPEW/2)-OFFSET)*((2*D207)-((SHAPEW/2)-OFFSET)))))/2)+DIM_4-OFFSET)*16+0.5)/16,0))","v":0},null,"Glass Height:",{"$f":"IF(AND(SHAPEW>0,SHAPEH>0,DIM_4>0,EXTLINK>1,SHAPE=128),(((SQRT((G207-(((FW/2)-GLASSOFFSET)/2))*(8*((FW/2)-GLASSOFFSET))))/2)-GLASSOFFSET)+D210,0)","v":0},null,null,"d",{"$f":"IF(AND(SHAPEW>0,SHAPEH>0,DIM_4>0,SHAPE=128),G207*COS(K204/2),0)","v":0},null,null,null,null,null,null,127,{"$f":"IF(SHAPE=127,6,0)","v":0},{"$f":"IF(S209>0,\"Glas Width:\",0)","v":0},{"$f":"IF(S209>0,D198,0)","v":0},{"$f":"IF(AND(U209>0,U209<GlassMinW),1,0)","v":0},null,null,null,null,null,null,"8002","25.25","16.625","84","68","148"]
[null,null,"Frame Leg:",{"$f":"IF(AND(SHAPEW>0,SHAPEH>0,DIM_4>0,EXTLINK>1,SHAPE=128,EXTLINK<=3),DIM_4,IF(AND(SHAPEW>0,SHAPEH>0,SHAPE=128,EXTLINK>3),DIM_4-OFFSET,0))","v":0},null,"Glass Leg H:",{"$f":"IF(AND(SHAPEW>0,SHAPEH>0,DIM_4>0,EXTLINK>1,SHAPE=128),D210-GLASSOFFSET,0)","v":0},null,null,"h",{"$f":"IF(AND(SHAPEW>0,SHAPEH>0,DIM_4>0,SHAPE=128),G207-K209,0)","v":0},null,null,null,null,null,null,127,{"$f":"IF(SHAPE=127,7,0)","v":0},{"$f":"IF(S210>0,\"Glass Height:\",0)","v":0},{"$f":"IF(S210>0,D199,0)","v":0},{"$f":"IF(AND(U210>0,U210<GlassMinH),1,0)","v":0},null,null,null,null,null,null,"8003","44.5","16.625","120","68","184"]
[null,null,null,null,null,null,null,null,null,"h_Glass",{"$f":"IF(AND(SHAPEW>0,SHAPEH>0,DIM_4>0,OFFSET>0,SHAPE=128),((FW/2)-((GLASSOFFSET*2)+K210)+GLASSOFFSET+K210),0)","v":0},null,null,null,null,null,null,127,{"$f":"IF(SHAPE=127,8,0)","v":0},{"$f":"IF(S211>0,\"Glass Radius:\",0)","v":0},{"$f":"IF(S211>0,D197,0)","v":0},null,null,null,null,null,null,null,"8005","14","14","72","60","118"]
[null,null,null,null,null,null,null,null,null,null,null,null,null,null,null,null,null,127,{"$f":"IF(SHAPE=127,9,0)","v":0},{"$f":"IF(S212>0,\"Max Width:\",0)","v":0},{"$f":"IF(S212>0,D191,0)","v":0},{"$f":"IF(AND(S212>0,SHAPEW>0,FW>U212),1,0)","v":0},null,null,null,null,null,null,"8009","35.5","16.625","120","68","184"]
[null,null,null,null,null,null,null,null,null,null,null,null,null,null,null,null,null,127,{"$f":"IF(SHAPE=127,10,0)","v":0},{"$f":"IF(S213>0,\"Max Height:\",0)","v":0},{"$f":"IF(S213>0,E191,0)","v":0},{"$f":"IF(AND(S213>0,SHAPEH>0,FH>U213),1,0)","v":0},null,null,null,null,null,null,"8014","13","13","96","84","154"]
[null,129,"Min Side","Min Cut","Max W","Max UI","Min Angle",null,null,null,null,null,null,null,null,null,null,127,{"$f":"IF(SHAPE=127,11,0)","v":0},{"$f":"IF(S214>0,\"Max UI:\",0)","v":0},{"$f":"IF(S214>0,F191,0)","v":0},{"$f":"IF(AND(S214>0,F192>0),1,0)","v":0},null,null,null,null,null,null,"8022","30","20","72","60","120"]
[null,{"$f":"EXT","v":1},{"$f":"MIN_LEG","v":""},{"$f":"CUT_LENGTH","v":""},{"$f":"MAX_W","v":""},{"$f":"MAX_UI","v":""},{"$f":"MIN_ANGLE","v":""},null,"Angle:",{"$f":"IF(AND(SHAPEH>0,SHAPEW>0,DIM_3>0,EXTLINK>1,SHAPE=129),DEGREES(ATAN(SHAPEW/(SHAPEH-DIM_3))),0)","v":0},null,null,null,null,null,null,null,127,{"$f":"IF(SHAPE=127,12,0)","v":0},{"$f":"IF(S215>0,\"Min Width:\",0)","v":0},{"$f":"IF(S215>0,H191,0)","v":0},{"$f":"IF(AND(S215>0,SHAPEH>0,FW<U215),1,0)","v":0},null,null,null,null,null,null,"8023","48","20","84","60","144"]
[null,null,{"$f":"IF(AND(SHAPEW>0,SHAPEH>0,DIM_3>0,EXTLINK>1,SHAPE=129,OR(FW<C215,FH<C215,D221<C215,D222<C215)),1,0)","v":0},{"$f":"IF(AND(SHAPEW>0,SHAPEH>0,DIM_3>0,EXTLINK>1,SHAPE=129,OR(J220>D215,J221>D215,J222>D215)),1,0)","v":0},{"$f":"IF(AND(SHAPEW>0,SHAPE=129,EXTLINK>1,OR(FW>E215,FH>E215)),1,0)","v":0},{"$f":"IF(AND(SHAPEW>0,SHAPEH>0,SHAPE=129,EXTLINK>1,(FW+FH)>F215),1,0)","v":0},{"$f":"IF(AND(SHAPEW>0,SHAPEH>0,DIM_3>0,SHAPE=129,J223<G215),1,0)","v":0},null,"Frame Peak Deduct:",{"$f":"IF(AND(SHAPEH>0,DIM_3>0,SHAPEW>0,EXTLINK>1,SHAPE=129),OFFSET/TAN(RADIANS(J215/2)),0)","v":0},null,null,null,null,null,null,null,128,{"$f":"IF(SHAPE=128,1,0)","v":0},{"$f":"IF(S216>0,\"Frame Width:\",0)","v":0},{"$f":"IF(S216>0,FW,0)","v":0},{"$f":"IF(AND(S216>0,SHAPEW>0,SHAPEH>0,DIM_4>0,U216>D203),1,0)","v":0},null,null,null,null,null,null,"8029","48","20","96","60","144"]
[null,null,{"$f":"MAX(C216:F216)","v":0},{"$f":"IF(AND(SHAPE=B214,C217=1),1,0)","v":0},null,{"$f":"IF(AND(SHAPE=129,G219>0,G219<GlassMinW),\"Glass Width is Under Minimum\",IF(AND(SHAPE=129,G220>0,G220<GlassMinH),\"Glass Height is Under Minimum\",IF(AND(SHAPE=129,SHAPEW>0,SHAPEH>0,J215<0),\"Angle can not be negative\",\"\")))","v":""},null,null,"Frame Leg Deduct:",{"$f":"IF(AND(SHAPEH>0,DIM_3>0,SHAPEW>0,EXTLINK>1,SHAPE=129),OFFSET*TAN(RADIANS(J215/2)),0)","v":0},null,null,null,null,null,null,null,128,{"$f":"IF(SHAPE=128,2,0)","v":0},{"$f":"IF(S217>0,\"Frame Height:\",0)","v":0},{"$f":"IF(S217>0,FH,0)","v":0},{"$f":"IF(AND(S217>0,DIM_4>0,U217>D203),1,0)","v":0},null,null,null,null,null,null,"8051","19","16","48","48","96"]
[null,null,"Roof Pitch:",{"$f":"IF(AND(SHAPEH>0,DIM_3>0,SHAPEW>0,EXTLINK>1,SHAPE=129),ROUND((12*((SHAPEH-DIM_3)/SHAPEW)),1)&\" /12\",0)","v":0},null,null,null,null,"Glass Peak Deduct:",{"$f":"IF(AND(SHAPEH>0,DIM_3>0,SHAPEW>0,EXTLINK>1,SHAPE=129),GLASSOFFSET/TAN(RADIANS(J215/2)),0)","v":0},null,null,null,null,null,null,null,128,{"$f":"IF(SHAPE=128,3,0)","v":0},{"$f":"IF(S218>0,\"Frame Radius:\",0)","v":0},{"$f":"IF(S218>0,D207,0)","v":0},{"$f":"IF(AND(S218>0,SHAPEW>0,SHAPEH>0,DIM_4>0,U218<C203),1,0)","v":0},null,null,null,null,null,null,"8052","19","32","48","96","144"]
[null,null,"Frame Width:",{"$f":"IF(AND(SHAPEW>0,SHAPEH>0,EXTLINK>1,DIM_3>0,SHAPE=129,EXTLINK<=3),SHAPEW,IF(AND(SHAPEW>0,SHAPEH>0,DIM_3>0,SHAPE=129,EXTLINK>3),SHAPEW-(OFFSET*2),0))","v":0},null,"Glass Width:",{"$f":"IF(AND(SHAPEH>0,SHAPEW>0,DIM_3>0,EXTLINK>1,SHAPE=129),FW-(GLASSOFFSET*2),0)","v":0},null,"Glass Leg Deduct:",{"$f":"IF(AND(SHAPEH>0,DIM_3>0,SHAPEW>0,EXTLINK>1,SHAPE=129),GLASSOFFSET*TAN(RADIANS(J215/2)),0)","v":0},null,null,null,null,null,null,null,128,{"$f":"IF(SHAPE=128,4,0)","v":0},{"$f":"IF(S219>0,\"Frame Leg:\",0)","v":0},{"$f":"IF(S219>0,D210,0)","v":0},{"$f":"IF(AND(S219>0,DIM_4>0,E204>0),1,0)","v":0},null,null,null,null,null,null,"8053","19","48","48","96","144"]
[null,null,"Frame Height:",{"$f":"IF(AND(SHAPEW>0,SHAPEH>0,EXTLINK>1,DIM_3>0,SHAPE=129,EXTLINK<=3),SHAPEH,IF(AND(SHAPEW>0,SHAPEH>0,DIM_3>0,SHAPE=129,EXTLINK>3),TRUNC((SHAPEH-(OFFSET+J216))*32+0.5)/32,0))","v":0},null,"Glass Height:",{"$f":"IF(AND(SHAPEH>0,SHAPEW>0,DIM_3>0,EXTLINK>1,SHAPE=129),FH-GLASSOFFSET-J218,0)","v":0},null,"Peak Cut Length:",{"$f":"IF(AND(SHAPEW>0,SHAPEH>0,EXTLINK>1,DIM_3>0,SHAPE=129),EXTOFFSET/SIN(RADIANS(J223)),0)","v":0},null,null,null,null,null,null,null,128,{"$f":"IF(SHAPE=128,5,0)","v":0},{"$f":"IF(S220>0,\"Peak Cut Length:\",0)","v":0},{"$f":"IF(S220>0,K208,0)","v":0},{"$f":"IF(AND(S220>0,U220>G203),1,0)","v":0},null,null,null,null,null,null,"8054","19","32","48","96","144"]
[null,null,"Frame Dim3:",{"$f":"IF(AND(SHAPEW>0,SHAPEH>0,EXTLINK>1,DIM_3>0,SHAPE=129,EXTLINK<=3),DIM_3,IF(AND(SHAPEW>0,SHAPEH>0,DIM_3>0,SHAPE=129,EXTLINK>3),TRUNC((DIM_3-(OFFSET+J217))*32+0.5)/32,0))","v":0},null,"Glass Dim3:",{"$f":"IF(AND(SHAPEH>0,SHAPEW>0,DIM_3>0,EXTLINK>1,SHAPE=129),D221-(GLASSOFFSET+J219),0)","v":0},null,"Dim3 & Slant Cut:",{"$f":"IF(AND(SHAPEH>0,SHAPEW>0,DIM_3>0,EXTLINK>1,SHAPE=129),EXTOFFSET/COS(RADIANS(J223)),0)","v":0},null,null,null,null,null,null,null,128,{"$f":"IF(SHAPE=128,6,0)","v":0},{"$f":"IF(S221>0,\"Glas Width:\",0)","v":0},{"$f":"IF(S221>0,G208,0)","v":0},{"$f":"IF(AND(S221>0,U221<GlassMinW),1,0)","v":0},null,null,null,null,null,null,"8055","19","32","48",96,144]
[null,null,"Slanted Leg:",{"$f":"IF(AND(SHAPEH>0,SHAPEW>0,DIM_3>0,EXTLINK>1,SHAPE=129,EXTLINK<=3),SQRT(SHAPEW^2+(SHAPEH-DIM_3)^2),IF(AND(SHAPEH>0,SHAPEW>0,DIM_3>0,SHAPE=129,EXTLINK>3),(SQRT(SHAPEW^2+(SHAPEH-DIM_3)^2))-(J216+J217),0))","v":0},null,null,null,null,"All 45O Cuts:",{"$f":"IF(AND(SHAPEH>0,SHAPEW>0,DIM_3>0,EXTLINK>1,SHAPE=129),EXTOFFSET/COS(RADIANS(45)),0)","v":0},null,null,null,null,null,null,null,128,{"$f":"IF(SHAPE=128,7,0)","v":0},{"$f":"IF(S222>0,\"Glass Height:\",0)","v":0},{"$f":"IF(S222>0,G209,0)","v":0},{"$f":"IF(AND(S222>0,U222<GlassMinH),1,0)","v":0},null,null,null,null,null,null,"8070","13","13","96",84,"154"]
[null,null,null,null,null,null,null,null,"Peak Cut Angle:",{"$f":"IF(AND(SHAPEH>0,SHAPEW>0,DIM_3>0,EXTLINK>1,SHAPE=129),J215/2,0)","v":0},null,null,null,null,null,null,null,128,{"$f":"IF(SHAPE=128,8,0)","v":0},{"$f":"IF(S223>0,\"Glass Radius:\",0)","v":0},{"$f":"IF(S223>0,G207,0)","v":0},null,null,null,null,null,null,null,"8071","16","19","36","78","114"]
[null,null,null,null,null,null,null,null,null,null,null,null,null,null,null,null,null,128,{"$f":"IF(SHAPE=128,9,0)","v":0},{"$f":"IF(S224>0,\"Glass Leg:\",0)","v":0},{"$f":"IF(S224>0,G210,0)","v":0},null,null,null,null,null,null,null,"8072","32","19","72","78","150"]
[null,null,null,null,null,null,null,null,null,null,null,null,null,null,null,null,null,128,{"$f":"IF(SHAPE=128,10,0)","v":0},{"$f":"IF(S225>0,\"Max Width:\",0)","v":0},{"$f":"IF(S225>0,D203,0)","v":0},{"$f":"IF(AND(S225>0,SHAPEW>0,FW>U225),1,0)","v":0},null,null,null,null,null,null,"8073","64","19","120","78","198"]
[null,130,"Min Side","Min Cut","Max W","Max UI","Min Angle",null,null,null,null,null,null,null,null,null,null,128,{"$f":"IF(SHAPE=128,11,0)","v":0},{"$f":"IF(S226>0,\"Min Width:\",0)","v":0},{"$f":"IF(S226>0,H203,0)","v":0},{"$f":"IF(AND(S226>0,SHAPEH>0,FW<U226),1,0)","v":0},null,null,null,null,null,null,"8074","64","19","120","78","198"]
[null,{"$f":"EXT","v":1},{"$f":"MIN_LEG","v":""},{"$f":"CUT_LENGTH","v":""},{"$f":"MAX_W","v":""},{"$f":"MAX_UI","v":""},{"$f":"MIN_ANGLE","v":""},null,"Angle:",{"$f":"IF(AND(SHAPEW>0,SHAPEH>0,EXTLINK>1,SHAPE=130),DEGREES(ATAN(SHAPEH/SHAPEW)),0)","v":0},null,null,null,null,null,null,null,128,{"$f":"IF(SHAPE=128,12,0)","v":0},{"$f":"IF(S227>0,\"Max Height:\",0)","v":0},{"$f":"IF(S227>0,D203,0)","v":0},{"$f":"IF(AND(S227>0,SHAPEH>0,FH>U227),1,0)","v":0},null,null,null,null,null,null,"8075","80","19","120","78","198"]
[null,null,{"$f":"IF(AND(SHAPEW>0,SHAPEH>0,SHAPE=130,OR(FW<C227,FH<C227)),1,0)","v":0},{"$f":"IF(AND(SHAPEW>0,SHAPEH>0,SHAPE=130,EXTLINK>1,OR(G232>D227,G233>D227,G234>D227)),1,0)","v":0},{"$f":"IF(AND(SHAPEW>0,SHAPEH>0,EXTLINK>1,SHAPE=130,OR(FW>E227,FH>E227)),1,0)","v":0},{"$f":"IF(AND(SHAPEW>0,SHAPEH>0,EXTLINK>1,SHAPE=130,(FW+FH)>F227),1,0)","v":0},{"$f":"IF(AND(SHAPEW>0,SHAPEH>0,EXTLINK>1,SHAPE=130,OR(G230<G227,G231<G227)),1,0)","v":0},null,"Frame Width Deduct:",{"$f":"IF(AND(SHAPEW>0,SHAPEH>0,EXTLINK>1,SHAPE=130),OFFSET/TAN(RADIANS(J227/2)),0)","v":0},null,null,null,null,null,null,null,128,{"$f":"IF(SHAPE=128,13,0)","v":0},{"$f":"IF(S228>0,\"Max UI:\",0)","v":0},{"$f":"IF(S228>0,F203,0)","v":0},{"$f":"IF(AND(S228>0,F204>0),1,0)","v":0},null,null,null,null,null,null,"8079","48","19","108","78","186"]
[null,null,{"$f":"MAX(C228:G228)","v":0},{"$f":"IF(AND(SHAPE=B226,C229=1),1,0)","v":0},null,{"$f":"IF(AND(SHAPE=130,D233>0,D233<GlassMinW),\"Glass Width is Under Minimum\",IF(AND(SHAPE=130,D234>0,D234<GlassMinH),\"Glass Height is Under Minimum\",\"\"))","v":""},null,null,"Frame Height Deduct:",{"$f":"IF(AND(SHAPEW>0,SHAPEH>0,EXTLINK>1,SHAPE=130),OFFSET/(TAN(RADIANS((DEGREES(ATAN(SHAPEW/SHAPEH)))/2))),0)","v":0},null,null,null,null,null,null,null,129,{"$f":"IF(SHAPE=129,1,0)","v":0},{"$f":"IF(S229>0,\"Roof Pitch:\",0)","v":0},{"$f":"IF(S229>0,D218,0)","v":0},{"$f":"IF(AND(SHAPE=129,SHAPEW>0,SHAPEH>0,J215<0),1,0)","v":0},null,null,null,null,null,null,"8102","48","72","96","96","180"]
[null,null,"Roof Pitch:",{"$f":"IF(AND(SHAPEW>0,SHAPEH>0,EXTLINK>1,SHAPE=130),ROUND((12*(TAN(RADIANS(J227)))),1)&\" /12\",0)","v":0},null,"Peak Angle:",{"$f":"IF(AND(SHAPEW>0,SHAPEH>0,EXTLINK>1,SHAPE=130),(180-J227-90)/2,0)","v":0},null,"Glass Width Deduct:",{"$f":"IF(AND(SHAPEW>0,SHAPEH>0,EXTLINK>1,SHAPE=130),GLASSOFFSET/TAN(RADIANS(J227/2)),0)","v":0},null,null,null,null,null,null,null,129,{"$f":"IF(SHAPE=129,2,0)","v":0},{"$f":"IF(S230>0,\"Frame Width:\",0)","v":0},{"$f":"IF(S230>0,FW,0)","v":0},{"$f":"IF(AND(S230>0,OR(FW<C215,E216>0)),1,0)","v":0},null,null,null,null,null,null,"8103","84","72","144","96","228"]
[null,null,"Frame Width:",{"$f":"IF(AND(SHAPEW>0,SHAPEH>0,EXTLINK>1,SHAPE=130,EXTLINK<=3),SHAPEW,IF(AND(SHAPEW>0,SHAPEH>0,SHAPE=130,EXTLINK>3),SHAPEW-(OFFSET+J228),0))","v":0},null,"Bott Corner Angle:",{"$f":"IF(AND(SHAPEW>0,SHAPEH>0,EXTLINK>1,SHAPE=130),J227/2,0)","v":0},null,"Glass Height Deduct:",{"$f":"IF(AND(SHAPEW>0,SHAPEH>0,EXTLINK>1,SHAPE=130),GLASSOFFSET/(TAN(RADIANS((DEGREES(ATAN(SHAPEW/SHAPEH)))/2))),0)","v":0},null,null,null,null,null,null,null,129,{"$f":"IF(SHAPE=129,3,0)","v":0},{"$f":"IF(S231>0,\"Frame Height:\",0)","v":0},{"$f":"IF(S231>0,FH,0)","v":0},{"$f":"IF(AND(S231>0,OR(FH<C215,E216>0)),1,0)","v":0},null,null,null,null,null,null,"8104","96","72","144","96","240"]
[null,null,"Frame Height:",{"$f":"IF(AND(SHAPEW>0,SHAPEH>0,EXTLINK>1,SHAPE=130,EXTLINK<=3),SHAPEH,IF(AND(SHAPEW>0,SHAPEH>0,SHAPE=130,EXTLINK>3),SHAPEH-(OFFSET+J229),0))","v":0},null,"Bottom Cut L:",{"$f":"IF(AND(SHAPEW>0,SHAPEH>0,EXTLINK>1,SHAPE=130),EXTOFFSET/(SIN(RADIANS((DEGREES(ATAN(SHAPEH/SHAPEW)))/2))),0)","v":0},null,null,null,null,null,null,null,null,null,null,129,{"$f":"IF(SHAPE=129,4,0)","v":0},{"$f":"IF(S232>0,\"Frame Dim3:\",0)","v":0},{"$f":"IF(S232>0,D221,0)","v":0},{"$f":"IF(AND(S232>0,C216>0),1,0)","v":0},null,null,null,null,null,null,"8105","58.625","79.5","58.625","79.5","139"]
[null,null,"Glass Width:",{"$f":"IF(AND(SHAPEW>0,SHAPEH>0,EXTLINK>1,SHAPE=130),FW-(GLASSOFFSET+J230),0)","v":0},null,"Top Cut Length:",{"$f":"IF(AND(SHAPEW>0,SHAPEH>0,EXTLINK>1,SHAPE=130),EXTOFFSET/(SIN(RADIANS((DEGREES(ATAN(SHAPEW/SHAPEH)))/2))),0)","v":0},null,null,null,null,null,null,null,null,null,null,129,{"$f":"IF(SHAPE=129,5,0)","v":0},{"$f":"IF(S233>0,\"Slanted Leg Length:\",0)","v":0},{"$f":"IF(S233>0,D222,0)","v":0},{"$f":"IF(AND(S233>0,U233<C215),1,0)","v":0},null,null,null,null,null,null,"8106","70.625","79.5","70.625","79.5","151"]
[null,null,"Glass Height:",{"$f":"IF(AND(SHAPEW>0,SHAPEH>0,EXTLINK>1,SHAPE=130),FH-(GLASSOFFSET+J231),0)","v":0},null,"Corner Cut L:",{"$f":"IF(AND(SHAPEW>0,SHAPEH>0,EXTLINK>1,SHAPE=130),SQRT(EXTOFFSET^2+CUTOFFSET^2),0)","v":0},null,null,null,null,null,null,null,null,null,null,129,{"$f":"IF(SHAPE=129,6,0)","v":0},{"$f":"IF(S234>0,\"Peak Cut Angle:\",0)","v":0},{"$f":"IF(S234>0,J223,0)","v":0},{"$f":"IF(AND(S234>0,G216>0),1,0)","v":0},null,null,null,null,null,null,"8108","94.25","79.5","94.25","79.5","175"]
[null,null,null,null,null,null,null,null,null,null,null,null,null,null,null,null,null,129,{"$f":"IF(SHAPE=129,7,0)","v":0},{"$f":"IF(S235>0,\"Peak Cut Length:\",0)","v":0},{"$f":"IF(S235>0,J220,0)","v":0},{"$f":"IF(AND(S235>0,U235>D215),1,0)","v":0},null,null,null,null,null,null,"8109","105.5","79.5","105.5","79.5","186"]
[null,null,null,null,null,null,null,null,null,null,null,null,null,null,null,null,null,129,{"$f":"IF(SHAPE=129,8,0)","v":0},{"$f":"IF(S236>0,\"Leg & Slant Cut L:\",0)","v":0},{"$f":"IF(S236>0,J221,0)","v":0},{"$f":"IF(AND(S236>0,U236>D215),1,0)","v":0},null,null,null,null,null,null,"8112","139.5","79.5","139.5","79.5","220"]
[null,131,"Min Side","Min Cut","Max W","Max UI","Min W",null,null,null,null,null,null,null,null,null,null,129,{"$f":"IF(SHAPE=129,9,0)","v":0},{"$f":"IF(S237>0,\"Glass Width:\",0)","v":0},{"$f":"IF(S237>0,G219,0)","v":0},{"$f":"IF(AND(U237>0,U237<GlassMinW),1,0)","v":0},null,null,null,null,null,null,"8122","140.875","79.5","140.875","79.5","221"]
[null,{"$f":"EXT","v":1},{"$f":"MIN_LEG","v":""},{"$f":"CUT_LENGTH","v":""},{"$f":"MAX_W","v":""},{"$f":"MAX_UI","v":""},12,null,"Cut Length:",{"$f":"IF(AND(SHAPEW>0,EXTLINK>1,SHAPE=131),EXTOFFSET/(SIN(RADIANS(30))),0)","v":0},null,null,null,null,null,null,null,129,{"$f":"IF(SHAPE=129,10,0)","v":0},{"$f":"IF(S238>0,\"Glass Height:\",0)","v":0},{"$f":"IF(S238>0,G220,0)","v":0},{"$f":"IF(AND(U238>0,U238<GlassMinH),1,0)","v":0},null,null,null,null,null,null,"8175","74.5","79.5","74.5","79.5","154"]
[null,null,{"$f":"IF(AND(SHAPEW>0,EXTLINK>1,SHAPE=131,FW<C238),1,0)","v":0},{"$f":"IF(AND(SHAPEW>0,EXTLINK>1,SHAPE=131,J238>D238),1,0)","v":0},{"$f":"IF(AND(SHAPEW>0,EXTLINK>1,SHAPE=131,FW>E238),1,0)","v":0},{"$f":"IF(AND(SHAPEW>0,EXTLINK>1,SHAPE=131,(FW+FH)>F238),1,0)","v":0},{"$f":"IF(AND(SHAPEW>0,EXTLINK>1,SHAPE=131,FW<G238),1,0)","v":0},null,null,null,null,null,null,null,null,null,null,129,{"$f":"IF(SHAPE=129,11,0)","v":0},{"$f":"IF(S239>0,\"Glass Dim3:\",0)","v":0},{"$f":"IF(S239>0,G221,0)","v":0},null,null,null,null,null,null,null,"8202","48","72","96","96","192"]
[null,null,{"$f":"MAX(C239:G239)","v":0},{"$f":"IF(AND(SHAPE=B237,C240=1),1,0)","v":0},null,{"$f":"IF(AND(SHAPE=131,G242>0,G242<GlassMinW),\"Glass Width is Under Minimum\",IF(AND(SHAPE=131,G243>0,G243<GlassMinH),\"Glass Height is Under Minimum\",\"\"))","v":""},null,null,null,null,null,null,null,null,null,null,null,129,{"$f":"IF(SHAPE=129,12,0)","v":0},{"$f":"IF(S240>0,\"Min. Section:\",0)","v":0},{"$f":"IF(S240>0,C215,0)","v":0},{"$f":"IF(AND(SHAPEW>0,SHAPEH>0,U240>0,C216>0),1,0)","v":0},null,null,null,null,null,null,"8203","84","72","144","96","240"]
[null,null,null,null,null,null,null,null,null,null,null,null,null,null,null,null,null,129,{"$f":"IF(SHAPE=129,13,0)","v":0},{"$f":"IF(S241>0,\"Max Width:\",0)","v":0},{"$f":"IF(S241>0,E215,0)","v":0},{"$f":"IF(AND(S241>0,SHAPEW>0,FW>U241),1,0)","v":0},null,null,null,null,null,null,"8204","96","72","144","96","240"]
[null,null,"Roof Pitch:",{"$f":"IF(AND(SHAPEW>0,EXTLINK>1,SHAPE=131),ROUND((TAN(RADIANS((60)))*12),1)&\" /12\",0)","v":0},null,"Glass Width:",{"$f":"IF(AND(SHAPEW>0,EXTLINK>1,SHAPE=131),FW-((SQRT(J243^2-GLASSOFFSET^2))*2),0)","v":0},null,"Frame Deduct:",{"$f":"IF(AND(SHAPEW>0,EXTLINK>1,SHAPE=131),OFFSET/(SIN(RADIANS(30))),0)","v":0},null,null,null,null,null,null,null,129,{"$f":"IF(SHAPE=129,14,0)","v":0},{"$f":"IF(S242>0,\"Max Height:\",0)","v":0},{"$f":"IF(S242>0,E215,0)","v":0},{"$f":"IF(AND(S242>0,SHAPEH>0,FH>U242),1,0)","v":0},null,null,null,null,null,null,"8205","58.625","79.5","58.625","79.5","139"]
[null,null,"Frame Width:",{"$f":"IF(AND(SHAPEW>0,EXTLINK>1,SHAPE=131,EXTLINK<=3),SHAPEW,IF(AND(SHAPEW>0,SHAPE=131,EXTLINK>3),TRUNC((SHAPEW-((SQRT(J242^2-OFFSET^2))*2))*16+0.5)/16,0))","v":0},null,"Glass Height:",{"$f":"IF(AND(SHAPEW>0,EXTLINK>1,SHAPE=131),D244-GLASSOFFSET-J243,0)","v":0},null,"Glass Deduct:",{"$f":"IF(AND(SHAPEW>0,EXTLINK>1,SHAPE=131),GLASSOFFSET/(SIN(RADIANS(30))),0)","v":0},null,null,null,null,null,null,null,129,{"$f":"IF(SHAPE=129,15,0)","v":0},{"$f":"IF(S243>0,\"Max UI:\",0)","v":0},{"$f":"IF(S243>0,F215,0)","v":0},{"$f":"IF(AND(S243>0,F216>0),1,0)","v":0},null,null,null,null,null,null,"8206","70.625","79.5","70.625","79.5","151"]
[null,null,"Frame Height:",{"$f":"IF(AND(SHAPEW>0,SHAPE=131,EXTLINK>3),TRUNC((SHAPEW*SIN(RADIANS(60)))*16+0.5)/16,IF(AND(SHAPEW>0,SHAPE=131,EXTLINK>1,EXTLINK<=3),TRUNC((FW*SIN(RADIANS(60)))*16+0.5)/16,0))","v":0},null,null,null,null,null,null,null,null,null,null,null,null,null,130,{"$f":"IF(SHAPE=130,1,0)","v":0},{"$f":"IF(S244>0,\"Roof Pitch:\",0)","v":0},{"$f":"IF(S244>0,D230,0)","v":0},null,null,null,null,null,null,null,"8208","94.25","79.5","94.25","79.5","175"]
[null,null,null,null,null,null,null,null,null,null,null,null,null,null,null,null,null,130,{"$f":"IF(SHAPE=130,2,0)","v":0},{"$f":"IF(S245>0,\"Frame Width:\",0)","v":0},{"$f":"IF(S245>0,FW,0)","v":0},{"$f":"IF(AND(S245>0,OR(FW<C227,E228>0)),1,0)","v":0},null,null,null,null,null,null,"8209","105.5","79.5","105.5","79.5","186"]
[null,null,null,null,null,null,null,null,null,null,null,null,null,null,null,null,null,130,{"$f":"IF(SHAPE=130,3,0)","v":0},{"$f":"IF(S246>0,\"Frame Height:\",0)","v":0},{"$f":"IF(S246>0,FH,0)","v":0},{"$f":"IF(AND(S246>0,OR(FH<C227,E228>0)),1,0)","v":0},null,null,null,null,null,null,"8212","139.5","79.5","139.5","79.5","220"]
[null,132,"Min Side","Min Cut","Max W","Max UI","Min Angle","Min W",null,null,null,null,null,null,null,null,null,130,{"$f":"IF(SHAPE=130,4,0)","v":0},{"$f":"IF(S247>0,\"Min Side:\",0)","v":0},{"$f":"IF(S247>0,C215,0)","v":0},{"$f":"IF(AND(S247>0,C228>0),1,0)","v":0},null,null,null,null,null,null,"8222","140.875","79.5","140.875","79.5","221"]
[null,{"$f":"EXT","v":1},{"$f":"MIN_LEG","v":""},{"$f":"CUT_LENGTH","v":""},{"$f":"MAX_W","v":""},{"$f":"MAX_UI","v":""},{"$f":"MIN_ANGLE","v":""},12,null,"Bottom Angles:",{"$f":"IF(AND(SHAPEW>0,SHAPEH>0,EXTLINK>1,SHAPE=132),DEGREES(ATAN(SHAPEH/(SHAPEW/2))),0)","v":0},null,null,null,null,null,null,130,{"$f":"IF(SHAPE=130,5,0)","v":0},{"$f":"IF(S248>0,\"Peak Cut Angle:\",0)","v":0},{"$f":"IF(S248>0,G230,0)","v":0},{"$f":"IF(AND(S248>0,SHAPEW>0,SHAPEH>0,U248<G227),1,0)","v":0},null,null,null,null,null,null,"8275","74.5","79.5","74.5","79.5","154"]
[null,null,{"$f":"IF(AND(SHAPEW>0,SHAPEH>0,EXTLINK>1,SHAPE=132,OR(FW<C248,D254<C248)),1,0)","v":0},{"$f":"IF(AND(SHAPEW>0,SHAPEH>0,EXTLINK>1,SHAPE=132,OR(G254>D248,G255>D248)),1,0)","v":0},{"$f":"IF(AND(SHAPEW>0,SHAPEH>0,EXTLINK>1,SHAPE=132,OR(FW>E248,FH>E248)),1,0)","v":0},{"$f":"IF(AND(SHAPEW>0,SHAPEH>0,EXTLINK>1,SHAPE=132,(FW+FH)>F248),1,0)","v":0},{"$f":"IF(AND(SHAPEW>0,SHAPEH>0,EXTLINK>1,SHAPE=130,OR(K248<G248,K249<G248)),1,0)","v":0},{"$f":"IF(AND(SHAPEW>0,SHAPEH>0,SHAPE=132,EXTLINK>1,FW<H248),1,0)","v":0},null,"Peak Angle:",{"$f":"IF(AND(SHAPEW>0,SHAPEH>0,EXTLINK>1,SHAPE=132),180-(K248*2),0)","v":0},null,null,null,null,null,null,130,{"$f":"IF(SHAPE=130,6,0)","v":0},{"$f":"IF(S249>0,\"Peak Cut Length:\",0)","v":0},{"$f":"IF(S249>0,G233,0)","v":0},{"$f":"IF(AND(S249>0,U249>D227),1,0)","v":0},null,null,null,null,null,null,"8402","48","72","96","96","192"]
[null,null,{"$f":"MAX(C249:H249)","v":0},{"$f":"IF(AND(SHAPE=B247,C250=1),1,0)","v":0},null,{"$f":"IF(AND(SHAPE=132,G251>0,G251<GlassMinW),\"Glass Width is Under Minimum\",IF(AND(SHAPE=132,G252>0,G252<GlassMinH),\"Glass Height is Under Minimum\",\"\"))","v":""},null,null,null,"Frame Peak Deduct:",{"$f":"IF(AND(SHAPEW>0,SHAPEH>0,EXTLINK>1,SHAPE=132),OFFSET/(SIN(RADIANS(K249/2))),0)","v":0},null,null,null,null,null,null,130,{"$f":"IF(SHAPE=130,7,0)","v":0},{"$f":"IF(S250>0,\"Sill & Slant Angle:\",0)","v":0},{"$f":"IF(S250>0,G231,0)","v":0},{"$f":"IF(AND(S250>0,SHAPEW>0,SHAPEH>0,U250<G227),1,0)","v":0},null,null,null,null,null,null,"8403","84","72",144,"96","240"]
[null,null,"Roof Pitch:",{"$f":"IF(AND(SHAPEW>0,SHAPEH>0,EXTLINK>1,SHAPE=132),ROUND((12*(TAN(RADIANS(K248)))),1)&\" /12\",0)","v":0},null,"Glass Width:",{"$f":"IF(AND(SHAPEW>0,SHAPEH>0,EXTLINK>1,SHAPE=132),FW-(K253*2),0)","v":0},null,null,"Frame Corner Deduct:",{"$f":"IF(AND(SHAPEW>0,SHAPEH>0,EXTLINK>1,SHAPE=132),OFFSET/(TAN(RADIANS(K248/2))),0)","v":0},null,null,null,null,null,null,130,{"$f":"IF(SHAPE=130,8,0)","v":0},{"$f":"IF(S251>0,\"Sill & Slant Cut L:\",0)","v":0},{"$f":"IF(S251>0,G232,0)","v":0},{"$f":"IF(AND(S251>0,U251>D227),1,0)","v":0},null,null,null,null,null,null,"8404","96","72","144","96","240"]
[null,null,"Frame Width:",{"$f":"IF(AND(SHAPEW>0,SHAPEH>0,EXTLINK>1,SHAPE=132,EXTLINK<=3),SHAPEW,IF(AND(SHAPEW>0,SHAPEH>0,SHAPE=132,EXTLINK>3),TRUNC((SHAPEW-(K251*2))*16+0.5)/16,0))","v":0},null,"Glass Height:",{"$f":"IF(AND(SHAPEW>0,SHAPEH>0,EXTLINK>1,SHAPE=132),FH-GLASSOFFSET-K252,0)","v":0},null,null,"Glass Peak Deduct:",{"$f":"IF(AND(SHAPEW>0,SHAPEH>0,EXTLINK>1,SHAPE=132),GLASSOFFSET/(SIN(RADIANS(K249/2))),0)","v":0},null,null,null,null,null,null,130,{"$f":"IF(SHAPE=130,9,0)","v":0},{"$f":"IF(S252>0,\"Corner Cut L:\",0)","v":0},{"$f":"IF(S252>0,G234,0)","v":0},{"$f":"IF(AND(S252>0,U252>D227),1,0)","v":0},null,null,null,null,null,null,"8405","58.625","79.5","58.625","79.5","155"]
[null,null,"Frame Height:",{"$f":"IF(AND(SHAPEW>0,SHAPEH>0,EXTLINK>1,SHAPE=132,EXTLINK<=3),SHAPEH,IF(AND(SHAPEW>0,SHAPEH>0,SHAPE=132,EXTLINK>3),TRUNC((SHAPEH-(OFFSET+K250))*16+0.5)/16,0))","v":0},null,null,null,null,null,"Glass Corner Deduct:",{"$f":"IF(AND(SHAPEW>0,SHAPEH>0,EXTLINK>1,SHAPE=132),GLASSOFFSET/(TAN(RADIANS(K248/2))),0)","v":0},null,null,null,null,null,null,130,{"$f":"IF(SHAPE=130,10,0)","v":0},{"$f":"IF(S253>0,\"Glass Width:\",0)","v":0},{"$f":"IF(S253>0,D233,0)","v":0},{"$f":"IF(AND(U253>0,U253<GlassMinW),1,0)","v":0},null,null,null,null,null,null,"8406","70.625","79.5","70.625","79.5","167"]
[null,null,"Sides Length:",{"$f":"IF(AND(SHAPEW>0,SHAPEH>0,SHAPE=132,EXTLINK>3),SQRT(SHAPEH^2+(SHAPEW/2)^2),IF(AND(SHAPEW>0,SHAPEH>0,EXTLINK>1,SHAPE=132,EXTLINK<=3),SQRT(FH^2+(FW/2)^2),0))","v":0},null,"Bottom Cut L:",{"$f":"IF(AND(SHAPEW>0,SHAPEH>0,EXTLINK>1,SHAPE=132),EXTOFFSET/(SIN(RADIANS(K248/2))),0)","v":0},null,null,null,null,null,null,null,null,null,null,130,{"$f":"IF(SHAPE=130,11,0)","v":0},{"$f":"IF(S254>0,\"Glass Height:\",0)","v":0},{"$f":"IF(S254>0,D234,0)","v":0},{"$f":"IF(AND(U254>0,U254<GlassMinH),1,0)","v":0},null,null,null,null,null,null,"8408","94.5","79.5","94.5","79.5","190"]
[null,null,null,null,null,"Top Cut Length:",{"$f":"IF(AND(SHAPEW>0,SHAPEH>0,EXTLINK>1,SHAPE=132),EXTOFFSET/(SIN(RADIANS(K249/2))),0)","v":0},null,null,null,null,null,null,null,null,null,null,130,{"$f":"IF(SHAPE=130,12,0)","v":0},{"$f":"IF(S255>0,\"Max Width:\",0)","v":0},{"$f":"IF(S255>0,E227,0)","v":0},{"$f":"IF(AND(S255>0,FW>0,E228>0),1,0)","v":0},null,null,null,null,null,null,"8409","105.5","79.5","105.5","79.5","201"]
[null,null,null,null,null,null,null,null,null,null,null,null,null,null,null,null,null,130,{"$f":"IF(SHAPE=130,13,0)","v":0},{"$f":"IF(S256>0,\"Max Height:\",0)","v":0},{"$f":"IF(S256>0,E227,0)","v":0},{"$f":"IF(AND(S256>0,SHAPEH>0,E228>0),1,0)","v":0},null,null,null,null,null,null,"8412","139.5","79.5","139.5","79.5","235"]
[null,null,null,null,null,null,null,null,null,null,null,null,null,null,null,null,null,130,{"$f":"IF(SHAPE=130,14,0)","v":0},{"$f":"IF(S257>0,\"Max UI:\",0)","v":0},{"$f":"IF(S257>0,F227,0)","v":0},{"$f":"IF(AND(S257>0,F228>0),1,0)","v":0},null,null,null,null,null,null,"8422","140.875","79.5","140.875","79.5","237"]
[null,null,null,null,null,null,null,null,null,null,null,null,null,null,null,null,null,131,{"$f":"IF(SHAPE=131,1,0)","v":0},{"$f":"IF(S258>0,\"Roof Pitch:\",0)","v":0},{"$f":"IF(S258>0,D242,0)","v":0},null,null,null,null,null,null,null,"8475","74.5","79.5","74.5","79.5","155"]
[null,null,null,null,null,null,null,null,null,null,null,null,null,null,null,null,null,131,{"$f":"IF(SHAPE=131,2,0)","v":0},{"$f":"IF(S259>0,\"Frame Width:\",0)","v":0},{"$f":"IF(S259>0,FW,0)","v":0},{"$f":"IF(AND(S259>0,G2399>0),1,0)","v":0},null,null,null,null,null,null,"9001","16","26","52","84","136"]
[null,null,null,null,null,null,null,null,null,null,null,null,null,null,null,null,null,131,{"$f":"IF(SHAPE=131,3,0)","v":0},{"$f":"IF(S260>0,\"Frame Height:\",0)","v":0},{"$f":"IF(S260>0,FH,0)","v":0},null,null,null,null,null,null,null,"9002","25.25","16.625","84","68","148"]
[null,null,null,null,null,null,null,null,null,null,null,null,null,null,null,null,null,131,{"$f":"IF(SHAPE=131,4,0)","v":0},{"$f":"IF(S261>0,\"All Cut Length:\",0)","v":0},{"$f":"IF(S261>0,J238,0)","v":0},{"$f":"IF(AND(S261>0,D239>0),1,0)","v":0},null,null,null,null,null,null,"9003","44.5","16.625","120","68","184"]
[null,null,null,null,null,null,null,null,null,null,null,null,null,null,null,null,null,131,{"$f":"IF(SHAPE=131,5,0)","v":0},{"$f":"IF(S262>0,\"All Cut Angles:\",0)","v":0},{"$f":"IF(S262>0,30,0)","v":0},null,null,null,null,null,null,null,"9005","14","14","72","60","118"]
[null,null,null,null,null,null,null,null,null,null,null,null,null,null,null,null,null,131,{"$f":"IF(SHAPE=131,6,0)","v":0},{"$f":"IF(S263>0,\"Glass Width:\",0)","v":0},{"$f":"IF(S263>0,G242,0)","v":0},{"$f":"IF(AND(U263>0,U263<GlassMinW),1,0)","v":0},null,null,null,null,null,null,"9009","35.5","16.625","120","68","184"]
[null,null,null,null,null,null,null,null,null,null,null,null,null,null,null,null,null,131,{"$f":"IF(SHAPE=131,7,0)","v":0},{"$f":"IF(S264>0,\"Glass Height:\",0)","v":0},{"$f":"IF(S264>0,G243,0)","v":0},{"$f":"IF(AND(U264>0,U264<GlassMinH),1,0)","v":0},null,null,null,null,null,null,"9014","13","13","96","84","154"]
[null,null,null,null,null,null,null,null,null,null,null,null,null,null,null,null,null,131,{"$f":"IF(SHAPE=131,8,0)","v":0},{"$f":"IF(S265>0,\"Max Width:\",0)","v":0},{"$f":"IF(S265>0,E238,0)","v":0},{"$f":"IF(AND(S265>0,SHAPEW>0,FW>U265),1,0)","v":0},null,null,null,null,null,null,"9022","30","20","72","60","120"]
[null,null,null,null,null,null,null,null,null,null,null,null,null,null,null,null,null,131,{"$f":"IF(SHAPE=131,9,0)","v":0},{"$f":"IF(S266>0,\"Max UI:\",0)","v":0},{"$f":"IF(S266>0,F238,0)","v":0},{"$f":"IF(AND(S266>0,F239>0),1,0)","v":0},null,null,null,null,null,null,"9023","48","20","84","60","144"]
[null,null,null,null,null,null,null,null,null,null,null,null,null,null,null,null,null,131,{"$f":"IF(SHAPE=131,10,0)","v":0},{"$f":"IF(S267>0,\"Min Width:\",0)","v":0},{"$f":"IF(S267>0,G238,0)","v":0},{"$f":"IF(AND(S267>0,SHAPEW>0,G239>0),1,0)","v":0},null,null,null,null,null,null,"9029","48","20","96","60","144"]
[null,null,null,null,null,null,null,null,null,null,null,null,null,null,null,null,null,132,{"$f":"IF(SHAPE=132,1,0)","v":0},{"$f":"IF(S268>0,\"Roof Pitch:\",0)","v":0},{"$f":"IF(S268>0,D251,0)","v":0},null,null,null,null,null,null,null,"9051","19","16","48","48","96"]
[null,null,null,null,null,null,null,null,null,null,null,null,null,null,null,null,null,132,{"$f":"IF(SHAPE=132,2,0)","v":0},{"$f":"IF(S269>0,\"Frame Width:\",0)","v":0},{"$f":"IF(S269>0,FW,0)","v":0},{"$f":"IF(AND(S269>0,OR(FW<C248,FW>E248)),1,0)","v":0},null,null,null,null,null,null,"9052","19","32","48","96","144"]
[null,null,null,null,null,null,null,null,null,null,null,null,null,null,null,null,null,132,{"$f":"IF(SHAPE=132,3,0)","v":0},{"$f":"IF(S270>0,\"Frame Height:\",0)","v":0},{"$f":"IF(S270>0,FH,0)","v":0},{"$f":"IF(AND(S270>0,OR(FH<C248,FH>E248)),1,0)","v":0},null,null,null,null,null,null,"9053","19","48","48","96","144"]
[null,null,null,null,null,null,null,null,null,null,null,null,null,null,null,null,null,132,{"$f":"IF(SHAPE=132,4,0)","v":0},{"$f":"IF(S271>0,\"Min Side:\",0)","v":0},{"$f":"IF(S271>0,C248,0)","v":0},{"$f":"IF(AND(S271>0,C249>0),1,0)","v":0},null,null,null,null,null,null,"9054","19","32","48","96","144"]
[null,null,null,null,null,null,null,null,null,null,null,null,null,null,null,null,null,132,{"$f":"IF(SHAPE=132,5,0)","v":0},{"$f":"IF(S272>0,\"Sides Length:\",0)","v":0},{"$f":"IF(S272>0,D254,0)","v":0},{"$f":"IF(AND(S272>0,C249>0),1,0)","v":0},null,null,null,null,null,null,"9055","19","32","48","96","144"]
[null,null,null,null,null,null,null,null,null,null,null,null,null,null,null,null,null,132,{"$f":"IF(SHAPE=132,6,0)","v":0},{"$f":"IF(S273>0,\"Peak Cut Angle:\",0)","v":0},{"$f":"IF(S273>0,K249/2,0)","v":0},{"$f":"IF(AND(S273>0,SHAPEW>0,SHAPEH>0,U273<G248),1,0)","v":0},null,null,null,null,null,null,"9070","13","13","96","84","154"]
[null,null,null,null,null,null,null,null,null,null,null,null,null,null,null,null,null,132,{"$f":"IF(SHAPE=132,7,0)","v":0},{"$f":"IF(S274>0,\"Peak Cut L:\",0)","v":0},{"$f":"IF(S274>0,G255,0)","v":0},{"$f":"IF(AND(S274>0,U274>D248),1,0)","v":0},null,null,null,null,null,null,"9071","16","19","36","78","114"]
[null,null,null,null,null,null,null,null,null,null,null,null,null,null,null,null,null,132,{"$f":"IF(SHAPE=132,8,0)","v":0},{"$f":"IF(S275>0,\"Corner Cut Angle:\",0)","v":0},{"$f":"IF(S275>0,K248/2,0)","v":0},{"$f":"IF(AND(S275>0,SHAPEW>0,SHAPEH>0,U275<G248),1,0)","v":0},null,null,null,null,null,null,"9072","32","19","72","78","150"]
[null,null,null,null,null,null,null,null,null,null,null,null,null,null,null,null,null,132,{"$f":"IF(SHAPE=132,9,0)","v":0},{"$f":"IF(S276>0,\"Corner Cut L:\",0)","v":0},{"$f":"IF(S276>0,G254,0)","v":0},{"$f":"IF(AND(S276>0,U276>D248),1,0)","v":0},null,null,null,null,null,null,"9073","64","19","120","78","198"]
[null,null,null,null,null,null,null,null,null,null,null,null,null,null,null,null,null,132,{"$f":"IF(SHAPE=132,10,0)","v":0},{"$f":"IF(S277>0,\"Glass Width:\",0)","v":0},{"$f":"IF(S277>0,G251,0)","v":0},{"$f":"IF(AND(U277>0,U277<GlassMinW),1,0)","v":0},null,null,null,null,null,null,"9074","64","19","120","78","198"]
[null,null,null,null,null,null,null,null,null,null,null,null,null,null,null,null,null,132,{"$f":"IF(SHAPE=132,11,0)","v":0},{"$f":"IF(S278>0,\"Glass Height:\",0)","v":0},{"$f":"IF(S278>0,G252,0)","v":0},{"$f":"IF(AND(U278>0,U278<GlassMinH),1,0)","v":0},null,null,null,null,null,null,"9075","80","19","120","78","198"]
[null,null,null,null,null,null,null,null,null,null,null,null,null,null,null,null,null,132,{"$f":"IF(SHAPE=132,12,0)","v":0},{"$f":"IF(S279>0,\"Max Width:\",0)","v":0},{"$f":"IF(S279>0,E248,0)","v":0},{"$f":"IF(AND(S279>0,SHAPEW>0,FW>U279),1,0)","v":0},null,null,null,null,null,null,"9079","48","19","108","78","186"]
[null,null,null,null,null,null,null,null,null,null,null,null,null,null,null,null,null,132,{"$f":"IF(SHAPE=132,13,0)","v":0},{"$f":"IF(S280>0,\"Max Height:\",0)","v":0},{"$f":"IF(S280>0,E248,0)","v":0},{"$f":"IF(AND(S280>0,SHAPEH>0,FH>U280),1,0)","v":0},null,null,null,null,null,null,"9102","48","72","96","96","180"]
[null,null,null,null,null,null,null,null,null,null,null,null,null,null,null,null,null,132,{"$f":"IF(SHAPE=132,14,0)","v":0},{"$f":"IF(S281>0,\"Max UI:\",0)","v":0},{"$f":"IF(S281>0,F248,0)","v":0},{"$f":"IF(AND(S281>0,F249>0),1,0)","v":0},null,null,null,null,null,null,"9103","84","72","144","96","228"]
[null,null,null,null,null,null,null,null,null,null,null,null,null,null,null,null,null,132,{"$f":"IF(SHAPE=132,15,0)","v":0},{"$f":"IF(S282>0,\"Min Widht:\",0)","v":0},{"$f":"IF(S282>0,H248,0)","v":0},{"$f":"IF(AND(S282>0,SHAPEW>0,H249>0),1,0)","v":0},null,null,null,null,null,null,"9104","96","72","144","96","240"]
[null,null,null,null,null,null,null,null,null,null,null,null,null,null,null,null,null,null,null,null,null,null,null,null,null,null,null,null,"9105","58.625","79.5","58.625","79.5","139"]
[null,null,null,null,null,null,null,null,null,null,null,null,null,null,null,null,null,null,null,null,null,null,null,null,null,null,null,null,"9106","70.625","79.5","70.625","79.5","151"]
[null,null,null,null,null,null,null,null,null,null,null,null,null,null,null,null,null,null,null,null,null,null,null,null,null,null,null,null,"9108","94.25","79.5","94.25","79.5","175"]
[null,null,null,null,null,null,null,null,null,null,null,null,null,null,null,null,null,null,null,null,null,null,null,null,null,null,null,null,"9109","105.5","79.5","105.5","79.5","186"]
[null,null,null,null,null,null,null,null,null,null,null,null,null,null,null,null,null,null,null,null,null,null,null,null,null,null,null,null,"9112","139.5","79.5","139.5","79.5","220"]
[null,null,null,null,null,null,null,null,null,null,null,null,null,null,null,null,null,null,null,null,null,null,null,null,null,null,null,null,"9122","140.875","79.5","140.875","79.5","221"]
[null,null,null,null,null,null,null,null,null,null,null,null,null,null,null,null,null,null,null,null,null,null,null,null,null,null,null,null,"9175","74.5","79.5","74.5","79.5","154"]
[null,null,null,null,null,null,null,null,null,null,null,null,null,null,null,null,null,null,null,null,null,null,null,null,null,null,null,null,"9202","48","72","96","96","192"]
[null,null,null,null,null,null,null,null,null,null,null,null,null,null,null,null,null,null,null,null,null,null,null,null,null,null,null,null,"9203","84","72","144","96","240"]
[null,null,null,null,null,null,null,null,null,null,null,null,null,null,null,null,null,null,null,null,null,null,null,null,null,null,null,null,"9204","96","72","144","96","240"]
[null,null,null,null,null,null,null,null,null,null,null,null,null,null,null,null,null,null,null,null,null,null,null,null,null,null,null,null,"9205","58.625","79.5","58.625","79.5","139"]
[null,null,null,null,null,null,null,null,null,null,null,null,null,null,null,null,null,null,null,null,null,null,null,null,null,null,null,null,"9206","70.625","79.5","70.625","79.5","151"]
[null,null,null,null,null,null,null,null,null,null,null,null,null,null,null,null,null,null,null,null,null,null,null,null,null,null,null,null,"9208","94.25","79.5","94.25","79.5","175"]
[null,null,null,null,null,null,null,null,null,null,null,null,null,null,null,null,null,null,null,null,null,null,null,null,null,null,null,null,"9209","105.5","79.5","105.5","79.5","186"]
[null,null,null,null,null,null,null,null,null,null,null,null,null,null,null,null,null,null,null,null,null,null,null,null,null,null,null,null,"9212","139.5","79.5","139.5","79.5","220"]
[null,null,null,null,null,null,null,null,null,null,null,null,null,null,null,null,null,null,null,null,null,null,null,null,null,null,null,null,"9222","140.875","79.5","140.875","79.5","221"]
[null,null,null,null,null,null,null,null,null,null,null,null,null,null,null,null,null,null,null,null,null,null,null,null,null,null,null,null,"9275","74.5","79.5","74.5","79.5","154"]
[null,null,null,null,null,null,null,null,null,null,null,null,null,null,null,null,null,null,null,null,null,null,null,null,null,null,null,null,"9402","48","72","96","96","192"]
[null,null,null,null,null,null,null,null,null,null,null,null,null,null,null,null,null,null,null,null,null,null,null,null,null,null,null,null,"9403","84","72",144,"96",228]
[null,null,null,null,null,null,null,null,null,null,null,null,null,null,null,null,null,null,null,null,null,null,null,null,null,null,null,null,"9404","96","72","144","96","240"]
[null,null,null,null,null,null,null,null,null,null,null,null,null,null,null,null,null,null,null,null,null,null,null,null,null,null,null,null,"9405","58.625","79.5","58.625","79.5","155"]
[null,null,null,null,null,null,null,null,null,null,null,null,null,null,null,null,null,null,null,null,null,null,null,null,null,null,null,null,"9406","70.625","79.5","70.625","79.5","167"]
[null,null,null,null,null,null,null,null,null,null,null,null,null,null,null,null,null,null,null,null,null,null,null,null,null,null,null,null,"9408","94.5","79.5","94.5","79.5","190"]
[null,null,null,null,null,null,null,null,null,null,null,null,null,null,null,null,null,null,null,null,null,null,null,null,null,null,null,null,"9409","105.5","79.5","105.5","79.5","201"]
[null,null,null,null,null,null,null,null,null,null,null,null,null,null,null,null,null,null,null,null,null,null,null,null,null,null,null,null,"9412","139.5","79.5","139.5","79.5","235"]
[null,null,null,null,null,null,null,null,null,null,null,null,null,null,null,null,null,null,null,null,null,null,null,null,null,null,null,null,"9422","140.875","79.5","140.875","79.5","237"]
[null,null,null,null,null,null,null,null,null,null,null,null,null,null,null,null,null,null,null,null,null,null,null,null,null,null,null,null,"9475","74.5","79.5","74.5","79.5","155"]
[null,null,null,null,null,null,null,null,null,null,null,null,null,null,null,null,null,null,null,null,null,null,null,null,null,null,null,null,"B201","11","20","52","84","132"]
[null,null,null,null,null,null,null,null,null,null,null,null,null,null,null,null,null,null,null,null,null,null,null,null,null,null,null,null,"B204","9","9","112","96","154"]
[null,null,null,null,null,null,null,null,null,null,null,null,null,null,null,null,null,null,null,null,null,null,null,null,null,null,null,null,"B501","15.25","26.75","52","84","136"]
[null,null,null,null,null,null,null,null,null,null,null,null,null,null,null,null,null,null,null,null,null,null,null,null,null,null,null,null,"B504","13","13","96","84","154"]
[null,null,null,null,null,null,null,null,null,null,null,null,null,null,null,null,null,null,null,null,null,null,null,null,null,null,null,null,"B601","15.25","25.875","52","84","136"]
[null,null,null,null,null,null,null,null,null,null,null,null,null,null,null,null,null,null,null,null,null,null,null,null,null,null,null,null,"B970","13","13","96","84","154"]
[null,null,null,null,null,null,null,null,null,null,null,null,null,null,null,null,null,null,null,null,null,null,null,null,null,null,null,null,"B971","16","19","36","78","114"]
[null,null,null,null,null,null,null,null,null,null,null,null,null,null,null,null,null,null,null,null,null,null,null,null,null,null,null,null,"i201","18","26","52","84","132"]
[null,null,null,null,null,null,null,null,null,null,null,null,null,null,null,null,null,null,null,null,null,null,null,null,null,null,null,null,"i204","12","12","72","84","137"]
[null,null,null,null,null,null,null,null,null,null,null,null,null,null,null,null,null,null,null,null,null,null,null,null,null,null,null,null,"I951","19","16","52","39","91"]
[null,null,null,null,null,null,null,null,null,null,null,null,null,null,null,null,null,null,null,null,null,null,null,null,null,null,null,null,"i970","13","13","52","78","130"]
[null,null,null,null,null,null,null,null,null,null,null,null,null,null,null,null,null,null,null,null,null,null,null,null,null,null,null,null,"i971","16","19","36","78","114"]
[null,null,null,null,null,null,null,null,null,null,null,null,null,null,null,null,null,null,null,null,null,null,null,null,null,null,null,null,"P601","16",25.25,"52","84","136"]
[null,null,null,null,null,null,null,null,null,null,null,null,null,null,null,null,null,null,null,null,null,null,null,null,null,null,null,null,"P970","13","13","96","84",154]
[null,null,null,null,null,null,null,null,null,null,null,null,null,null,null,null,null,null,null,null,null,null,null,null,null,null,null,null,"P971","16","19","36","78","114"]
[null,null,null,null,null,null,null,null,null,null,null,null,null,null,null,null,null,null,null,null,null,null,null,null,null,null,null,null,"R601",16,25.25,"52","84","136"]
[null,null,null,null,null,null,null,null,null,null,null,null,null,null,null,null,null,null,null,null,null,null,null,null,null,null,null,null,"R970","13","13","96","84","154"]
[null,null,null,null,null,null,null,null,null,null,null,null,null,null,null,null,null,null,null,null,null,null,null,null,null,null,null,null,"R971","16","19","36","78","114"]
[null,null,null,null,null,null,null,null,null,null,null,null,null,null,null,null,null,null,null,null,null,null,null,null,null,null,null,null,"S140",24,"43","52","96","134"]
[null,null,null,null,null,null,null,null,null,null,null,null,null,null,null,null,null,null,null,null,null,null,null,null,null,null,null,null,"S144","20","43","52","96","134"]
[null,null,null,null,null,null,null,null,null,null,null,null,null,null,null,null,null,null,null,null,null,null,null,null,null,null,null,null,"S146","20","43","52","96","134"]
[null,null,null,null,null,null,null,null,null,null,null,null,null,null,null,null,null,null,null,null,null,null,null,null,null,null,null,null,"S152","19","32","48","96","144"]
[null,null,null,null,null,null,null,null,null,null,null,null,null,null,null,null,null,null,null,null,null,null,null,null,null,null,null,null,"S153","19","48","48","96","144"]
[null,null,null,null,null,null,null,null,null,null,null,null,null,null,null,null,null,null,null,null,null,null,null,null,null,null,null,null,"S154","19","32","48","96","144"]
[null,null,null,null,null,null,null,null,null,null,null,null,null,null,null,null,null,null,null,null,null,null,null,null,null,null,null,null,"S155","19","32","48","96","144"]
[null,null,null,null,null,null,null,null,null,null,null,null,null,null,null,null,null,null,null,null,null,null,null,null,null,null,null,null,"S174","64","19","120","78","198"]
[null,null,null,null,null,null,null,null,null,null,null,null,null,null,null,null,null,null,null,null,null,null,null,null,null,null,null,null,"S175","80","19","120","78","198"]
[null,null,null,null,null,null,null,null,null,null,null,null,null,null,null,null,null,null,null,null,null,null,null,null,null,null,null,null,"U501","15.25","26.75","52","84","136"]
[null,null,null,null,null,null,null,null,null,null,null,null,null,null,null,null,null,null,null,null,null,null,null,null,null,null,null,null,"U502","25.25","16.625","84","68","148"]
[null,null,null,null,null,null,null,null,null,null,null,null,null,null,null,null,null,null,null,null,null,null,null,null,null,null,null,null,"U503","44.5","16.625","120","68","184"]
[null,null,null,null,null,null,null,null,null,null,null,null,null,null,null,null,null,null,null,null,null,null,null,null,null,null,null,null,"U504","13","13","96","84","154"]
[null,null,null,null,null,null,null,null,null,null,null,null,null,null,null,null,null,null,null,null,null,null,null,null,null,null,null,null,"U509","35.5","16.625","120","68","184"]
[null,null,null,null,null,null,null,null,null,null,null,null,null,null,null,null,null,null,null,null,null,null,null,null,null,null,null,null,"U522","30","20","72","60","120"]
[null,null,null,null,null,null,null,null,null,null,null,null,null,null,null,null,null,null,null,null,null,null,null,null,null,null,null,null,"U523","48","20","84","60","144"]
[null,null,null,null,null,null,null,null,null,null,null,null,null,null,null,null,null,null,null,null,null,null,null,null,null,null,null,null,"U529","48","20","96","60","144"]
[null,null,null,null,null,null,null,null,null,null,null,null,null,null,null,null,null,null,null,null,null,null,null,null,null,null,null,null,"U601","15.25","25.875","52","84","136"]
[null,null,null,null,null,null,null,null,null,null,null,null,null,null,null,null,null,null,null,null,null,null,null,null,null,null,null,null,"U602","25.25","16.625","84","68","148"]
[null,null,null,null,null,null,null,null,null,null,null,null,null,null,null,null,null,null,null,null,null,null,null,null,null,null,null,null,"U603","44.5","16.625","120","68","184"]
[null,null,null,null,null,null,null,null,null,null,null,null,null,null,null,null,null,null,null,null,null,null,null,null,null,null,null,null,"U609","35.5","16.625","120","68","184"]
[null,null,null,null,null,null,null,null,null,null,null,null,null,null,null,null,null,null,null,null,null,null,null,null,null,null,null,null,"U614","13","13","96","84","154"]
[null,null,null,null,null,null,null,null,null,null,null,null,null,null,null,null,null,null,null,null,null,null,null,null,null,null,null,null,"V100","14","25","48","84","122"]
[null,null,null,null,null,null,null,null,null,null,null,null,null,null,null,null,null,null,null,null,null,null,null,null,null,null,null,null,"V101","19","28","48","84","122"]
[null,null,null,null,null,null,null,null,null,null,null,null,null,null,null,null,null,null,null,null,null,null,null,null,null,null,null,null,"V102","26","16","73","60",123]
[null,null,null,null,null,null,null,null,null,null,null,null,null,null,null,null,null,null,null,null,null,null,null,null,null,null,null,null,"V103","48.5","14","108","60","168"]
[null,null,null,null,null,null,null,null,null,null,null,null,null,null,null,null,null,null,null,null,null,null,null,null,null,null,null,null,"V104","11.5","11.5","84","84","158"]
[null,null,null,null,null,null,null,null,null,null,null,null,null,null,null,null,null,null,null,null,null,null,null,null,null,null,null,null,"V109","34","14","108","60","168"]
[null,null,null,null,null,null,null,null,null,null,null,null,null,null,null,null,null,null,null,null,null,null,null,null,null,null,null,null,"V114","11.5","11.5","84","84","158"]
[null,null,null,null,null,null,null,null,null,null,null,null,null,null,null,null,null,null,null,null,null,null,null,null,null,null,null,null,"V120","29","25","96","84","170"]
[null,null,null,null,null,null,null,null,null,null,null,null,null,null,null,null,null,null,null,null,null,null,null,null,null,null,null,null,"V121","29","25","96","84","170"]
[null,null,null,null,null,null,null,null,null,null,null,null,null,null,null,null,null,null,null,null,null,null,null,null,null,null,null,null,"V130","43.75","25","108","84","192"]
[null,null,null,null,null,null,null,null,null,null,null,null,null,null,null,null,null,null,null,null,null,null,null,null,null,null,null,null,"V131","43.75","25","108","84","192"]
[null,null,null,null,null,null,null,null,null,null,null,null,null,null,null,null,null,null,null,null,null,null,null,null,null,null,null,null,"V200","14","25.5","48","84","122"]
[null,null,null,null,null,null,null,null,null,null,null,null,null,null,null,null,null,null,null,null,null,null,null,null,null,null,null,null,"V202","23.5","15","73","60","132"]
[null,null,null,null,null,null,null,null,null,null,null,null,null,null,null,null,null,null,null,null,null,null,null,null,null,null,null,null,"V203","48","15","108","60","168"]
[null,null,null,null,null,null,null,null,null,null,null,null,null,null,null,null,null,null,null,null,null,null,null,null,null,null,null,null,"V204","11.5","11.5","84","84","158"]
[null,null,null,null,null,null,null,null,null,null,null,null,null,null,null,null,null,null,null,null,null,null,null,null,null,null,null,null,"V209","39","15","108","60","168"]
[null,null,null,null,null,null,null,null,null,null,null,null,null,null,null,null,null,null,null,null,null,null,null,null,null,null,null,null,"V220","29","25","96","84","182"]
[null,null,null,null,null,null,null,null,null,null,null,null,null,null,null,null,null,null,null,null,null,null,null,null,null,null,null,null,"V230","43","25.5","108","84","192"]

{"sheet":"Data","index":2,"n_rows":72,"n_cols":23,"rows_kept":72,"cut":false,"hidden":true,"merged":[]}
[]
[null,"Min. W","Min. H 113","Min. H 115","Max. W","Max. H","Max. UI","Max. SF","Min. R","Min. Leg","CutLength","Min. Angle","FW","FH"]
["PI7301",10,{"$f":"(TRUNC(SQRT(FW+5.75)*16+0.5)/16)+(GLASSOFFSET*2)","v":2.375},{"$f":"(TRUNC(SQRT(FW+5.75)*16+0.5)/16)+(GLASSOFFSET*2)","v":2.375},95,95,154,56,{"$f":"PI_7301","v":13},6,10,8.5]
["L4807",10,{"$f":"(TRUNC(SQRT(FW+7.3125)*16+0.5)/16)+(GLASSOFFSET*2)","v":2.6875},{"$f":"(TRUNC(SQRT(FW+7.3125)*16+0.5)/16)+(GLASSOFFSET*2)","v":2.6875},95,95,154,56,{"$f":"L_4807","v":13.5},6,10,8.5]
["1.38BM"]
["1.38NF"]
["2.0BM"]
["2.0NF"]
["Narrow"]
[null,{"$f":"IF(EXT=1,\"\",VLOOKUP(R_EXT,DATA,2,FALSE))","v":""},{"$f":"IF(EXT=1,\"\",VLOOKUP(R_EXT,DATA,3,FALSE))","v":""},{"$f":"IF(EXT=1,\"\",VLOOKUP(R_EXT,DATA,4,FALSE))","v":""},{"$f":"IF(EXT=1,\"\",VLOOKUP(R_EXT,DATA,5,FALSE))","v":""},{"$f":"IF(EXT=1,\"\",VLOOKUP(R_EXT,DATA,6,FALSE))","v":""},{"$f":"IF(EXT=1,\"\",VLOOKUP(R_EXT,DATA,7,FALSE))","v":""},{"$f":"IF(EXT=1,\"\",VLOOKUP(R_EXT,DATA,8,FALSE))","v":""},{"$f":"IF(EXT=1,\"\",VLOOKUP(R_EXT,DATA,9,FALSE))","v":""},{"$f":"IF(EXT=1,\"\",VLOOKUP(R_EXT,DATA,10,FALSE))","v":""},{"$f":"IF(EXT=1,\"\",VLOOKUP(R_EXT,DATA,11,FALSE))","v":""},{"$f":"IF(EXT=1,\"\",VLOOKUP(R_EXT,DATA,12,FALSE))","v":""}]
[]
[null,null,115]
[null,null,"Frame",null,null,null,null,null,null,"Glass",null,null,null,null,null,null,"Extrusion"]
[null,null,"R","F Peak","F Bott.","d-ver","d-hor","Peak","Bott. Corner","R","F Peak","F Bott.","d-ver","d-hor","Peak","Bott. Corner","R","F Peak","F Bott.","d-ver","d-hor","Peak","Bott. Corner"]
[null,"ExtLink>3 & W>H",{"$f":"IF(AND(EXTLINK>3,SHAPEW>SHAPEH),(((SHAPEW)^2+SHAPEH^2)/(2*SHAPEH))-OFFSET,0)","v":0},{"$f":"IF(C15>0,2*(ASIN((OFFSET*2)/(2*C15))),0)","v":0},{"$f":"IF(C15>0,2*(ASIN(((((C15+OFFSET)-SHAPEH)+OFFSET)*2)/(2*C15))),0)","v":0},{"$f":"IF(C15>0,(C15*(COS(D15/2)))-OFFSET,0)","v":0},{"$f":"IF(C15>0,(C15*(COS(E15/2)))-OFFSET,0)","v":0},{"$f":"IF(C15>0,C15-F15,0)","v":0},{"$f":"IF(C15>0,SHAPEW-G15-OFFSET,0)","v":0},{"$f":"IF(C15>0,C15-GLASSOFFSET,0)","v":0},{"$f":"IF(C15>0,2*(ASIN(((OFFSET+GLASSOFFSET)*2)/(2*J15))),0)","v":0},{"$f":"IF(C15>0,2*(ASIN(((((J15+(OFFSET+GLASSOFFSET))-SHAPEH)+(OFFSET+GLASSOFFSET))*2)/(2*J15))),0)","v":0},{"$f":"IF(C15>0,(J15*(COS(K15/2)))-(OFFSET+GLASSOFFSET),0)","v":0},{"$f":"IF(J15>0,(J15*(COS(L15/2)))-(OFFSET+GLASSOFFSET),0)","v":0},{"$f":"IF(C15>0,J15-M15,0)","v":0},{"$f":"IF(C15>0,SHAPEW-N15-(OFFSET+GLASSOFFSET),0)","v":0},{"$f":"IF(C15>0,C15-EXTOFFSET,0)","v":0},{"$f":"IF(J15>0,2*(ASIN(((OFFSET+EXTOFFSET)*2)/(2*Q15))),0)","v":0},{"$f":"IF(J15>0,2*(ASIN(((((Q15+(OFFSET+EXTOFFSET))-SHAPEH)+(OFFSET+EXTOFFSET))*2)/(2*Q15))),0)","v":0},{"$f":"IF(J15>0,(Q15*(COS(R15/2)))-(OFFSET+EXTOFFSET),0)","v":0},{"$f":"IF(Q15>0,(Q15*(COS(S15/2)))-(OFFSET+EXTOFFSET),0)","v":0},{"$f":"IF(J15>0,Q15-T15,0)","v":0},{"$f":"IF(J15>0,SHAPEW-U15-(OFFSET+EXTOFFSET),0)","v":0}]
[null,"ExtLink>3 & W<H",{"$f":"IF(AND(EXTLINK>3,SHAPEW<SHAPEH),((SHAPEW/2)+((SHAPEH*2)^2/(8*SHAPEW)))-OFFSET,0)","v":0},{"$f":"IF(C16>0,2*(ASIN(((((C16+OFFSET)-SHAPEW)+OFFSET)*2)/(2*C16))),0)","v":0},{"$f":"IF(C16>0,2*(ASIN((OFFSET*2)/(2*C16))),0)","v":0},{"$f":"IF(C16>0,(C16*(COS(D16/2)))-OFFSET,0)","v":0},{"$f":"IF(C16>0,(C16*(COS(E16/2)))-OFFSET,0)","v":0},{"$f":"IF(C16>0,SHAPEH-F16-OFFSET,0)","v":0},{"$f":"IF(C16>0,C16-G16,0)","v":0},{"$f":"IF(C16>0,C16-GLASSOFFSET,0)","v":0},{"$f":"IF(C16>0,2*(ASIN(((((J16+(OFFSET+GLASSOFFSET))-SHAPEW)+(OFFSET+GLASSOFFSET))*2)/(2*J16))),0)","v":0},{"$f":"IF(C16>0,2*(ASIN(((OFFSET+GLASSOFFSET)*2)/(2*J16))),0)","v":0},{"$f":"IF(C16>0,(J16*(COS(K16/2)))-(OFFSET+GLASSOFFSET),0)","v":0},{"$f":"IF(C16>0,(J16*(COS(L16/2)))-(OFFSET+GLASSOFFSET),0)","v":0},{"$f":"IF(C16>0,SHAPEH-M16-(OFFSET+GLASSOFFSET),0)","v":0},{"$f":"IF(C16>0,J16-N16,0)","v":0},{"$f":"IF(C16>0,C16-EXTOFFSET,0)","v":0},{"$f":"IF(J16>0,2*(ASIN(((((Q16+(OFFSET+EXTOFFSET))-SHAPEW)+(OFFSET+EXTOFFSET))*2)/(2*Q16))),0)","v":0},{"$f":"IF(J16>0,2*(ASIN(((OFFSET+EXTOFFSET)*2)/(2*Q16))),0)","v":0},{"$f":"IF(J16>0,(Q16*(COS(R16/2)))-(OFFSET+EXTOFFSET),0)","v":0},{"$f":"IF(J16>0,(Q16*(COS(S16/2)))-(OFFSET+EXTOFFSET),0)","v":0},{"$f":"IF(J16>0,SHAPEH-T16-(OFFSET+EXTOFFSET),0)","v":0},{"$f":"IF(J16>0,Q16-U16,0)","v":0}]
[null,"ExtLink=2/3 & W>H",{"$f":"IF(AND(EXTLINK<=3,EXTLINK>1,SHAPEW>SHAPEH),((SHAPEW)^2+SHAPEH^2)/(2*SHAPEH),0)","v":0},null,null,null,null,null,null,{"$f":"IF(C17>0,C17-GLASSOFFSET,0)","v":0},{"$f":"IF(C17>0,2*(ASIN(((GLASSOFFSET)*2)/(2*J17))),0)","v":0},{"$f":"IF(C17>0,2*(ASIN(((((J17+GLASSOFFSET)-SHAPEH)+GLASSOFFSET)*2)/(2*J17))),0)","v":0},{"$f":"IF(C17>0,(J17*(COS(K17/2)))-GLASSOFFSET,0)","v":0},{"$f":"IF(C17>0,(J17*(COS(L17/2)))-GLASSOFFSET,0)","v":0},{"$f":"J17-M17","v":0},{"$f":"IF(C17>0,SHAPEW-N17-GLASSOFFSET,0)","v":0},{"$f":"IF(C17>0,C17-EXTOFFSET,0)","v":0},{"$f":"IF(J17>0,2*(ASIN(((EXTOFFSET)*2)/(2*Q17))),0)","v":0},{"$f":"IF(J17>0,2*(ASIN(((((Q17+EXTOFFSET)-SHAPEH)+EXTOFFSET)*2)/(2*Q17))),0)","v":0},{"$f":"IF(J17>0,(Q17*(COS(R17/2)))-EXTOFFSET,0)","v":0},{"$f":"IF(J17>0,(Q17*(COS(S17/2)))-EXTOFFSET,0)","v":0},{"$f":"Q17-T17","v":0},{"$f":"IF(J17>0,SHAPEW-U17-EXTOFFSET,0)","v":0}]
[null,"ExtLink=2/3 & W<H",{"$f":"IF(AND(EXTLINK<=3,EXTLINK>1,SHAPEW<SHAPEH),(SHAPEW/2)+((SHAPEH*2)^2/(8*SHAPEW)),0)","v":0},null,null,null,null,null,null,{"$f":"IF(C18>0,C18-GLASSOFFSET,0)","v":0},{"$f":"IF(C18>0,2*(ASIN(((((J18+GLASSOFFSET)-SHAPEW)+GLASSOFFSET)*2)/(2*J18))),0)","v":0},{"$f":"IF(C18>0,2*(ASIN((GLASSOFFSET*2)/(2*J18))),0)","v":0},{"$f":"IF(C18>0,(J18*(COS(K18/2)))-GLASSOFFSET,0)","v":0},{"$f":"IF(C18>0,(J18*(COS(L18/2)))-GLASSOFFSET,0)","v":0},{"$f":"IF(C18>0,SHAPEH-M18-GLASSOFFSET,0)","v":0},{"$f":"IF(C18>0,J18-N18,0)","v":0},{"$f":"IF(C18>0,C18-EXTOFFSET,0)","v":0},{"$f":"IF(J18>0,2*(ASIN(((((Q18+EXTOFFSET)-SHAPEW)+EXTOFFSET)*2)/(2*Q18))),0)","v":0},{"$f":"IF(J18>0,2*(ASIN((EXTOFFSET*2)/(2*Q18))),0)","v":0},{"$f":"IF(J18>0,(Q18*(COS(R18/2)))-EXTOFFSET,0)","v":0},{"$f":"IF(J18>0,(Q18*(COS(S18/2)))-EXTOFFSET,0)","v":0},{"$f":"IF(J18>0,SHAPEH-T18-EXTOFFSET,0)","v":0},{"$f":"IF(J18>0,Q18-U18,0)","v":0}]
[null,null,{"$f":"MAX(C15:C18)","v":0},{"$f":"MAX(D15:D18)","v":0},{"$f":"MAX(E15:E18)","v":0},0,0,0,0,0,0,0,0,0,0,0,0,0,0,0,0,0,0]
[null,null,null,null,null,null,null,null,null,null,null,null,null,null,null,null,null,null,null,null,null,{"$f":"V19-H19","v":0},{"$f":"W19-I19","v":0}]
[]
[null,null,116]
[null,null,"Frame",null,null,null,null,null,"Glass",null,null,null,null,null,"Extrusion"]
[null,{"$f":"IF(AND(SHAPEW>0,SHAPEH>0,DIM_4>0,SHAPE=116,SHAPEW>(SHAPEH-DIM_4)),(((SHAPEW*2)/2)^2+(SHAPEH-DIM_4)^2)/(2*(SHAPEH-DIM_4)),IF(AND(SHAPEW>0,SHAPEH>0,DIM_4>0,SHAPE=116,SHAPEW<=(SHAPEH-DIM_4)),(SHAPEW/2)+(((SHAPEH-DIM_4)*2)^2)/(8*SHAPEW),0))","v":0},"R","FW","F Peak","Leg","d-ver","Peak","R","GW","F Peak","Leg","d-ver","Peak","R","CUT-W","F Peak","d-ver","Peak"]
[null,"ExtLink>3 & W>H",{"$f":"IF(AND(EXTLINK>3,SHAPEW>=(SHAPEH-DIM_4)),B24-OFFSET,0)","v":0},{"$f":"IF(AND(SHAPEW>0,SHAPE=116,DIM_4>0,EXTLINK>3,SHAPEW>=(SHAPEH-DIM_4)),SHAPEW-(OFFSET*2),0)","v":0},{"$f":"IF(C25>0,2*(ASIN((OFFSET*2)/(2*C25))),0)","v":0},{"$f":"IF(C25>0,DIM_4-(OFFSET+((B24*COS((2*(ASIN((SHAPEW*2)/(2*B24))))/2))-(C25*COS((2*(ASIN(((SHAPEW*2)-(2*OFFSET))/(2*C25))))/2)))),0)","v":0},{"$f":"IF(C25>0,C25*COS(E25/2),0)","v":0},{"$f":"IF(C25>0,B24-G25,0)","v":0},{"$f":"IF(C25>0,C25-GLASSOFFSET,0)","v":0},{"$f":"IF(AND(SHAPEW>0,SHAPE=116,DIM_4>0,EXTLINK>3,SHAPEW>=(SHAPEH-DIM_4)),D25-(GLASSOFFSET*2),0)","v":0},{"$f":"IF(C25>0,2*(ASIN(((OFFSET+GLASSOFFSET)*2)/(2*I25))),0)","v":0},{"$f":"IF(C25>0,DIM_4-((OFFSET+GLASSOFFSET)+((B24*COS((2*(ASIN((SHAPEW*2)/(2*B24))))/2))-(I25*COS((2*(ASIN(((SHAPEW*2)-(2*(OFFSET+GLASSOFFSET)))/(2*I25))))/2)))),0)","v":0},{"$f":"IF(C25>0,I25*COS(K25/2),0)","v":0},{"$f":"IF(C25>0,B24-M25,0)","v":0},{"$f":"IF(C25>0,C25-EXTOFFSET,0)","v":0},{"$f":"IF(AND(SHAPEW>0,SHAPE=116,DIM_4>0,EXTLINK>2,SHAPEW>=(SHAPEH-DIM_4)),D25-(EXTOFFSET*2),0)","v":0},{"$f":"IF(I25>0,2*(ASIN(((OFFSET+EXTOFFSET)*2)/(2*O25))),0)","v":0},{"$f":"IF(C25>0,O25*COS(Q25/2),0)","v":0},{"$f":"IF(I25>0,B24-R25-H25,0)","v":0}]
[null,"ExtLink>3 & W<H",{"$f":"IF(AND(EXTLINK>3,SHAPEW<(SHAPEH-DIM_4)),B24-OFFSET,0)","v":0},{"$f":"IF(AND(SHAPEW>0,SHAPE=116,DIM_4>0,EXTLINK>3,SHAPEW<(SHAPEH-DIM_4)),SHAPEW-(OFFSET*2),0)","v":0},{"$f":"IF(C26>0,2*(ASIN(((C26-D26)*2)/(2*C26))),0)","v":0},{"$f":"IF(C26>0,DIM_4-OFFSET,0)","v":0},{"$f":"IF(C26>0,C26*COS(E26/2),0)","v":0},{"$f":"IF(C26>0,(SHAPEH-DIM_4)-G26,0)","v":0},{"$f":"IF(C26>0,C26-GLASSOFFSET,0)","v":0},{"$f":"IF(AND(SHAPEW>0,SHAPE=116,DIM_4>0,EXTLINK>3,SHAPEW<(SHAPEH-DIM_4)),D26-(GLASSOFFSET*2),0)","v":0},{"$f":"IF(C26>0,2*(ASIN(((I26-J26)*2)/(2*I26))),0)","v":0},{"$f":"IF(C26>0,DIM_4-(OFFSET+GLASSOFFSET),0)","v":0},{"$f":"IF(C26>0,I26*COS(K26/2),0)","v":0},{"$f":"IF(C26>0,(SHAPEH-DIM_4)-M26,0)","v":0},{"$f":"IF(C26>0,C26-EXTOFFSET,0)","v":0},{"$f":"IF(AND(SHAPEW>0,SHAPE=116,DIM_4>0,EXTLINK>2,SHAPEW<(SHAPEH-DIM_4)),D26-(EXTOFFSET*2),0)","v":0},{"$f":"IF(C26>0,2*(ASIN(((O26-P26)*2)/(2*O26))),0)","v":0},{"$f":"IF(C26>0,O26*COS(Q26/2),0)","v":0},{"$f":"IF(C26>0,(FH-F26)-R26,0)","v":0}]
[null,"ExtLink<=3 & W>H",{"$f":"IF(AND(EXTLINK<=3,EXTLINK>1,SHAPEW>(SHAPEH-DIM_4)),B24,0)","v":0},{"$f":"IF(AND(SHAPEW>0,SHAPE=116,DIM_4>0,EXTLINK<=3,EXTLINK>1,SHAPEW>(SHAPEH-DIM_4)),SHAPEW,0)","v":0},null,{"$f":"IF(C27>0,DIM_4,0)","v":0},null,null,{"$f":"IF(C27>0,C27-GLASSOFFSET,0)","v":0},{"$f":"IF(AND(SHAPEW>0,SHAPE=116,DIM_4>0,EXTLINK<=3,EXTLINK>1,SHAPEW>=(SHAPEH-DIM_4)),D27-(GLASSOFFSET*2),0)","v":0},{"$f":"IF(C27>0,2*(ASIN((GLASSOFFSET*2)/(2*I27))),0)","v":0},{"$f":"IF(C27>0,DIM_4-(GLASSOFFSET+((B24*COS((2*(ASIN((SHAPEW*2)/(2*B24))))/2))-(I27*COS((2*(ASIN(((SHAPEW*2)-(2*GLASSOFFSET))/(2*I27))))/2)))),0)","v":0},{"$f":"IF(C27>0,I27*COS(K27/2),0)","v":0},{"$f":"IF(C27>0,B24-M27,0)","v":0},{"$f":"IF(C27>0,C27-EXTOFFSET,0)","v":0},{"$f":"IF(AND(SHAPEW>0,SHAPE=116,DIM_4>0,EXTLINK=2,SHAPEW>=(SHAPEH-DIM_4)),D27-(EXTOFFSET*2),0)","v":0},{"$f":"IF(I27>0,2*(ASIN(((EXTOFFSET)*2)/(2*O27))),0)","v":0},{"$f":"IF(C27>0,O27*COS(Q27/2),0)","v":0},{"$f":"IF(I27>0,B24-R27,0)","v":0}]
[null,"ExtLink<=3 & W<H",{"$f":"IF(AND(EXTLINK<=3,EXTLINK>1,SHAPEW<(SHAPEH-DIM_4)),B24,0)","v":0},{"$f":"IF(AND(SHAPEW>0,SHAPE=116,DIM_4>0,EXTLINK<=3,EXTLINK>1,SHAPEW<(SHAPEH-DIM_4)),SHAPEW,0)","v":0},null,{"$f":"IF(C28>0,DIM_4,0)","v":0},null,null,{"$f":"IF(C28>0,C28-GLASSOFFSET,0)","v":0},{"$f":"IF(AND(SHAPEW>0,SHAPE=116,DIM_4>0,EXTLINK<=3,EXTLINK>1,SHAPEW<(SHAPEH-DIM_4)),(D28-GLASSOFFSET*2),0)","v":0},{"$f":"IF(C28>0,2*(ASIN(((I28-J28)*2)/(2*I28))),0)","v":0},{"$f":"IF(C28>0,DIM_4-GLASSOFFSET,0)","v":0},{"$f":"IF(C28>0,I28*COS(K28/2),0)","v":0},{"$f":"IF(C28>0,(SHAPEH-DIM_4)-M28,0)","v":0},{"$f":"IF(C28>0,C28-EXTOFFSET,0)","v":0},{"$f":"IF(AND(SHAPEW>0,SHAPE=116,DIM_4>0,EXTLINK=2,SHAPEW<(SHAPEH-DIM_4)),D28-(EXTOFFSET*2),0)","v":0},{"$f":"IF(C28>0,2*(ASIN(((O28-P28)*2)/(2*O28))),0)","v":0},{"$f":"IF(C28>0,O28*COS(Q28/2),0)","v":0},{"$f":"IF(C28>0,(SHAPEH-DIM_4)-R28,0)","v":0}]
[null,null,{"$f":"MAX(C25:C28)","v":0},0,0,0,0,0,0,0,0,0,0,0,0,0,0,0,{"$f":"(MAX(S25:S28))","v":0}]
[]
[null,null,117]
[null,null,"Frame",null,null,null,null,null,null,null,null,null,"Glass"]
[null,null,"PeakR","1/2 Hyp","Angle","Minor R","Major R","F","FrameW","FrameH","Fmajor","Fminor","GlassW","GlassH","MajorR","MinorR"]
[null,"ExtLink>3",{"$f":"IF(EXTLINK>3,SHAPEW/2-SHAPEH,0)","v":0},{"$f":"IF(EXTLINK>3,(SQRT((SHAPEW/2)^2+SHAPEH^2))-C34,0)","v":0},{"$f":"IF(EXTLINK>3,ACOS((SHAPEW/2)/(D34+C34)),0)","v":0},{"$f":"IF(EXTLINK>3,SQRT(((D34/2)*TAN(E34))^2+(D34/2)^2),0)","v":0},{"$f":"IF(EXTLINK>3,SHAPEH+(((SHAPEW/2)-F34)/TAN(E34)),0)","v":0},{"$f":"IF(EXTLINK>3,2*ACOS(((F34-OFFSET)-((F34-(OFFSET*2))))/(F34-OFFSET)),0)","v":0},{"$f":"IF(EXTLINK>3,SHAPEW-(((F34*2)-(2*(SQRT(L34^2-OFFSET^2))))/2)*2,0)","v":0},{"$f":"IF(EXTLINK>3,SHAPEH-(OFFSET*2),0)","v":0},{"$f":"IF(EXTLINK>3,G34-OFFSET,0)","v":0},{"$f":"IF(EXTLINK>3,F34-OFFSET,0)","v":0},{"$f":"IF(EXTLINK>3,I34-((((2*(SQRT(L34^2-OFFSET^2)))-(2*(SQRT(P34^2-(OFFSET+GLASSOFFSET)^2))))/2)*2),0)","v":0},{"$f":"IF(EXTLINK>3,J34-(GLASSOFFSET*2),0)","v":0},{"$f":"IF(EXTLINK>3,K34-GLASSOFFSET,0)","v":0},{"$f":"IF(EXTLINK>3,L34-GLASSOFFSET,0)","v":0}]
[null,"ExtLink<=3",{"$f":"IF(AND(EXTLINK<=3,EXTLINK>1),SHAPEW/2-SHAPEH,0)","v":0},{"$f":"IF(AND(EXTLINK<=3,EXTLINK>1),(SQRT((SHAPEW/2)^2+SHAPEH^2))-C35,0)","v":0},{"$f":"IF(AND(EXTLINK<=3,EXTLINK>1),ACOS((SHAPEW/2)/(D35+C35)),0)","v":0},{"$f":"IF(AND(EXTLINK<=3,EXTLINK>1),SQRT(((D35/2)*TAN(E35))^2+(D35/2)^2),0)","v":0},{"$f":"IF(AND(EXTLINK<=3,EXTLINK>1),SHAPEH+(((SHAPEW/2)-F35)/TAN(E35)),0)","v":0},{"$f":"IF(AND(EXTLINK<=3,EXTLINK>1),2*ACOS(((F35-OFFSET)-((F35-(OFFSET*2))))/(F35-OFFSET)),0)","v":0},{"$f":"IF(AND(EXTLINK<=3,EXTLINK>1),SHAPEW,0)","v":0},{"$f":"IF(AND(EXTLINK<=3,EXTLINK>1),SHAPEH,0)","v":0},{"$f":"IF(AND(EXTLINK<=3,EXTLINK>1),G35,0)","v":0},{"$f":"IF(AND(EXTLINK<=3,EXTLINK>1),F35,0)","v":0},{"$f":"IF(AND(EXTLINK<=3,EXTLINK>1),I35-(2*(GLASSOFFSET+(((2*(F35-GLASSOFFSET))-(2*(F35-GLASSOFFSET)*(SIN(H35/2))))/2))),0)","v":0},{"$f":"IF(AND(EXTLINK<=3,EXTLINK>1),J35-(GLASSOFFSET*2),0)","v":0},{"$f":"IF(AND(EXTLINK<=3,EXTLINK>1),K35-GLASSOFFSET,0)","v":0},{"$f":"IF(AND(EXTLINK<=3,EXTLINK>1),L35-GLASSOFFSET,0)","v":0}]
[null,null,{"$f":"MAX(C34:C35)","v":0},{"$f":"MAX(D34:D35)","v":0},0,0,0,0,0,0,0,0,0,0,0,0]
[]
[]
[null,null,119]
[null,null,"Frame",null,null,null,null,null,null,null,null,null,"Glass"]
[null,null,"PeakR","1/2 Hyp","Angle","Minor R","Major R","F","FrameW","FrameH","Fmajor","Fminor","GlassW","GlassH","MajorR","MinorR"]
[null,"ExtLink>3",{"$f":"IF(EXTLINK>3,SHAPEW/2-(SHAPEH/2),0)","v":0},{"$f":"IF(EXTLINK>3,(SQRT((SHAPEW/2)^2+(SHAPEH/2)^2))-C42,0)","v":0},{"$f":"IF(EXTLINK>3,ACOS((SHAPEW/2)/(D42+C42)),0)","v":0},{"$f":"IF(EXTLINK>3,SQRT(((D42/2)*TAN(E42))^2+(D42/2)^2),0)","v":0},{"$f":"IF(EXTLINK>3,(SHAPEH/2)+(((SHAPEW/2)-F42)/TAN(E42)),0)","v":0},{"$f":"IF(EXTLINK>3,2*ACOS(((F42-OFFSET)-((F42-(OFFSET*2))))/(F42-OFFSET)),0)","v":0},{"$f":"IF(EXTLINK>3,SHAPEW-(((F42*2)-(2*(SQRT(L42^2-OFFSET^2))))/2)*2,0)","v":0},{"$f":"IF(EXTLINK>3,SHAPEH-(OFFSET*2),0)","v":0},{"$f":"IF(EXTLINK>3,G42-OFFSET,0)","v":0},{"$f":"IF(EXTLINK>3,F42-OFFSET,0)","v":0},{"$f":"IF(EXTLINK>3,I42-((((2*(SQRT(L42^2-OFFSET^2)))-(2*(SQRT(P42^2-(OFFSET+GLASSOFFSET)^2))))/2)*2),0)","v":0},{"$f":"IF(EXTLINK>3,J42-(GLASSOFFSET*2),0)","v":0},{"$f":"IF(EXTLINK>3,K42-GLASSOFFSET,0)","v":0},{"$f":"IF(EXTLINK>3,L42-GLASSOFFSET,0)","v":0}]
[null,"ExtLink=2/3",{"$f":"IF(AND(EXTLINK<=3,EXTLINK>1),SHAPEW/2-(SHAPEH/2),0)","v":0},{"$f":"IF(AND(EXTLINK<=3,EXTLINK>1),(SQRT((SHAPEW/2)^2+(SHAPEH/2)^2))-C43,0)","v":0},{"$f":"IF(AND(EXTLINK<=3,EXTLINK>1),ACOS((SHAPEW/2)/(D43+C43)),0)","v":0},{"$f":"IF(AND(EXTLINK<=3,EXTLINK>1),SQRT(((D43/2)*TAN(E43))^2+(D43/2)^2),0)","v":0},{"$f":"IF(AND(EXTLINK<=3,EXTLINK>1),(SHAPEH/2)+(((SHAPEW/2)-F43)/TAN(E43)),0)","v":0},{"$f":"IF(AND(EXTLINK<=3,EXTLINK>1),2*ACOS(((F43-OFFSET)-((F43-(OFFSET*2))))/(F43-OFFSET)),0)","v":0},{"$f":"IF(AND(EXTLINK<=3,EXTLINK>1),SHAPEW,0)","v":0},{"$f":"IF(AND(EXTLINK<=3,EXTLINK>1),SHAPEH,0)","v":0},{"$f":"IF(AND(EXTLINK<=3,EXTLINK>1),G43,0)","v":0},{"$f":"IF(AND(EXTLINK<=3,EXTLINK>1),F43,0)","v":0},{"$f":"IF(AND(EXTLINK<=3,EXTLINK>1),I43-(2*(GLASSOFFSET+(((2*(F43-GLASSOFFSET))-(2*(F43-GLASSOFFSET)*(SIN(H43/2))))/2))),0)","v":0},{"$f":"IF(AND(EXTLINK<=3,EXTLINK>1),J43-(GLASSOFFSET*2),0)","v":0},{"$f":"IF(AND(EXTLINK<=3,EXTLINK>1),K43-GLASSOFFSET,0)","v":0},{"$f":"IF(AND(EXTLINK<=3,EXTLINK>1),L43-GLASSOFFSET,0)","v":0}]
[null,null,{"$f":"MAX(C42:C43)","v":0},{"$f":"MAX(D42:D43)","v":0},0,0,0,0,0,0,0,0,0,0,0,0]
[]
[]
[null,null,123]
[null,null,"V/H Leg",null,null,"Slanted Leg","Pitch",null,"Deduct1","V/H Leg",null,"Deduct2","Slant Leg","H/V Leg","G-Deduct1","G-Deduct2","G-V/H Leg","Slant Leg","G-H/V Leg"]
[null,"ExtLink>3 & W>H",{"$f":"IF(AND(SHAPEW>=SHAPEH,SHAPEW>0,SHAPEH>0,DIM_3>0,EXTLINK>3),((TAN(22.5*(PI()/180)))*SHAPEH/2)*2,0)","v":0},{"$f":"IF(AND(SHAPEW>=SHAPEH,SHAPEW>0,SHAPEH>0,DIM_3>0,EXTLINK>3),(SHAPEH-C49)/2,0)","v":0},{"$f":"IF(AND(SHAPEW>=SHAPEH,SHAPEW>0,SHAPEH>0,DIM_3>0,EXTLINK>3),(SHAPEW-DIM_3)/2,0)","v":0},{"$f":"IF(AND(SHAPEW>0,SHAPEH>0,DIM_3>0,SHAPE=123,SHAPEW>=SHAPEH,EXTLINK>3),SQRT(D49^2+E49^2),0)","v":0},{"$f":"IF(AND(SHAPEW>0,SHAPEH>0,DIM_3>0,SHAPE=123,SHAPEW>=SHAPEH,EXTLINK>3),DEGREES(ATAN(E49/D49)),0)","v":0},{"$f":"IF(AND(SHAPEW>=SHAPEH,SHAPEW>0,SHAPEH>0,DIM_3>0,EXTLINK>3),RADIANS((90-(DEGREES(ATAN(D49/E49))))/2),0)","v":0},{"$f":"IF(AND(SHAPEW>=SHAPEH,SHAPEW>0,SHAPEH>0,DIM_3>0,EXTLINK>3),OFFSET*TAN(H49),0)","v":0},{"$f":"IF(AND(SHAPEW>=SHAPEH,SHAPEW>0,SHAPEH>0,DIM_3>0,EXTLINK>3),C49-(I49*2),0)","v":0},{"$f":"IF(AND(SHAPEW>=SHAPEH,SHAPEW>0,SHAPEH>0,DIM_3>0,EXTLINK>3),RADIANS((180-(270-(2*(90-DEGREES(H49)))))/2),0)","v":0},{"$f":"IF(AND(SHAPEW>=SHAPEH,SHAPEW>0,SHAPEH>0,DIM_3>0,EXTLINK>3),OFFSET*TAN(K49),0)","v":0},{"$f":"IF(AND(SHAPEW>=SHAPEH,SHAPEW>0,SHAPEH>0,DIM_3>0,EXTLINK>3),F49-I49-L49,0)","v":0},{"$f":"IF(AND(SHAPEW>=SHAPEH,SHAPEW>0,SHAPEH>0,DIM_3>0,EXTLINK>3),DIM_3-(L49*2),0)","v":0},{"$f":"IF(AND(SHAPEW>=SHAPEH,SHAPEW>0,SHAPEH>0,DIM_3>0,EXTLINK>3),(GLASSOFFSET+OFFSET)*TAN(H49),0)","v":0},{"$f":"IF(AND(SHAPEW>=SHAPEH,SHAPEW>0,SHAPEH>0,DIM_3>0,EXTLINK>3),(GLASSOFFSET+OFFSET)*TAN(K49),0)","v":0},{"$f":"IF(AND(SHAPEW>=SHAPEH,SHAPEW>0,SHAPEH>0,DIM_3>0,EXTLINK>3),C49-(O49*2),0)","v":0},{"$f":"IF(AND(SHAPEW>=SHAPEH,SHAPEW>0,SHAPEH>0,DIM_3>0,EXTLINK>3),F49-O49-P49,0)","v":0},{"$f":"IF(AND(SHAPEW>=SHAPEH,SHAPEW>0,SHAPEH>0,DIM_3>0,EXTLINK>3),DIM_3-(P49*2),0)","v":0}]
[null,"ExtLink>3 & W<H",{"$f":"IF(AND(SHAPEW<SHAPEH,SHAPEW>0,SHAPEH>0,DIM_3>0,EXTLINK>3),((TAN(22.5*(PI()/180)))*SHAPEW/2)*2,0)","v":0},{"$f":"IF(AND(SHAPEW<SHAPEH,SHAPEW>0,SHAPEH>0,DIM_3>0,EXTLINK>3),(SHAPEW-C50)/2,0)","v":0},{"$f":"IF(AND(SHAPEW<SHAPEH,SHAPEW>0,SHAPEH>0,DIM_3>0,EXTLINK>3),(SHAPEH-DIM_3)/2,0)","v":0},{"$f":"IF(AND(SHAPEW>0,SHAPEH>0,DIM_3>0,SHAPE=123,SHAPEW<SHAPEH,EXTLINK>3),SQRT(D50^2+E50^2),0)","v":0},{"$f":"IF(AND(SHAPEW>0,SHAPEH>0,DIM_3>0,SHAPE=123,SHAPEW<SHAPEH,EXTLINK>3),DEGREES(ATAN(E50/D50)),0)","v":0},{"$f":"IF(AND(SHAPEW<SHAPEH,SHAPEW>0,SHAPEH>0,DIM_3>0,EXTLINK>3),RADIANS((90-(DEGREES(ATAN(D50/E50))))/2),0)","v":0},{"$f":"IF(AND(SHAPEW<SHAPEH,SHAPEW>0,SHAPEH>0,DIM_3>0,EXTLINK>3),OFFSET*TAN(H50),0)","v":0},{"$f":"IF(AND(SHAPEW<SHAPEH,SHAPEW>0,SHAPEH>0,DIM_3>0,EXTLINK>3),C50-(I50*2),0)","v":0},{"$f":"IF(AND(SHAPEW<SHAPEH,SHAPEW>0,SHAPEH>0,DIM_3>0,EXTLINK>3),RADIANS((180-(270-(2*(90-DEGREES(H50)))))/2),0)","v":0},{"$f":"IF(AND(SHAPEW<SHAPEH,SHAPEW>0,SHAPEH>0,DIM_3>0,EXTLINK>3),OFFSET*TAN(K50),0)","v":0},{"$f":"IF(AND(SHAPEW<SHAPEH,SHAPEW>0,SHAPEH>0,DIM_3>0,EXTLINK>3),F50-I50-L50,0)","v":0},{"$f":"IF(AND(SHAPEW<SHAPEH,SHAPEW>0,SHAPEH>0,DIM_3>0,EXTLINK>3),DIM_3-(L50*2),0)","v":0},{"$f":"IF(AND(SHAPEW<SHAPEH,SHAPEW>0,SHAPEH>0,DIM_3>0,EXTLINK>3),(GLASSOFFSET+OFFSET)*TAN(H50),0)","v":0},{"$f":"IF(AND(SHAPEW<SHAPEH,SHAPEW>0,SHAPEH>0,DIM_3>0,EXTLINK>3),(GLASSOFFSET+OFFSET)*TAN(K50),0)","v":0},{"$f":"IF(AND(SHAPEW<SHAPEH,SHAPEW>0,SHAPEH>0,DIM_3>0,EXTLINK>3),C50-(O50*2),0)","v":0},{"$f":"IF(AND(SHAPEW<SHAPEH,SHAPEW>0,SHAPEH>0,DIM_3>0,EXTLINK>3),F50-O50-P50,0)","v":0},{"$f":"IF(AND(SHAPEW<SHAPEH,SHAPEW>0,SHAPEH>0,DIM_3>0,EXTLINK>3),DIM_3-(P50*2),0)","v":0}]
[null,"ExtLink=2/3 & W>H",{"$f":"IF(AND(SHAPEW>=SHAPEH,SHAPEW>0,SHAPEH>0,DIM_3>0,EXTLINK<=3,EXTLINK>1),((TAN(22.5*(PI()/180)))*SHAPEH/2)*2,0)","v":0},{"$f":"IF(AND(SHAPEW>=SHAPEH,SHAPEW>0,SHAPEH>0,DIM_3>0,EXTLINK<=3,EXTLINK>1),(SHAPEH-C51)/2,0)","v":0},{"$f":"IF(AND(SHAPEW>=SHAPEH,SHAPEW>0,SHAPEH>0,DIM_3>0,EXTLINK<=3,EXTLINK>1),(SHAPEW-DIM_3)/2,0)","v":0},{"$f":"IF(AND(SHAPEW>0,SHAPEH>0,DIM_3>0,SHAPE=123,SHAPEW>=SHAPEH,EXTLINK<=3,EXTLINK>1),SQRT(D51^2+E51^2),0)","v":0},{"$f":"IF(AND(SHAPEW>0,SHAPEH>0,DIM_3>0,SHAPE=123,SHAPEW>=SHAPEH,EXTLINK<=3,EXTLINK>1),DEGREES(ATAN(E51/D51)),0)","v":0},{"$f":"IF(AND(SHAPEW>=SHAPEH,SHAPEW>0,SHAPEH>0,DIM_3>0,EXTLINK<=3,EXTLINK>1),RADIANS((90-(DEGREES(ATAN(D51/E51))))/2),0)","v":0},{"$f":"IF(AND(SHAPEW>=SHAPEH,SHAPEW>0,SHAPEH>0,DIM_3>0,EXTLINK<=3,EXTLINK>1),OFFSET*TAN(H51),0)","v":0},{"$f":"IF(AND(SHAPEW>=SHAPEH,SHAPEW>0,SHAPEH>0,DIM_3>0,EXTLINK<=3,EXTLINK>1),C51-(I51*2),0)","v":0},{"$f":"IF(AND(SHAPEW>=SHAPEH,SHAPEW>0,SHAPEH>0,DIM_3>0,EXTLINK<=3,EXTLINK>1),RADIANS((180-(270-(2*(90-DEGREES(H51)))))/2),0)","v":0},{"$f":"IF(AND(SHAPEW>=SHAPEH,SHAPEW>0,SHAPEH>0,DIM_3>0,EXTLINK<=3,EXTLINK>1),OFFSET*TAN(K51),0)","v":0},{"$f":"IF(AND(SHAPEW>=SHAPEH,SHAPEW>0,SHAPEH>0,DIM_3>0,EXTLINK<=3,EXTLINK>1),F51-I51-L51,0)","v":0},{"$f":"IF(AND(SHAPEW>=SHAPEH,SHAPEW>0,SHAPEH>0,DIM_3>0,EXTLINK<=3,EXTLINK>1),DIM_3,0)","v":0},{"$f":"IF(AND(SHAPEW>=SHAPEH,SHAPEW>0,SHAPEH>0,DIM_3>0,EXTLINK<=3,EXTLINK>1),GLASSOFFSET*TAN(H51),0)","v":0},{"$f":"IF(AND(SHAPEW>=SHAPEH,SHAPEW>0,SHAPEH>0,DIM_3>0,EXTLINK<=3,EXTLINK>1),GLASSOFFSET*TAN(K51),0)","v":0},{"$f":"IF(AND(SHAPEW>=SHAPEH,SHAPEW>0,SHAPEH>0,DIM_3>0,EXTLINK<=3,EXTLINK>1),C51-(O51*2),0)","v":0},{"$f":"IF(AND(SHAPEW>=SHAPEH,SHAPEW>0,SHAPEH>0,DIM_3>0,EXTLINK<=3,EXTLINK>1),F51-O51-P51,0)","v":0},{"$f":"IF(AND(SHAPEW>=SHAPEH,SHAPEW>0,SHAPEH>0,DIM_3>0,EXTLINK<=3,EXTLINK>1),DIM_3-(P51*2),0)","v":0}]
[null,"ExtLink=2/3 & W<H",{"$f":"IF(AND(SHAPEW<SHAPEH,SHAPEW>0,SHAPEH>0,DIM_3>0,EXTLINK<=3,EXTLINK>1),((TAN(22.5*(PI()/180)))*SHAPEW/2)*2,0)","v":0},{"$f":"IF(AND(SHAPEW<SHAPEH,SHAPEW>0,SHAPEH>0,DIM_3>0,EXTLINK<=3,EXTLINK>1),(SHAPEW-C52)/2,0)","v":0},{"$f":"IF(AND(SHAPEW<SHAPEH,SHAPEW>0,SHAPEH>0,DIM_3>0,EXTLINK<=3,EXTLINK>1),(SHAPEH-DIM_3)/2,0)","v":0},{"$f":"IF(AND(SHAPEW>0,SHAPEH>0,DIM_3>0,SHAPE=123,SHAPEW<SHAPEH,EXTLINK<=3,EXTLINK>1),SQRT(D52^2+E52^2),0)","v":0},{"$f":"IF(AND(SHAPEW>0,SHAPEH>0,DIM_3>0,SHAPE=123,SHAPEW<SHAPEH,EXTLINK<=3,EXTLINK>1),DEGREES(ATAN(E52/D52)),0)","v":0},{"$f":"IF(AND(SHAPEW<SHAPEH,SHAPEW>0,SHAPEH>0,DIM_3>0,EXTLINK<=3,EXTLINK>1),RADIANS((90-(DEGREES(ATAN(D52/E52))))/2),0)","v":0},{"$f":"IF(AND(SHAPEW<SHAPEH,SHAPEW>0,SHAPEH>0,DIM_3>0,EXTLINK<=3,EXTLINK>1),OFFSET*TAN(H52),0)","v":0},{"$f":"IF(AND(SHAPEW<SHAPEH,SHAPEW>0,SHAPEH>0,DIM_3>0,EXTLINK<=3,EXTLINK>1),C52-(I52*2),0)","v":0},{"$f":"IF(AND(SHAPEW<SHAPEH,SHAPEW>0,SHAPEH>0,DIM_3>0,EXTLINK<=3,EXTLINK>1),RADIANS((180-(270-(2*(90-DEGREES(H52)))))/2),0)","v":0},{"$f":"IF(AND(SHAPEW<SHAPEH,SHAPEW>0,SHAPEH>0,DIM_3>0,EXTLINK<=3,EXTLINK>1),OFFSET*TAN(K52),0)","v":0},{"$f":"IF(AND(SHAPEW<SHAPEH,SHAPEW>0,SHAPEH>0,DIM_3>0,EXTLINK<=3,EXTLINK>1),F52-I52-L52,0)","v":0},{"$f":"IF(AND(SHAPEW<SHAPEH,SHAPEW>0,SHAPEH>0,DIM_3>0,EXTLINK<=3,EXTLINK>1),DIM_3,0)","v":0},{"$f":"IF(AND(SHAPEW<SHAPEH,SHAPEW>0,SHAPEH>0,DIM_3>0,EXTLINK<=3,EXTLINK>1),GLASSOFFSET*TAN(H52),0)","v":0},{"$f":"IF(AND(SHAPEW<SHAPEH,SHAPEW>0,SHAPEH>0,DIM_3>0,EXTLINK<=3,EXTLINK>1),GLASSOFFSET*TAN(K52),0)","v":0},{"$f":"IF(AND(SHAPEW<SHAPEH,SHAPEW>0,SHAPEH>0,DIM_3>0,EXTLINK<=3,EXTLINK>1),C52-(O52*2),0)","v":0},{"$f":"IF(AND(SHAPEW<SHAPEH,SHAPEW>0,SHAPEH>0,DIM_3>0,EXTLINK<=3,EXTLINK>1),F52-O52-P52,0)","v":0},{"$f":"IF(AND(SHAPEW<SHAPEH,SHAPEW>0,SHAPEH>0,DIM_3>0,EXTLINK<=3,EXTLINK>1),DIM_3-(P52*2),0)","v":0}]
[null,null,{"$f":"MAX(C49:C52)","v":0},0,0,0,0,0,{"$f":"MAX(I49:I52)","v":0},0,0,0,0,0,0,0,0,0,0]
[]
[]
[]
[]
[null,null,127]
[null,null,"Frame",null,null,null,null,null,null,"Glass",null,null,null,null,null,null,"Extrusion"]
[null,null,"R","F Peak","F Bott.","d-ver","d-hor","Peak","Bott. Corner","R","F Peak","F Bott.","d-ver","d-hor","Peak","Bott. Corner","R","F Peak","F Bott.","d-ver","d-hor","Peak","Bott. Corner"]
[null,"ExtLink>3 & W<H",{"$f":"IF(AND(EXTLINK>3,SHAPEW<SHAPEH),((SHAPEH)^2+(SHAPEW/2)^2)/(2*(SHAPEW/2))-OFFSET,0)","v":0},{"$f":"IF(C61>0,2*(ASIN(((((C61+OFFSET)-SHAPEW)+OFFSET)*2)/(2*C61))),0)","v":0},{"$f":"IF(C61>0,2*(ASIN((OFFSET*2)/(2*C61))),0)","v":0},{"$f":"IF(C61>0,(C61*(COS(D61/2)))-OFFSET,0)","v":0},{"$f":"IF(C61>0,(C61*(COS(E61/2)))-OFFSET,0)","v":0},{"$f":"IF(C61>0,SHAPEH-F61-OFFSET,0)","v":0},{"$f":"IF(C61>0,C61-G61,0)","v":0},{"$f":"IF(C61>0,C61-GLASSOFFSET,0)","v":0},{"$f":"IF(C61>0,2*(ASIN(((((J61+(OFFSET+GLASSOFFSET))-SHAPEW)+(OFFSET+GLASSOFFSET))*2)/(2*J61))),0)","v":0},{"$f":"IF(C61>0,2*(ASIN(((OFFSET+GLASSOFFSET)*2)/(2*J61))),0)","v":0},{"$f":"IF(C61>0,(J61*(COS(K61/2)))-(OFFSET+GLASSOFFSET),0)","v":0},{"$f":"IF(C61>0,(J61*(COS(L61/2)))-(OFFSET+GLASSOFFSET),0)","v":0},{"$f":"IF(C61>0,SHAPEH-M61-(OFFSET+GLASSOFFSET),0)","v":0},{"$f":"IF(C61>0,J61-N61,0)","v":0},{"$f":"IF(C61>0,C61-EXTOFFSET,0)","v":0},{"$f":"IF(J61>0,2*(ASIN(((((Q61+(OFFSET+EXTOFFSET))-SHAPEW)+(OFFSET+EXTOFFSET))*2)/(2*Q61))),0)","v":0},{"$f":"IF(J61>0,2*(ASIN(((OFFSET+EXTOFFSET)*2)/(2*Q61))),0)","v":0},{"$f":"IF(J61>0,(Q61*(COS(R61/2)))-(OFFSET+EXTOFFSET),0)","v":0},{"$f":"IF(J61>0,(Q61*(COS(S61/2)))-(OFFSET+EXTOFFSET),0)","v":0},{"$f":"IF(J61>0,SHAPEH-T61-(OFFSET+EXTOFFSET),0)","v":0},{"$f":"IF(J61>0,Q61-U61,0)","v":0}]
[null,"ExtLink=2/3 & W<H",{"$f":"IF(AND(EXTLINK<=3,EXTLINK>1,SHAPEW<SHAPEH),((SHAPEH)^2+(SHAPEW/2)^2)/(2*(SHAPEW/2)),0)","v":0},null,null,null,null,null,null,{"$f":"IF(C62>0,C62-GLASSOFFSET,0)","v":0},{"$f":"IF(C62>0,2*(ASIN(((((J62+GLASSOFFSET)-SHAPEW)+GLASSOFFSET)*2)/(2*J62))),0)","v":0},{"$f":"IF(C62>0,2*(ASIN((GLASSOFFSET*2)/(2*J62))),0)","v":0},{"$f":"IF(C62>0,(J62*(COS(K62/2)))-GLASSOFFSET,0)","v":0},{"$f":"IF(C62>0,(J62*(COS(L62/2)))-GLASSOFFSET,0)","v":0},{"$f":"IF(C62>0,SHAPEH-M62-GLASSOFFSET,0)","v":0},{"$f":"IF(C62>0,J62-N62,0)","v":0},{"$f":"IF(C62>0,C62-EXTOFFSET,0)","v":0},{"$f":"IF(J62>0,2*(ASIN(((((Q62+EXTOFFSET)-SHAPEW)+EXTOFFSET)*2)/(2*Q62))),0)","v":0},{"$f":"IF(J62>0,2*(ASIN((EXTOFFSET*2)/(2*Q62))),0)","v":0},{"$f":"IF(J62>0,(Q62*(COS(R62/2)))-EXTOFFSET,0)","v":0},{"$f":"IF(J62>0,(Q62*(COS(S62/2)))-EXTOFFSET,0)","v":0},{"$f":"IF(J62>0,SHAPEH-T62-EXTOFFSET,0)","v":0},{"$f":"IF(J62>0,Q62-U62,0)","v":0}]
[null,null,{"$f":"MAX(C61:C62)","v":0},0,0,0,0,0,0,0,0,0,0,0,0,0,0,0,0,0,0,0,0]
[null,null,null,null,null,null,null,null,null,null,null,null,null,null,null,null,null,null,null,null,null,{"$f":"V63-H63","v":0},{"$f":"W63-I63","v":0}]
[]
[]
[]
[null,null,null,"FW","FH","FL","Message"]
[null,null,105,{"$f":"IF(SHAPE=C69,FW,0)","v":0},{"$f":"IF(SHAPE=C69,FH,0)","v":0},null,{"$f":"IF(E69<(D69/2),\"Order 105 Brickmold & 113 Frame\",\"\")","v":""}]
[null,null,110,{"$f":"IF(SHAPE=C70,FW,0)","v":0},{"$f":"IF(SHAPE=C70,FH,0)","v":0},{"$f":"IF(SHAPE=C70,FL,0)","v":0},{"$f":"IF(AND(F70<=0,E70<(D70/2),(SHAPEW/2)<SHAPEH,EXTLINK>2),\"Order 110 Brickmold & 113 Frame\",\"\")","v":""}]
[null,null,112,{"$f":"IF(SHAPE=C71,FW,0)","v":0},{"$f":"IF(SHAPE=C71,FH,0)","v":0},{"$f":"IF(SHAPE=C71,FL,0)","v":0},{"$f":"IF(E71<D71,\"Order 115\",IF(F71>0,\"Order 112 Brickmold & 116 Frame\",\"\"))","v":""}]
[null,null,null,{"$f":"MAX(D69:D71)","v":0},{"$f":"MAX(E69:E71)","v":0},{"$f":"IF(F70<>0,F70,IF(F71<>0,F71,0))","v":0},{"$f":"IF(G69>\"\",G69,IF(G70>\"\",G70,IF(G71>\"\",G71,\"\")))","v":""}]