{"text_format":"1","workbook":"xlsx","n_sheets":3,"sheets":["Home","Shape Limits","Data"],"not_rendered":{"charts":0,"images":23,"macros":1,"external_links":0,"defined_names":80,"comments":1,"pivot_tables":0},"unopened":[],"bounds":{"document_bytes":16777216,"sheet_cells":100000,"rows_first":2000,"rows_last":500,"rows_between":2000,"halvings":0,"cell_chars":16384,"cell_head_chars":4096},"cells_cut":0,"cells_raw":0,"read":"whole","date_system":"1900"}

{"sheet":"Home","index":0,"n_rows":18,"n_cols":14,"rows_kept":18,"cut":false,"hidden":false,"merged":[[20,1,20,13],[0,11,1,13],[5,13,6,13],[17,13,18,13],[5,11,6,11],[17,12,18,12],[17,11,18,11],[17,10,18,10],[5,12,6,12],[16,2,16,7],[15,2,15,7],[5,10,6,10],[2,3,2,7],[7,3,7,6],[13,2,13,7],[14,2,14,7],[10,2,11,2]]}
[null,null,null,null,null,null,null,null,null,null,null,"Manufacturing Data"]
[]
[null,null,null,"Windows Min. Max. Look-up",null,null,null,null,null,null,1,{"$f":"VLOOKUP($K3,'Shape Limits'!$S:$U,2,FALSE)","v":{"$error":"#N/A"}},{"$f":"VLOOKUP($K3,'Shape Limits'!$S:$U,3,FALSE)","v":{"$error":"#N/A"}},{"$f":"IF((VLOOKUP($K3,'Shape Limits'!$S:$V,4,FALSE))=1,\"Z\",\"\")","v":{"$error":"#N/A"}}]
[null,null,"Model #","Min. W","Min. H","Max. W","Max. H","Max. UI",null,null,2,{"$f":"VLOOKUP($K4,'Shape Limits'!$S:$U,2,FALSE)","v":{"$error":"#N/A"}},{"$f":"VLOOKUP($K4,'Shape Limits'!$S:$U,3,FALSE)","v":{"$error":"#N/A"}},{"$f":"IF((VLOOKUP($K4,'Shape Limits'!$S:$V,4,FALSE))=1,\"Z\",\"\")","v":{"$error":"#N/A"}}]
[null,null,{"$f":"MODEL","v":""},{"$f":"MINW","v":""},{"$f":"MINH","v":""},{"$f":"MAXW","v":""},{"$f":"MAXH","v":""},{"$f":"MAXUI","v":""},null,null,3,{"$f":"VLOOKUP($K5,'Shape Limits'!$S:$U,2,FALSE)","v":{"$error":"#N/A"}},{"$f":"VLOOKUP($K5,'Shape Limits'!$S:$U,3,FALSE)","v":{"$error":"#N/A"}},{"$f":"IF((VLOOKUP($K5,'Shape Limits'!$S:$V,4,FALSE))=1,\"Z\",\"\")","v":{"$error":"#N/A"}}]
[null,null,null,null,null,null,null,null,null,null,4,{"$f":"VLOOKUP($K6,'Shape Limits'!$S:$U,2,FALSE)","v":{"$error":"#N/A"}},{"$f":"VLOOKUP($K6,'Shape Limits'!$S:$U,3,FALSE)","v":{"$error":"#N/A"}},{"$f":"IF((VLOOKUP($K6,'Shape Limits'!$S:$V,4,FALSE))=1,\"Z\",\"\")","v":{"$error":"#N/A"}}]
[]
[null,null,null,"PW / Shapes Min. Max. Look-up",null,null,null,null,null,null,5,{"$f":"VLOOKUP($K8,'Shape Limits'!$S:$U,2,FALSE)","v":{"$error":"#N/A"}},{"$f":"VLOOKUP($K8,'Shape Limits'!$S:$U,3,FALSE)","v":{"$error":"#N/A"}},{"$f":"IF((VLOOKUP($K8,'Shape Limits'!$S:$V,4,FALSE))=1,\"Z\",\"\")","v":{"$error":"#N/A"}}]
[null,null,"Extrusion / Brickmold",null,"Model #",null,null,null,null,null,6,{"$f":"VLOOKUP($K9,'Shape Limits'!$S:$U,2,FALSE)","v":{"$error":"#N/A"}},{"$f":"VLOOKUP($K9,'Shape Limits'!$S:$U,3,FALSE)","v":{"$error":"#N/A"}},{"$f":"IF((VLOOKUP($K9,'Shape Limits'!$S:$V,4,FALSE))=1,\"Z\",\"\")","v":{"$error":"#N/A"}}]
[null,null,null,null,null,null,null,null,null,null,7,{"$f":"VLOOKUP($K10,'Shape Limits'!$S:$U,2,FALSE)","v":{"$error":"#N/A"}},{"$f":"VLOOKUP($K10,'Shape Limits'!$S:$U,3,FALSE)","v":{"$error":"#N/A"}},{"$f":"IF((VLOOKUP($K10,'Shape Limits'!$S:$V,4,FALSE))=1,\"Z\",\"\")","v":{"$error":"#N/A"}}]
[null,null,{"$f":"IF(AND(EXTLINK>3,REGENCYSELECT=1),\"MUST SELECT EXTRUSION\",\"\")","v":""},"Width","Height","Dim. 3","Dim. 4",null,null,null,8,{"$f":"VLOOKUP($K11,'Shape Limits'!$S:$U,2,FALSE)","v":{"$error":"#N/A"}},{"$f":"VLOOKUP($K11,'Shape Limits'!$S:$U,3,FALSE)","v":{"$error":"#N/A"}},{"$f":"IF((VLOOKUP($K11,'Shape Limits'!$S:$V,4,FALSE))=1,\"Z\",\"\")","v":{"$error":"#N/A"}}]
[null,null,null,null,null,null,null,null,null,null,9,{"$f":"VLOOKUP($K12,'Shape Limits'!$S:$U,2,FALSE)","v":{"$error":"#N/A"}},{"$f":"VLOOKUP($K12,'Shape Limits'!$S:$U,3,FALSE)","v":{"$error":"#N/A"}},{"$f":"IF((VLOOKUP($K12,'Shape Limits'!$S:$V,4,FALSE))=1,\"Z\",\"\")","v":{"$error":"#N/A"}}]
[null,null,null,{"$f":"IF(AND(SHAPELINK>1,SHAPEW>0,EXTLINK>3),\"FRAME SIZE TO ORDER ON THE RIGHT PANEL\",IF(AND(SHAPELINK>1,SHAPEW>0,OR(EXTLINK=2,EXTLINK=3)),\"EXACT FRAME SIZE\",\"\"))","v":""},null,null,null,null,null,null,10,{"$f":"VLOOKUP($K13,'Shape Limits'!$S:$U,2,FALSE)","v":{"$error":"#N/A"}},{"$f":"VLOOKUP($K13,'Shape Limits'!$S:$U,3,FALSE)","v":{"$error":"#N/A"}},{"$f":"IF((VLOOKUP($K13,'Shape Limits'!$S:$V,4,FALSE))=1,\"Z\",\"\")","v":{"$error":"#N/A"}}]
[null,null,{"$f":"IF(AND(SHAPELINK>1,EXTLINK>3,ORDERGUIDE>\"\"),ORDERGUIDE,\"\")","v":""},null,null,null,null,null,null,null,11,{"$f":"VLOOKUP($K14,'Shape Limits'!$S:$U,2,FALSE)","v":{"$error":"#N/A"}},{"$f":"VLOOKUP($K14,'Shape Limits'!$S:$U,3,FALSE)","v":{"$error":"#N/A"}},{"$f":"IF((VLOOKUP($K14,'Shape Limits'!$S:$V,4,FALSE))=1,\"Z\",\"\")","v":{"$error":"#N/A"}}]
[null,null,{"$f":"IF(AND(SHAPEW>0,SHAPELIMIT>0,ORDERGUIDE<\"\",EXT>1,PWSELECT=1),\"SIZE IS OUTSIDE LIMITATION\",\"\")","v":""},null,null,null,null,null,null,null,12,{"$f":"VLOOKUP($K15,'Shape Limits'!$S:$U,2,FALSE)","v":{"$error":"#N/A"}},{"$f":"VLOOKUP($K15,'Shape Limits'!$S:$U,3,FALSE)","v":{"$error":"#N/A"}},{"$f":"IF((VLOOKUP($K15,'Shape Limits'!$S:$V,4,FALSE))=1,\"Z\",\"\")","v":{"$error":"#N/A"}}]
{"$rows_left_out":4}
{"sheet":"Shape Limits","index":1,"n_rows":367,"n_cols":61,"rows_kept":367,"cut":false,"hidden":true,"merged":[[1,31,1,32],[2,36,2,37],[0,1,0,2],[0,3,0,10],[0,11,0,12],[1,29,1,30]]}
[null,{"$f":"MAX(D5,D13,D23,D32,D43,D51,D61,D74,D87,D97,D106,D118,D126,D138,D146,D159,D169,D181,D193,D205,D217,D229,D240,D250)","v":0},null,"Shapes Min. Max. Limitations",null,null,null,null,null,null,null,{"$f":"IF(O1>\"\",O1,IF(O2>\"\",O2,IF(O3>\"\",O3,IF(O4>\"\",O4,\"\"))))","v":""},null,null,{"$f":"IF($F$5>\"\",$F$5,IF($F$13>\"\",$F$13,IF($F$23>\"\",$F$23,IF($F$32>\"\",$F$32,IF($F$43>\"\",$F$43,IF($F$51>\"\",$F$51,\"\"))))))","v":""}]
[null,105,"Min R","Max W","Max UI","Max Sq.ft",null,"Frame Width:",{"$f":"IF(AND(SHAPEW>0,SHAPE=B2,EXTLINK>3),TRUNC((2*(SQRT(I4*((2*((SHAPEW/2)-OFFSET))-I4))))*16+0.5)/16,IF(AND(SHAPEW>0,SHAPE=B2,EXTLINK<=3),SHAPEW,0))","v":0},null,null,null,null,null,{"$f":"IF(F61>\"\",F61,IF(F74>\"\",F74,IF(F87>\"\",F87,IF(F97>\"\",F97,IF(F106>\"\",F106,IF(F118>\"\",F118,\"\"))))))","v":""},null,null,null,null,null,null,null,null,null,null,null,null,null,null,"Min",null,"Max"]
[null,{"$f":"EXT","v":1},{"$f":"MIN_R","v":""},{"$f":"MAX_W","v":""},{"$f":"MAX_UI","v":""},{"$f":"MAX_SF","v":""},null,"Frame Radius:",{"$f":"IF(AND(SHAPEW>0,SHAPE=B2,EXTLINK>3),(SHAPEW/2)-OFFSET,IF(AND(SHAPEW>0,SHAPE=B2,EXTLINK<=3),SHAPEW/2,0))","v":0},null,null,null,null,null,{"$f":"IF(F126>\"\",F126,IF(F138>\"\",F138,IF(F146>\"\",F146,IF(F159>\"\",F159,IF(F193>\"\",F193,IF(F205>\"\",F205,\"\"))))))","v":""},null,null,null,null,null,null,null,null,null,null,null,null,1,"Select a Model","W","H","W","H","UI",null,null,"Shapes",null,null,null,null,null,null,null,null,null,null,null,null,null,"Model","Width","Height","Area",null,null,"SS (2.2)","DS (3.2)","4 mm","TS (5.0)"]
[null,null,{"$f":"IF(AND(SHAPEW>0,SHAPE=B2,(FW/2)<C3),1,0)","v":0},{"$f":"IF(AND(SHAPEW>0,EXTLINK>1,SHAPE=B2,FW>D3),1,0)","v":0},{"$f":"IF(AND(SHAPEW>0,EXTLINK>1,SHAPE=B2,(FW+FH)>E3),1,0)","v":0},{"$f":"IF(AND(SHAPEW>0,EXTLINK>1,SHAPE=B2,((FW*FH)/144)>F3),1,0)","v":0},null,"Frame Height:",{"$f":"IF(AND(SHAPEW>0,SHAPE=B2,EXTLINK>3),(SHAPEW/2)-(OFFSET*2),IF(AND(SHAPEW>0,SHAPE=B2,EXTLINK<=3),(SHAPEW/2),0))","v":0},null,null,null,null,null,{"$f":"IF(F169>\"\",F169,IF(F181>\"\",F181,IF(F217>\"\",F217,IF(F229>\"\",F229,IF(F240>\"\",F240,IF(F250>\"\",F250,\"\"))))))","v":""},null,null,null,null,null,null,null,"FH",null,"FW","FL",null,2,"8E00A",10,10,120,120,168,null,1,"Select","Select",null,"<< Cut Angle",null,1,"Select",1,0,0,null,null,null,null,105,{"$f":"I7","v":0},{"$f":"I6","v":0},{"$f":"(AZ4*BA4)/144","v":0},null,"Max. Short",{"$f":"IF(OR($AZ$28>41,$AZ$42>41),0,41)","v":41},{"$f":"IF(OR($AZ$28>56,$AZ$42>56),0,56)","v":56},{"$f":"IF(OR($AZ$28>76,$AZ$42>76),0,76)","v":76},{"$f":"IF(OR($AZ$28>76,$AZ$42>76),0,76)","v":76},"Annealed"]
[null,null,{"$f":"MAX(C4:F4)","v":0},{"$f":"IF(AND(SHAPE=B2,C5=1),1,0)","v":0},{"$f":"IF(AND(SHAPEW>0,SHAPEH>0,SHAPE=B2,SHAPEH<>(SHAPEW/2)),1,0)","v":0},{"$f":"IF(AND(SHAPE=105,E5=1),\"HEIGHT MUST BE 1/2 THE WIDTH\",IF(AND(SHAPE=105,SHAPEW>0,C4>0),\"RADIUS MUST BE GREATER THAN \"&C3,IF(AND(SHAPE=105,I7>0,I7<GlassMinW),\"Glass Width is Under Minimum\",IF(AND(SHAPE=105,I6>0,I6<GlassMinH),\"Glass Height is Under Minimum\",\"\"))))","v":""},null,"Glass R:",{"$f":"IF(AND(SHAPEW>0,EXTLINK>1,SHAPE=B2),I3-GLASSOFFSET,0)","v":0},null,null,null,null,null,{"$f":"Y29","v":0},null,null,105,{"$f":"IF(SHAPE=$B$2,1,0)","v":0},{"$f":"IF(S5>0,\"Frame Width:\",0)","v":0},{"$f":"IF(S5>0,I2,0)","v":0},{"$f":"IF(AND(S5>0,D4>0),1,0)","v":0},{"$f":"U6","v":0},"105",{"$f":"U5","v":0},null,null,3,"3S10A",20,13,80,60,132,null,2,105,"105 (Circle Top)",null,null,null,2,"REGENCY","PI7301",1.4375,1.86,null,null,null,null,110,{"$f":"J13","v":0},{"$f":"J14","v":0},{"$f":"(AZ5*BA5)/144","v":0},null,"Max. Long",{"$f":"IF(OR($BA$28>62,$BA$42>62),0,62)","v":62},{"$f":"IF(OR($BA$28>76,$BA$42>76),0,76)","v":76},{"$f":"IF(OR($BA$28>110,$BA$42>110),0,110)","v":110},{"$f":"IF(OR($BA$28>110,$BA$42>110),0,110)","v":110},"Annealed"]
[null,null,null,null,null,null,null,"Glass H:",{"$f":"IF(AND(SHAPEW>0,SHAPE=B2),I4-(GLASSOFFSET*2),0)","v":0},null,null,null,null,null,{"$f":"W29","v":0},null,null,105,{"$f":"IF(SHAPE=$B$2,2,0)","v":0},{"$f":"IF(S6>0,\"Frame Height:\",0)","v":0},{"$f":"IF(S6>0,I4,0)","v":0},null,{"$f":"U14","v":0},"110",{"$f":"U13","v":0},{"$f":"U16","v":0},null,4,"3S21A",20,13,78,60,132,null,3,110,"110 (Circle Top w/Ex Leg)",null,null,null,3,"REGENCY 400","L4807",1.82948,2.3386,null,null,null,null,111,{"$f":"I24","v":0},{"$f":"I24","v":0},0,null,"Max Sq.Ft.",{"$f":"IF(OR($BB$28>12,$BB$42>12),0,12)","v":12},{"$f":"IF(OR($BB$28>22,$BB$42>22),0,22)","v":22},{"$f":"IF(OR($BB$28>42,$BB$42>42),0,42)","v":42},{"$f":"IF(OR($BB$28>42,$BB$42>42),0,42)","v":42},"Annealed"]
[null,null,null,null,null,null,null,"Glass W:",{"$f":"IF(AND(SHAPEW>0,SHAPE=B2,EXTLINK<=3),2*(SQRT(I6*((2*((I2/2)-GLASSOFFSET))-I6))),IF(AND(SHAPEW>0,SHAPE=B2,EXTLINK>3),2*(SQRT(I6*((2*I5)-I6))),0))","v":0},null,null,null,null,null,null,null,null,105,{"$f":"IF(SHAPE=$B$2,3,0)","v":0},{"$f":"IF(S7>0,\"Frame Radius:\",0)","v":0},{"$f":"IF(S7>0,I3,0)","v":0},{"$f":"IF(AND(S7>0,C4>0),1,0)","v":0},{"$f":"U25","v":0},"111",{"$f":"U24","v":0},null,null,5,"3S40A",13,20,54,84,132,null,4,111,"111 (Quarter Arch)",null,null,null,4,"Standard","1.38BM",1.1875,1.375,null,null,null,null,112,{"$f":"J32","v":0},{"$f":"J33","v":0},0,null,"Max. Short",0,{"$f":"IF(OR($AZ$28>42,$AZ$42>42),0,42)","v":42},{"$f":"IF(OR($AZ$28>70,$AZ$42>70),0,70)","v":70},{"$f":"IF(OR($AZ$28>70,$AZ$42>70),0,70)","v":70},"Tempered"]
[null,null,null,null,null,null,null,null,null,null,null,null,null,null,null,null,null,105,{"$f":"IF(SHAPE=$B$2,4,0)","v":0},{"$f":"IF(S8>0,\"Glass Radius:\",0)","v":0},{"$f":"IF(S8>0,I5,0)","v":0},null,{"$f":"U33","v":0},"112",{"$f":"U32","v":0},{"$f":"U35","v":0},null,6,"3S10C (1/4-1/2-1/4)",40,13,144,60,168,null,5,112,"112 (Quarter Arch w/Ex Leg)",null,null,null,5,"Standard w/NF","1.38NF",1.1875,2.238,null,null,null,null,113,{"$f":"J43","v":0},{"$f":"J42","v":0},0,null,"Max. Long",0,{"$f":"IF(OR($BA$28>84,$BA$42>84),0,84)","v":84},{"$f":"IF(OR($BA$28>129,$BA$42>129),0,129)","v":129},{"$f":"IF(OR($BA$28>129,$BA$42>129),0,129)","v":129},"Tempered"]
[null,null,null,null,null,null,null,null,null,null,null,null,null,null,null,null,null,105,{"$f":"IF(SHAPE=$B$2,5,0)","v":0},{"$f":"IF(S9>0,\"Glass Width:\",0)","v":0},{"$f":"IF(S9>0,I7,0)","v":0},{"$f":"IF(AND(U9>0,U9<GlassMinW),1,0)","v":0},{"$f":"U44","v":0},"113",{"$f":"U43","v":0},null,null,7,"3S10C (1/3-1/3-1/3)",30,13,120,60,168,null,6,113,"113 (Eyebrow)",null,null,null,6,"2\" Brickmold","2.0BM",1.875,2,null,null,null,null,114,{"$f":"J51","v":0},{"$f":"J50","v":0},0,null,"Max Sq.Ft.",0,{"$f":"IF(OR($BB$28>24.5,$BB$42>24.5),0,24.5)","v":24.5},{"$f":"IF(OR($BB$28>42,$BB$42>42),0,42)","v":42},{"$f":"IF(OR($BB$28>42,$BB$42>42),0,42)","v":42},"Tempered"]
[null,110,"Min R","Max W","Max UI","Max H","Min Leg",null,"Frame Width:",{"$f":"IF(AND(SHAPEW>0,SHAPEH>0,SHAPE=110,EXTLINK>3),TRUNC((SHAPEW-(OFFSET*2))*16+0.5)/16,IF(AND(SHAPEW>0,SHAPEH>0,SHAPE=110,EXTLINK<=3),SHAPEW,0))","v":0},null,null,null,null,null,null,null,105,{"$f":"IF(SHAPE=$B$2,6,0)","v":0},{"$f":"IF(S10>0,\"Glass Height:\",0)","v":0},{"$f":"IF(S10>0,I6,0)","v":0},{"$f":"IF(AND(U10>0,U10<GlassMinH),1,0)","v":0},{"$f":"U55","v":0},"114",{"$f":"U54","v":0},null,null,8,"3S21C (1/4-1/2-1/4)",40,13,144,60,168,null,7,114,"114 (Eyebrow w/Ex Leg)",null,null,null,7,"2\" Brickmold w/N.F","2.0NF",1.875,2.875,null,null,null,null,115,{"$f":"D65","v":0},{"$f":"D64","v":0},0,null,null,{"$f":"IF(AND(BE4>0,BE5>0,BE6>0),1,0)","v":1},{"$f":"IF(AND(BF4>0,BF5>0,BF6>0),1,0)","v":1},{"$f":"IF(AND(BG4>0,BG5>0,BG6>0),1,0)","v":1},{"$f":"IF(AND(BH4>0,BH5>0,BH6>0),1,0)","v":1},{"$f":"IF(BE10>0,\"≥SS Annealed\",IF(BF10>0,\"≥DS Annealed\",IF(BH10>0,\"TS Annealed\",\"\")))","v":"≥SS Annealed"}]
[null,{"$f":"EXT","v":1},{"$f":"MIN_R","v":""},{"$f":"MAX_W","v":""},{"$f":"MAX_UI","v":""},{"$f":"MAX_H","v":""},6.25E-2,null,"Frame Height:",{"$f":"IF(AND(SHAPEW>0,SHAPEH>0,SHAPE=110,EXTLINK>3),TRUNC((SHAPEH-(OFFSET*2))*16+0.5)/16,IF(AND(SHAPEW>0,SHAPEH>0,SHAPE=110,EXTLINK<=3),SHAPEH,0))","v":0},null,null,null,null,null,null,null,105,{"$f":"IF(SHAPE=$B$2,7,0)","v":0},{"$f":"IF(S11>0,\"Max Width:\",0)","v":0},{"$f":"IF(S11>0,D3,0)","v":0},{"$f":"IF(AND(S11>0,SHAPEW>0,I2>U11),1,0)","v":0},{"$f":"D67","v":0},"115",{"$f":"D66","v":0},null,null,9,"3S21C (1/3-1/3-1/3)",30,13,120,60,168,null,8,115,"115 (Half Eyebrow)",null,null,null,8,"Narrow Brickmold","Narrow",0.5,0.6825,null,null,null,null,116,{"$f":"D79","v":0},{"$f":"D78","v":0},0,null,null,null,{"$f":"IF(AND(BF7>0,BF8>0,BF9>0),1,0)","v":1},{"$f":"IF(AND(BG7>0,BG8>0,BG9>0),1,0)","v":1},{"$f":"IF(AND(BH7>0,BH8>0,BH9>0),1,0)","v":1},{"$f":"IF(BF11>0,\"≥DS Tempered\",IF(BH11>0,\"TS Tempered\",\"\"))","v":"≥DS Tempered"}]
[null,null,{"$f":"IF(AND(SHAPEW>0,SHAPE=B10,(FW/2)<C11),1,0)","v":0},{"$f":"IF(AND(SHAPEW>0,EXTLINK>1,SHAPE=B10,FW>D11),1,0)","v":0},{"$f":"IF(AND(SHAPEW>0,EXTLINK>1,SHAPE=B10,(FW+FH)>E11),1,0)","v":0},{"$f":"IF(AND(SHAPEW>0,EXTLINK>1,SHAPE=B10,FH>D11),1,0)","v":0},{"$f":"IF(AND(SHAPEW>0,SHAPEH>0,SHAPE=110,(FH-FW/2)<G11,(FH-FW/2)>0),1,0)","v":0},null,"Frame Radius:",{"$f":"IF(AND(SHAPEW>0,SHAPEH>0),J10/2,0)","v":0},null,null,null,null,null,null,null,105,{"$f":"IF(SHAPE=$B$2,8,0)","v":0},{"$f":"IF(S12>0,\"Max sq.ft.:\",0)","v":0},{"$f":"IF(S12>0,F3,0)","v":0},{"$f":"IF(AND(S12>0,F4>0),1,0)","v":0},{"$f":"D82","v":0},"116",{"$f":"D81","v":0},null,null,10,"8E10A",21,13,80,60,132,null,9,116,"116 (Half Eyebrow w/Ex Leg)",null,null,null,1,{"$f":"VLOOKUP(AP12,EXTCHART,2,FALSE)","v":"Select"},{"$f":"VLOOKUP(EXTLINK,EXTCHART,3,FALSE)","v":1},{"$f":"IF(EXTLINK>3,VLOOKUP(EXTLINK,EXTCHART,4,FALSE),0)","v":0},{"$f":"VLOOKUP(EXTLINK,EXTCHART,5,FALSE)","v":0},null,null,null,null,117,{"$f":"J91","v":0},{"$f":"J92","v":0},0,null,null,"2.5 mm","3.2 mm","4 mm","5 mm"]
[null,null,{"$f":"MAX(C12:G12)","v":0},{"$f":"IF(AND(SHAPE=B10,C13=1),1,0)","v":0},{"$f":"IF(AND(SHAPEW>0,EXTLINK>1,SHAPEH>0,SHAPE=110,(FH-J17)<>(FW/2),EXTLINK=2),1,IF(AND(SHAPEW>0,EXTLINK>1,SHAPEH>0,SHAPE=110,(SHAPEH-J17)<(SHAPEW/2),EXTLINK>2),1,0))","v":0},{"$f":"IF(AND(SHAPE=110,E13=1),\"HEIGHT MUST BE 1/2 THE WIDTH + Leg\",IF(AND(SHAPE=110,SHAPEW>0,C12>0),\"RADIUS MUST BE GREATER THAN \"&C11,IF(AND(SHAPE=110,J13>0,J13<GlassMinW),\"Glass Width is Under Minimum\",IF(AND(SHAPE=110,J14>0,J14<GlassMinH),\"Glass Height is Under Minimum\",\"\"))))","v":""},null,null,"Glass W:",{"$f":"IF(AND(SHAPEW>0,SHAPEH>0,EXTLINK>1,SHAPE=110),J10-(GLASSOFFSET*2),0)","v":0},null,null,null,null,null,null,null,110,{"$f":"IF(SHAPE=$B$10,1,0)","v":0},{"$f":"IF(S13>0,\"Frame Width:\",0)","v":0},{"$f":"IF(S13>0,J10,0)","v":0},{"$f":"IF(AND(S13>0,D12>0),1,0)","v":0},{"$f":"I85","v":0},"117",{"$f":"I84","v":0},null,null,11,"8E21A",21,13,78,60,132,null,10,117,"117 (Ellipse)",null,null,null,1,null,{"$f":"IF(OR(EXTLINK=2,EXTLINK=3),VLOOKUP(EXTLINK,EXTCHART,3,FALSE),IF(EXTLINK>3,VLOOKUP(REGENCYSELECT,EXTCHART,3,FALSE),0))","v":0},{"$f":"IF(OR(EXTLINK=2,EXTLINK=3),VLOOKUP(EXTLINK,EXTCHART,4,FALSE),IF(EXTLINK>3,VLOOKUP(REGENCYSELECT,EXTCHART,4,FALSE),0))","v":0},null,null,null,null,null,118,{"$f":"I96","v":0},{"$f":"I97","v":0},0,null,"Max. Short",{"$f":"IF(OR($BA$28>41,$BA$42>41),0,41)","v":41},{"$f":"IF(OR($BA$28>56,$BA$42>56),0,56)","v":56},{"$f":"IF(OR($BA$28>76,$BA$42>76),0,76)","v":76},{"$f":"IF(OR($BA$28>76,$BA$42>76),0,76)","v":76},"Annealed"]
[null,null,null,null,null,null,null,null,"Glass H:",{"$f":"IF(AND(SHAPEW>0,SHAPEH>0,EXTLINK>1,SHAPE=110),J11-(GLASSOFFSET*2),0)","v":0},null,null,null,null,null,null,null,110,{"$f":"IF(SHAPE=$B$10,2,0)","v":0},{"$f":"IF(S14>0,\"Frame Height:\",0)","v":0},{"$f":"IF(S14>0,J11,0)","v":0},{"$f":"IF(AND(S14>0,F12>0),1,0)","v":0},{"$f":"I95","v":0},"118",{"$f":"I95","v":0},null,null,12,"8E40A",13,21,54,84,132,null,11,118,"118 (Full Circle)",null,null,null,null,null,null,null,null,null,null,null,null,119,{"$f":"U118","v":0},{"$f":"U119","v":0},0,null,"Max. Long",{"$f":"IF(OR($AZ$28>62,$AZ$42>62),0,62)","v":62},{"$f":"IF(OR($AZ$28>76,$AZ$42>76),0,76)","v":76},{"$f":"IF(OR($AZ$28>110,$AZ$42>110),0,110)","v":110},{"$f":"IF(OR($AZ$28>110,$AZ$42>110),0,110)","v":110},"Annealed"]
[null,null,null,null,null,null,null,null,"Glass Leg H:",{"$f":"IF(AND(SHAPEW>0,SHAPEH>0,EXTLINK>1,SHAPE=110,(J11-J10/2)>0),(J11-J10/2)-GLASSOFFSET,0)","v":0},{"$f":"IF(J15<0,0,J15)","v":0},null,null,null,null,null,null,110,{"$f":"IF(SHAPE=$B$10,3,0)","v":0},{"$f":"IF(S15>0,\"Frame Radius:\",0)","v":0},{"$f":"IF(S15>0,J12,0)","v":0},{"$f":"IF(AND(S15>0,C12>0),1,0)","v":0},{"$f":"D109","v":0},"119",{"$f":"D108","v":0},null,null,13,"8V71F",12,12,120,120,168,null,12,119,"119 (Oval)",null,null,null,null,null,null,null,null,null,null,null,null,120,{"$f":"J118","v":0},{"$f":"J119","v":0},0,null,"Max Sq.Ft.",{"$f":"IF(OR($BB$28>12,$BB$42>12),0,12)","v":12},{"$f":"IF(OR($BB$28>22,$BB$42>22),0,22)","v":22},{"$f":"IF(OR($BB$28>42,$BB$42>42),0,42)","v":42},{"$f":"IF(OR($BB$28>42,$BB$42>42),0,42)","v":42},"Annealed"]
{"$rows_left_out":353}
{"sheet":"Data","index":2,"n_rows":72,"n_cols":23,"rows_kept":72,"cut":false,"hidden":true,"merged":[]}
[]
[null,"Min. W","Min. H 113","Min. H 115","Max. W","Max. H","Max. UI","Max. SF","Min. R","Min. Leg","CutLength","Min. Angle","FW","FH"]
["PI7301",10,{"$f":"(TRUNC(SQRT(FW+5.75)*16+0.5)/16)+(GLASSOFFSET*2)","v":2.375},{"$f":"(TRUNC(SQRT(FW+5.75)*16+0.5)/16)+(GLASSOFFSET*2)","v":2.375},95,95,154,56,{"$f":"PI_7301","v":13},6,10,8.5]
["L4807",10,{"$f":"(TRUNC(SQRT(FW+7.3125)*16+0.5)/16)+(GLASSOFFSET*2)","v":2.6875},{"$f":"(TRUNC(SQRT(FW+7.3125)*16+0.5)/16)+(GLASSOFFSET*2)","v":2.6875},95,95,154,56,{"$f":"L_4807","v":13.5},6,10,8.5]
["1.38BM"]
["1.38NF"]
["2.0BM"]
["2.0NF"]
["Narrow"]
[null,{"$f":"IF(EXT=1,\"\",VLOOKUP(R_EXT,DATA,2,FALSE))","v":""},{"$f":"IF(EXT=1,\"\",VLOOKUP(R_EXT,DATA,3,FALSE))","v":""},{"$f":"IF(EXT=1,\"\",VLOOKUP(R_EXT,DATA,4,FALSE))","v":""},{"$f":"IF(EXT=1,\"\",VLOOKUP(R_EXT,DATA,5,FALSE))","v":""},{"$f":"IF(EXT=1,\"\",VLOOKUP(R_EXT,DATA,6,FALSE))","v":""},{"$f":"IF(EXT=1,\"\",VLOOKUP(R_EXT,DATA,7,FALSE))","v":""},{"$f":"IF(EXT=1,\"\",VLOOKUP(R_EXT,DATA,8,FALSE))","v":""},{"$f":"IF(EXT=1,\"\",VLOOKUP(R_EXT,DATA,9,FALSE))","v":""},{"$f":"IF(EXT=1,\"\",VLOOKUP(R_EXT,DATA,10,FALSE))","v":""},{"$f":"IF(EXT=1,\"\",VLOOKUP(R_EXT,DATA,11,FALSE))","v":""},{"$f":"IF(EXT=1,\"\",VLOOKUP(R_EXT,DATA,12,FALSE))","v":""}]
[]
[null,null,115]
[null,null,"Frame",null,null,null,null,null,null,"Glass",null,null,null,null,null,null,"Extrusion"]
[null,null,"R","F Peak","F Bott.","d-ver","d-hor","Peak","Bott. Corner","R","F Peak","F Bott.","d-ver","d-hor","Peak","Bott. Corner","R","F Peak","F Bott.","d-ver","d-hor","Peak","Bott. Corner"]
[null,"ExtLink>3 & W>H",{"$f":"IF(AND(EXTLINK>3,SHAPEW>SHAPEH),(((SHAPEW)^2+SHAPEH^2)/(2*SHAPEH))-OFFSET,0)","v":0},{"$f":"IF(C15>0,2*(ASIN((OFFSET*2)/(2*C15))),0)","v":0},{"$f":"IF(C15>0,2*(ASIN(((((C15+OFFSET)-SHAPEH)+OFFSET)*2)/(2*C15))),0)","v":0},{"$f":"IF(C15>0,(C15*(COS(D15/2)))-OFFSET,0)","v":0},{"$f":"IF(C15>0,(C15*(COS(E15/2)))-OFFSET,0)","v":0},{"$f":"IF(C15>0,C15-F15,0)","v":0},{"$f":"IF(C15>0,SHAPEW-G15-OFFSET,0)","v":0},{"$f":"IF(C15>0,C15-GLASSOFFSET,0)","v":0},{"$f":"IF(C15>0,2*(ASIN(((OFFSET+GLASSOFFSET)*2)/(2*J15))),0)","v":0},{"$f":"IF(C15>0,2*(ASIN(((((J15+(OFFSET+GLASSOFFSET))-SHAPEH)+(OFFSET+GLASSOFFSET))*2)/(2*J15))),0)","v":0},{"$f":"IF(C15>0,(J15*(COS(K15/2)))-(OFFSET+GLASSOFFSET),0)","v":0},{"$f":"IF(J15>0,(J15*(COS(L15/2)))-(OFFSET+GLASSOFFSET),0)","v":0},{"$f":"IF(C15>0,J15-M15,0)","v":0},{"$f":"IF(C15>0,SHAPEW-N15-(OFFSET+GLASSOFFSET),0)","v":0},{"$f":"IF(C15>0,C15-EXTOFFSET,0)","v":0},{"$f":"IF(J15>0,2*(ASIN(((OFFSET+EXTOFFSET)*2)/(2*Q15))),0)","v":0},{"$f":"IF(J15>0,2*(ASIN(((((Q15+(OFFSET+EXTOFFSET))-SHAPEH)+(OFFSET+EXTOFFSET))*2)/(2*Q15))),0)","v":0},{"$f":"IF(J15>0,(Q15*(COS(R15/2)))-(OFFSET+EXTOFFSET),0)","v":0},{"$f":"IF(Q15>0,(Q15*(COS(S15/2)))-(OFFSET+EXTOFFSET),0)","v":0},{"$f":"IF(J15>0,Q15-T15,0)","v":0},{"$f":"IF(J15>0,SHAPEW-U15-(OFFSET+EXTOFFSET),0)","v":0}]
{"$rows_left_out":57}