{"text_format":"1","workbook":"xlsx","n_sheets":4,"sheets":["Form","Data","Balance","CMR"],"not_rendered":{"charts":0,"images":1,"macros":1,"external_links":0,"defined_names":159,"comments":0,"pivot_tables":0},"unopened":[],"bounds":{"document_bytes":16777216,"sheet_cells":100000,"rows_first":2000,"rows_last":500,"rows_between":2000,"halvings":0,"cell_chars":16384,"cell_head_chars":4096},"cells_cut":0,"cells_raw":0,"read":"whole","date_system":"1900"}

{"sheet":"Form","index":0,"n_rows":24,"n_cols":16,"rows_kept":24,"cut":false,"hidden":false,"merged":[[15,13,16,15],[13,14,13,15],[28,12,28,13],[25,12,25,13],[19,12,19,14],[20,12,20,14],[27,12,27,13],[21,12,21,14],[23,9,23,15],[20,9,20,10],[22,9,22,15],[19,9,19,10],[21,9,21,10],[26,12,26,13],[2,1,2,6],[6,14,6,15],[5,14,5,15],[2,9,2,12],[3,1,3,7],[3,9,3,12],[2,13,2,14],[3,13,3,14]]}
[]
[null,{"$f":"IF(AND(WSIZE>0,HSIZE>0),\"Only Available At\"&\"  \"&WSIZE&\" x \"&HSIZE&IF(HCONTROL=1,\" or \"&HSIZE2,\"\"),\"\")","v":""},null,null,null,null,null,"Select a Model"]
[null,{"$f":"IF(Model_Select=\"Select Model\",\"Select a Model\",\"(Model\"&\" \"&ModelNo&\")\")","v":"Select a Model"},null,null,null,null,null,null,null,{"$f":"\"Min. W:\"&\" \"&MINW","v":"Min. W: 0"},null,null,null,{"$f":"\"Max W:\"&\" \"&MAXW","v":"Max W: 0"}]
[null,{"$f":"Description","v":0},null,null,null,null,null,null,null,{"$f":"\"Min. H:\"&\" \"&MINH","v":"Min. H: 0"},null,null,null,{"$f":"\"Max H:\"&\" \"&MAXH","v":"Max H: 0"},null,{"$f":"\"Max UI:\"&\" \"&MAXUI","v":"Max UI: 0"}]
[null,{"$f":"IF(AND(W>0,H>0),(IF(ISERROR(VLOOKUP(1,Data!$A:$D,3,FALSE)),\"\",VLOOKUP(1,Data!$A:$D,3,FALSE))),\"\")","v":""},null,null,null,null,null,{"$f":"IF(AND(W>0,H>0),(IF(ISERROR(VLOOKUP(1,Data!$A:$D,4,FALSE)),\"\",VLOOKUP(1,Data!$A:$D,4,FALSE))),\"\")","v":""},null,null,null,null,null,"Exact Size"]
[null,{"$f":"IF(AND(W>0,H>0),(IF(ISERROR(VLOOKUP(2,Data!$A:$D,3,FALSE)),\"\",VLOOKUP(2,Data!$A:$D,3,FALSE))),\"\")","v":""},null,null,null,null,null,{"$f":"IF(AND(W>0,H>0),(IF(ISERROR(VLOOKUP(2,Data!$A:$D,4,FALSE)),\"\",VLOOKUP(2,Data!$A:$D,4,FALSE))),\"\")","v":""},null,"Width:",null,null,null,{"$f":"IF(AND(RO=2,W>0),W-WCUTBACK,W)","v":0},{"$f":"IF(AND(W>0,WSIZE>0,W<>WSIZE),\"<< Width Not Available\",\"\")","v":""}]
[null,{"$f":"IF(AND(W>0,H>0),(IF(ISERROR(VLOOKUP(3,Data!$A:$D,3,FALSE)),\"\",VLOOKUP(3,Data!$A:$D,3,FALSE))),\"\")","v":""},null,null,null,null,null,{"$f":"IF(AND(W>0,H>0),(IF(ISERROR(VLOOKUP(3,Data!$A:$D,4,FALSE)),\"\",VLOOKUP(3,Data!$A:$D,4,FALSE))),\"\")","v":""},null,"Height:",null,null,null,{"$f":"IF(AND(RO=2,H>0),H-HCUTBACK,H)","v":0},{"$f":"IF(AND(H>0,HSIZE>0,HSIZE2>0,H<>HSIZE,H<>HSIZE2),\"<< Height Not Available\",\"\")","v":""}]
[null,{"$f":"IF(AND(W>0,H>0),(IF(ISERROR(VLOOKUP(4,Data!$A:$D,3,FALSE)),\"\",VLOOKUP(4,Data!$A:$D,3,FALSE))),\"\")","v":""},null,null,null,null,null,{"$f":"IF(AND(W>0,H>0),(IF(ISERROR(VLOOKUP(4,Data!$A:$D,4,FALSE)),\"\",VLOOKUP(4,Data!$A:$D,4,FALSE))),\"\")","v":""}]
[null,{"$f":"IF(AND(W>0,H>0),(IF(ISERROR(VLOOKUP(5,Data!$A:$D,3,FALSE)),\"\",VLOOKUP(5,Data!$A:$D,3,FALSE))),\"\")","v":""},null,null,null,null,null,{"$f":"IF(AND(W>0,H>0),(IF(ISERROR(VLOOKUP(5,Data!$A:$D,4,FALSE)),\"\",VLOOKUP(5,Data!$A:$D,4,FALSE))),\"\")","v":""},null,{"$f":"IF(BTYPE=\"Custom\",\"CMR:\",\"\")","v":""},null,null,null,{"$f":"IF(AND(W>0,H>0,BTYPE=\"Custom\",CMR=0),\"<< Enter CMR Location\",\"\")","v":""}]
[null,{"$f":"IF(AND(W>0,H>0),(IF(ISERROR(VLOOKUP(6,Data!$A:$D,3,FALSE)),\"\",VLOOKUP(6,Data!$A:$D,3,FALSE))),\"\")","v":""},null,null,null,null,null,{"$f":"IF(AND(W>0,H>0),(IF(ISERROR(VLOOKUP(6,Data!$A:$D,4,FALSE)),\"\",VLOOKUP(6,Data!$A:$D,4,FALSE))),\"\")","v":""},null,{"$f":"IF(SELECTEXT=\"Select Extrusion\",\"Ext.\",IF(SELECTEXT=\"Select Reinforcement\",\"Reinforce\",\"\"))","v":""},null,null,null,{"$f":"EXT_MESSAGE","v":""}]
[null,{"$f":"IF(AND(W>0,H>0),(IF(ISERROR(VLOOKUP(7,Data!$A:$D,3,FALSE)),\"\",VLOOKUP(7,Data!$A:$D,3,FALSE))),\"\")","v":""},null,null,null,null,null,{"$f":"IF(AND(W>0,H>0),(IF(ISERROR(VLOOKUP(7,Data!$A:$D,4,FALSE)),\"\",VLOOKUP(7,Data!$A:$D,4,FALSE))),\"\")","v":""},null,"Opening:",null,null,null,{"$f":"RO_OPTION","v":0}]
[null,{"$f":"IF(AND(W>0,H>0),(IF(ISERROR(VLOOKUP(8,Data!$A:$D,3,FALSE)),\"\",VLOOKUP(8,Data!$A:$D,3,FALSE))),\"\")","v":""},null,null,null,null,null,{"$f":"IF(AND(W>0,H>0),(IF(ISERROR(VLOOKUP(8,Data!$A:$D,4,FALSE)),\"\",VLOOKUP(8,Data!$A:$D,4,FALSE))),\"\")","v":""},null,"Type:"]
[null,{"$f":"IF(AND(W>0,H>0),(IF(ISERROR(VLOOKUP(9,Data!$A:$D,3,FALSE)),\"\",VLOOKUP(9,Data!$A:$D,3,FALSE))),\"\")","v":""},null,null,null,null,null,{"$f":"IF(AND(W>0,H>0),(IF(ISERROR(VLOOKUP(9,Data!$A:$D,4,FALSE)),\"\",VLOOKUP(9,Data!$A:$D,4,FALSE))),\"\")","v":""},null,"Screen:"]
[null,{"$f":"IF(AND(W>0,H>0),(IF(ISERROR(VLOOKUP(10,Data!$A:$D,3,FALSE)),\"\",VLOOKUP(10,Data!$A:$D,3,FALSE))),\"\")","v":""},null,null,null,null,null,{"$f":"IF(AND(W>0,H>0),(IF(ISERROR(VLOOKUP(10,Data!$A:$D,4,FALSE)),\"\",VLOOKUP(10,Data!$A:$D,4,FALSE))),\"\")","v":""},null,"Glass:",null,null,null,null,{"$f":"GLASS_MESSAGE","v":0}]
[]
[null,{"$f":"IF(AND(W>0,H>0),(IF(ISERROR(VLOOKUP(11,Data!$A:$D,3,FALSE)),\"\",VLOOKUP(11,Data!$A:$D,3,FALSE))),\"\")","v":""},null,null,null,null,null,{"$f":"IF(AND(W>0,H>0),(IF(ISERROR(VLOOKUP(11,Data!$A:$D,4,FALSE)),\"\",VLOOKUP(11,Data!$A:$D,4,FALSE))),\"\")","v":""},null,null,null,null,null,"A Designated AC Sash is Used to Replace BOTH Top and Bottom Sashes When AC is in the Window"]
[null,{"$f":"IF(AND(W>0,H>0),(IF(ISERROR(VLOOKUP(12,Data!$A:$D,3,FALSE)),\"\",VLOOKUP(12,Data!$A:$D,3,FALSE))),\"\")","v":""},null,null,null,null,null,{"$f":"IF(AND(W>0,H>0),(IF(ISERROR(VLOOKUP(12,Data!$A:$D,4,FALSE)),\"\",VLOOKUP(12,Data!$A:$D,4,FALSE))),\"\")","v":""}]
[null,{"$f":"IF(AND(W>0,H>0),(IF(ISERROR(VLOOKUP(13,Data!$A:$D,3,FALSE)),\"\",VLOOKUP(13,Data!$A:$D,3,FALSE))),\"\")","v":""},null,null,null,null,null,{"$f":"IF(AND(W>0,H>0),(IF(ISERROR(VLOOKUP(13,Data!$A:$D,4,FALSE)),\"\",VLOOKUP(13,Data!$A:$D,4,FALSE))),\"\")","v":""},null,"AC Width: ",null,null,null,{"$f":"IF(AND(W>0,H>0,ACWIDTH>0,ACHEIGHT>0,ACCMR>0,ACLINK=TRUE),ACCMR,IF(AND(W>0,H>0,ACWIDTH>0,ACSASHW>0,ACLINK=TRUE),ACSASHW,\"\"))","v":""},{"$f":"IF(AND(W>0,H>0,ACWIDTH>0,ACHEIGHT>0,ACCMR>0,ACLINK=TRUE),\"<< CMR\",IF(AND(W>0,H>0,ACWIDTH>0,ACSASHW>0,ACLINK=TRUE),\"<< AC Sash Width\",\"\"))","v":""}]
[null,{"$f":"IF(AND(W>0,H>0),(IF(ISERROR(VLOOKUP(14,Data!$A:$D,3,FALSE)),\"\",VLOOKUP(14,Data!$A:$D,3,FALSE))),\"\")","v":""},null,null,null,null,null,{"$f":"IF(AND(W>0,H>0),(IF(ISERROR(VLOOKUP(14,Data!$A:$D,4,FALSE)),\"\",VLOOKUP(14,Data!$A:$D,4,FALSE))),\"\")","v":""},null,"AC Height: ",null,null,null,{"$f":"IF(AND(W>0,H>0,ACHEIGHT>0,ACSASHH>0,ACLINK=TRUE),ACSASHH,\"\")","v":""},{"$f":"IF(AND(ACCMR>0,ACLINK=TRUE),\"\",IF(AND(W>0,H>0,ACHEIGHT>0,ACSASHH>0,ACLINK=TRUE),\"<< AC Sash Height\",\"\"))","v":""}]
[null,{"$f":"IF(AND(W>0,H>0),(IF(ISERROR(VLOOKUP(15,Data!$A:$D,3,FALSE)),\"\",VLOOKUP(15,Data!$A:$D,3,FALSE))),\"\")","v":""},null,null,null,null,null,{"$f":"IF(AND(W>0,H>0),(IF(ISERROR(VLOOKUP(15,Data!$A:$D,4,FALSE)),\"\",VLOOKUP(15,Data!$A:$D,4,FALSE))),\"\")","v":""}]
[null,{"$f":"IF(AND(W>0,H>0),(IF(ISERROR(VLOOKUP(16,Data!$A:$D,3,FALSE)),\"\",VLOOKUP(16,Data!$A:$D,3,FALSE))),\"\")","v":""},null,null,null,null,null,{"$f":"IF(AND(W>0,H>0),(IF(ISERROR(VLOOKUP(16,Data!$A:$D,4,FALSE)),\"\",VLOOKUP(16,Data!$A:$D,4,FALSE))),\"\")","v":""}]
[null,{"$f":"IF(AND(W>0,H>0),(IF(ISERROR(VLOOKUP(17,Data!$A:$D,3,FALSE)),\"\",VLOOKUP(17,Data!$A:$D,3,FALSE))),\"\")","v":""},null,null,null,null,null,{"$f":"IF(AND(W>0,H>0),(IF(ISERROR(VLOOKUP(17,Data!$A:$D,4,FALSE)),\"\",VLOOKUP(17,Data!$A:$D,4,FALSE))),\"\")","v":""}]
[null,{"$f":"IF(AND(W>0,H>0),(IF(ISERROR(VLOOKUP(18,Data!$A:$D,3,FALSE)),\"\",VLOOKUP(18,Data!$A:$D,3,FALSE))),\"\")","v":""},null,null,null,null,null,{"$f":"IF(AND(W>0,H>0),(IF(ISERROR(VLOOKUP(18,Data!$A:$D,4,FALSE)),\"\",VLOOKUP(18,Data!$A:$D,4,FALSE))),\"\")","v":""}]
[null,{"$f":"IF(AND(W>0,H>0),(IF(ISERROR(VLOOKUP(19,Data!$A:$D,3,FALSE)),\"\",VLOOKUP(19,Data!$A:$D,3,FALSE))),\"\")","v":""},null,null,null,null,null,{"$f":"IF(AND(W>0,H>0),(IF(ISERROR(VLOOKUP(19,Data!$A:$D,4,FALSE)),\"\",VLOOKUP(19,Data!$A:$D,4,FALSE))),\"\")","v":""}]

{"sheet":"Data","index":1,"n_rows":352,"n_cols":31,"rows_kept":352,"cut":false,"hidden":true,"merged":[]}
[null,"Model","Description","Value"]
[{"$f":"IF(ModelNo=B2,1,\"\")","v":""},"8E00A","Glass Width",{"$f":"Frame_Width-2.9375","v":-2.9375},null,{"$f":"Model_Select","v":"Select Model"},"Models","Description","W cut-back","H-cut-back","Width","Height","Min W","Min H","Max W","Max H","Max UI","Type1","Type2","Type3","Type4","Screen1","Screen2","Screen3","Ext./Reinf.","Ext./Reinf.","Ext./Reinf.","Ext./Reinf.","Ext./Reinf.","Glass","Opening"]
[{"$f":"IF(ModelNo=B3,2,\"\")","v":""},"8E00A","Glass Height",{"$f":"Frame_Height-2.9375","v":-2.9375},null,1,"Select Model"]
[{"$f":"IF(ModelNo=B4,3,\"\")","v":""},"8E00A","Glass Area (sq.ft.)",{"$f":"(D2*D3)/144","v":5.9922960069444448E-2},null,2,"8E00A","Small Frame Picture Window",null,null,null,null,12,12,120,120,168,"Standard",null,null,null,"N/A"]
[{"$f":"IF(ModelNo=B5,1,\"\")","v":""},"3S10A","Sash Width",{"$f":"CDIM3R10A+0.25","v":0.25},null,3,"3S10A","Single Slider (Lift Out)",null,null,null,null,20,13,80,60,132,"Standard","Custom",null,null,"Half"]
[{"$f":"IF(ModelNo=B6,2,\"\")","v":""},"3S10A","Sash Height",{"$f":"Frame_Height-2.875","v":-2.875},null,4,"3S21A","Single Slider (Tilt)",null,null,null,null,20,13,78,60,132,"Standard","Custom",null,null,"Half"]
[{"$f":"IF(ModelNo=B7,3,\"\")","v":""},"3S10A","Sash Glass Width",{"$f":"INTGW3R10A","v":-2.5625},null,5,"3S40A","Single Hung",null,null,null,null,13,20,54,84,132,"Standard","Custom",null,null,"Half"]
[{"$f":"IF(ModelNo=B8,4,\"\")","v":""},"3S10A","Sash Glass Height",{"$f":"INTGH3R10A","v":-5.75},null,6,"3S10C","Three Lite Slider (Lift Out)",null,null,null,null,36,13,120,60,168,"Standard","Custom",null,null,"Half"]
[{"$f":"IF(ModelNo=B9,5,\"\")","v":""},"3S10A","Fixed Glass Width",{"$f":"EXTGW3R10A","v":-2.625},null,7,"3S21C","Three Lite Slider (Tilt)",null,null,null,null,36,13,120,60,168,"Standard","Custom",null,null,"Half"]
[{"$f":"IF(ModelNo=B10,6,\"\")","v":""},"3S10A","Fixed Glass Height",{"$f":"EXTGH3R10A","v":-2.8125},null,8,"8E10A","Double Slider (Lift Out)",null,null,null,null,21,13,80,60,132,"Standard","Custom",null,null,"Half","Full"]
[{"$f":"IF(ModelNo=B11,7,\"\")","v":""},"3S10A","Astragal Length",{"$f":"TRUNC((Frame_Height-2.17)*16+0.5)/16","v":-2.125},null,9,"8E21A","Double Slider (Tilt)",null,null,null,null,21,13,78,60,132,"Standard","Custom",null,null,"Half","Full"]
[{"$f":"IF(ModelNo=B12,8,\"\")","v":""},"3S10A","Screen Width",{"$f":"CDIM3R10A-2.1875","v":-2.1875},null,10,"8E40A","Double Hung",null,null,null,null,13,21,54,84,132,"Standard","Custom",null,null,"Half","Full"]
[{"$f":"IF(ModelNo=B13,9,\"\")","v":""},"3S10A","Screen Height",{"$f":"Frame_Height-3.9375","v":-3.9375},null,11,"8V71F","Fixed Casement/Awning",null,null,null,null,12,12,120,120,168,"Standard",null,null,null,"Full"]
[{"$f":"IF(ModelNo=B14,10,\"\")","v":""},"3S10A","Egress Opening Width",{"$f":"TRUNC((CDIM3R10A-4.5885)*16+0.5)/16","v":-4.5},null,12,"8V71L","Left Operating Casement",null,null,null,null,14,14,38,78,114,"Standard",null,null,null,"Full"]
[{"$f":"IF(ModelNo=B15,11,\"\")","v":""},"3S10A","Egress Opening Height",{"$f":"TRUNC((Frame_Height-4.471)*16+0.5)/16","v":-4.4375},null,13,"8V71R","Right Operating Casement",null,null,null,null,14,14,38,78,114,"Standard",null,null,null,"Full"]
[{"$f":"IF(ModelNo=B16,12,\"\")","v":""},"3S10A","Egress Opening Area (sq.ft.)",{"$f":"(D14*D15)/144","v":0.138671875},null,14,"3S55A","Hopper",null,null,null,null,12,12,37,37,55,"Standard",null,null,null,"Full"]
[{"$f":"IF(ModelNo=B17,1,\"\")","v":""},"3S21A","Sash Width",{"$f":"CDIM3R21A+0.25","v":0.25},null,15,"3S56A","Basement",null,null,null,null,14,14,54,36,72,"Standard",null,null,null,"Full"]
[{"$f":"IF(ModelNo=B18,2,\"\")","v":""},"3S21A","Sash Height",{"$f":"Frame_Height-2.75","v":-2.75},null,16,"8V81A","Operating Awning",null,null,null,null,15,14,60,48,98,"Standard"]
[{"$f":"IF(ModelNo=B19,3,\"\")","v":""},"3S21A","Sash Glass Width",{"$f":"INTGW3R21A","v":-2.5625},null,17,"L201","Amherst Double Hung",0,0,null,null,11,20,48,78,126,"Standard","Custom",null,null,"Half","Full","Locking"]
[{"$f":"IF(ModelNo=B20,4,\"\")","v":""},"3S21A","Sash Glass Height",{"$f":"INTGH3R21A","v":-5.5625},null,18,"L202","Amherst 2 Lite Slider",0,0,null,null,18,9,84,56,140,"Standard",null,null,null,"Half","Full"]
[{"$f":"IF(ModelNo=B21,5,\"\")","v":""},"3S21A","Fixed Glass Width",{"$f":"EXTGW3R21A","v":-2.625},null,19,"L203","Amherst 3 Lite Slider (1/4-1/2-1/4)",0,0,null,null,48,9,108,56,164,"Standard (1/4-1/2-1/4)",null,null,null,"Half","Full"]
[{"$f":"IF(ModelNo=B22,6,\"\")","v":""},"3S21A","Fixed Glass Height",{"$f":"EXTGH3R21A","v":-2.8125},null,20,"L204","Amherst Picture Window",0,0,null,null,12,9,112,96,154,"Standard"]
[{"$f":"IF(ModelNo=B23,7,\"\")","v":""},"3S21A","Astragal Length",{"$f":"TRUNC((Frame_Height-2.17)*16+0.5)/16","v":-2.125},null,21,"L209","Amherst 3 Lite Slider Equal Lite",0,0,null,null,38,9,108,56,164,"Standard (1/3-1/3-1/3)",null,null,null,"Half","Full"]
[{"$f":"IF(ModelNo=B24,8,\"\")","v":""},"3S21A","Screen Width",{"$f":"CDIM3R21A-2.1875","v":-2.1875},null,22,"03A0","Mezzo Single Hung",0,0,null,null,11,22,{"$f":"IF(EXTSELECT=2,48,IF(EXTSELECT=3,52,\"\"))","v":""},{"$f":"IF(EXTSELECT=2,84,IF(EXTSELECT=3,96,\"\"))","v":""},{"$f":"IF(EXTSELECT=2,126,IF(EXTSELECT=3,148,\"\"))","v":""},"Standard","Oriel (2/3 - 1/3)","Cottage (1/3 - 2/3)","Custom","Half","Full","Locking","Select Reinforcement","Composite","Steel"]
[{"$f":"IF(ModelNo=B25,9,\"\")","v":""},"3S21A","Screen Height",{"$f":"Frame_Height-3.9375","v":-3.9375},null,23,"03A2","Mezzo Two Lite Single Slider",0,0,null,null,18.5,12,{"$f":"IF(EXTSELECT=2,72,IF(EXTSELECT=3,96,\"\"))","v":""},{"$f":"IF(EXTSELECT=2,56,IF(EXTSELECT=3,72,\"\"))","v":""},{"$f":"IF(EXTSELECT=2,128,IF(EXTSELECT=3,148,\"\"))","v":""},"Standard",null,null,null,"Half","Full",null,"Select Reinforcement","Composite","Steel"]
[{"$f":"IF(ModelNo=B26,10,\"\")","v":""},"3S21A","Egress Opening Width",{"$f":"TRUNC((CDIM3R21A-7.901)*16+0.5)/16","v":-7.8125},null,24,"03A3","Mezzo Three Lite Slider (1/4-1/2-1/4)",0,0,null,null,52,12,{"$f":"IF(EXTSELECT=2,108,IF(EXTSELECT=3,120,\"\"))","v":""},{"$f":"IF(EXTSELECT=2,56,IF(EXTSELECT=3,72,\"\"))","v":""},{"$f":"IF(EXTSELECT=2,164,IF(EXTSELECT=3,192,\"\"))","v":""},"Standard (1/4-1/2-1/4)",null,null,null,"Half","Full",null,"Select Reinforcement","Composite","Steel"]
[{"$f":"IF(ModelNo=B27,11,\"\")","v":""},"3S21A","Egress Opening Height",{"$f":"TRUNC((Frame_Height-4.3455)*16+0.5)/16","v":-4.3125},null,25,"03A4","Mezzo Picture Window",0,0,null,null,9.5,9.5,112,96,154,"Standard"]
[{"$f":"IF(ModelNo=B28,12,\"\")","v":""},"3S21A","Egress Opening Area (sq.ft.)",{"$f":"(D26*D27)/144","v":0.23396809895833334},null,26,"03A9","Mezzo Three Lite Slider Equal Lite",0,0,null,null,52,12,{"$f":"IF(EXTSELECT=2,108,IF(EXTSELECT=3,120,\"\"))","v":""},{"$f":"IF(EXTSELECT=2,56,IF(EXTSELECT=3,72,\"\"))","v":""},{"$f":"IF(EXTSELECT=2,164,IF(EXTSELECT=3,192,\"\"))","v":""},"Standard (1/3-1/3-1/3)",null,null,null,"Half","Full",null,"Select Reinforcement","Composite","Steel"]
[{"$f":"IF(ModelNo=B29,1,\"\")","v":""},"3S40A","Bottom Sash Width",{"$f":"Frame_Width-2.75","v":-2.75},null,27,"0970","Casement Picture Window",0,0,null,null,13,13,96,84,154,"Standard"]
[{"$f":"IF(ModelNo=B30,2,\"\")","v":""},"3S40A","Bottom Sash Height",{"$f":"CDIM3R40A+0.25","v":0.25},null,28,"0971","Single Vent Casement",0,0,null,null,16,19,36,78,114,"Standard",null,null,null,"Full"]
[{"$f":"IF(ModelNo=B31,3,\"\")","v":""},"3S40A","Bottom Glass Width",{"$f":"BGW3R40A","v":-5.5625},null,29,"0972","Dual Vent Casement",0,0,null,null,32,19,72,78,150,"Standard",null,null,null,"Half"]
[{"$f":"IF(ModelNo=B32,4,\"\")","v":""},"3S40A","Bottom Glass Height",{"$f":"BGH3R40A","v":-2.59375},null,30,"0973","Dual Vent 3 Lite Casement (1/4-1/2-1/4)",0,0,null,null,64,19,120,78,198,"Standard (1/4-1/2-1/4)",null,null,null,"Half"]
[{"$f":"IF(ModelNo=B33,5,\"\")","v":""},"3S40A","Top Glass Width",{"$f":"TGW3R40A","v":-2.8125},null,31,"0974","4 Lite Casement",0,0,null,null,64,19,120,78,198,"Standard",null,null,null,"Half"]
[{"$f":"IF(ModelNo=B34,6,\"\")","v":""},"3S40A","Top Glass Height",{"$f":"TGH3R40A","v":-2.65625},null,32,"0975","5 Lite Casement",0,0,null,null,80,19,120,78,198,"Standard",null,null,null,"Half"]
[{"$f":"IF(ModelNo=B35,7,\"\")","v":""},"3S40A","Astragal Length",{"$f":"TRUNC((Frame_Width-2.1875)*16+0.5)/16","v":-2.125},null,33,"0979","Dual Vent 3 Lite Casement (Equal Lite)",0,0,null,null,48,19,108,78,186,"Standard (1/3-1/3-1/3)",null,null,null,"Half"]
[{"$f":"IF(ModelNo=B36,8,\"\")","v":""},"3S40A","Screen Width",{"$f":"TRUNC((Frame_Width-3.9375)*16+0.5)/16","v":-3.875},null,1,{"$f":"VLOOKUP(Cell_Link,F3:G35,2,FALSE)","v":"Select Model"},{"$f":"VLOOKUP(Model_Select,Data,2,FALSE)","v":0},{"$f":"VLOOKUP(Model_Select,Data,3,FALSE)","v":0},{"$f":"VLOOKUP(Model_Select,Data,4,FALSE)","v":0},{"$f":"VLOOKUP(Model_Select,Data,5,FALSE)","v":0},{"$f":"VLOOKUP(Model_Select,Data,6,FALSE)","v":0},{"$f":"VLOOKUP(Model_Select,Data,7,FALSE)","v":0},{"$f":"VLOOKUP(Model_Select,Data,8,FALSE)","v":0},{"$f":"VLOOKUP(Model_Select,Data,9,FALSE)","v":0},{"$f":"VLOOKUP(Model_Select,Data,10,FALSE)","v":0},{"$f":"VLOOKUP(Model_Select,Data,11,FALSE)","v":0},{"$f":"VLOOKUP(Model_Select,Data,12,FALSE)","v":0},{"$f":"VLOOKUP(Model_Select,Data,13,FALSE)","v":0},{"$f":"VLOOKUP(Model_Select,Data,14,FALSE)","v":0},{"$f":"VLOOKUP(Model_Select,Data,15,FALSE)","v":0},{"$f":"VLOOKUP(Model_Select,Data,16,FALSE)","v":0},{"$f":"VLOOKUP(Model_Select,Data,17,FALSE)","v":0},{"$f":"VLOOKUP(Model_Select,Data,18,FALSE)","v":0},{"$f":"VLOOKUP(Model_Select,Data,19,FALSE)","v":0},{"$f":"VLOOKUP(Model_Select,Data,20,FALSE)","v":0},{"$f":"VLOOKUP(Model_Select,Data,21,FALSE)","v":0},{"$f":"VLOOKUP(Model_Select,Data,22,FALSE)","v":0},{"$f":"VLOOKUP(Model_Select,Data,23,FALSE)","v":0},{"$f":"VLOOKUP(Model_Select,Data,24,FALSE)","v":0},{"$f":"VLOOKUP(Model_Select,Data,25,FALSE)","v":0}]
[{"$f":"IF(ModelNo=B37,9,\"\")","v":""},"3S40A","Screen Height",{"$f":"TRUNC((CDIM3R40A-2.1875)*32+0.5)/32","v":-2.15625}]
[{"$f":"IF(ModelNo=B38,10,\"\")","v":""},"3S40A","Bottom Sash Weight",{"$f":"IF(ISERROR(BTM_WGT&\" \"&\"lb\"),\"N/A\",BTM_WGT&\" \"&\"lb\")","v":"N/A"}]
[{"$f":"IF(ModelNo=B39,11,\"\")","v":""},"3S40A","Balance Size",{"$f":"IF(ISERROR((VLOOKUP(BTM_WGT,CFB,2,FALSE))&(VLOOKUP(BTM_WGT,CFB,3,FALSE))),\"N/A\",(VLOOKUP(BTM_WGT,CFB,2,FALSE))&(VLOOKUP(BTM_WGT,CFB,3,FALSE)))","v":"N/A"}]
[{"$f":"IF(ModelNo=B40,12,\"\")","v":""},"3S40A","Egress Opening Width",{"$f":"IF(ISERROR(EW),\"N/A\",EW)","v":"N/A"}]
[{"$f":"IF(ModelNo=B41,13,\"\")","v":""},"3S40A","Egress Opening Height",{"$f":"IF(ISERROR(EH),\"N/A\",EH)","v":"N/A"},null,null,"0204","Excalibur Picture Window",0,0,null,null,9,9,112,96,154,"Standard",null,null,null,null,null,null,null,null,null,null,null,{"$f":"IF(OR(Glass=1,Glass=4,Glass=5,Glass=7,Glass=8),\"<< Not Available\",\"\")","v":""},{"$f":"IF(RO=2,\"<< Exact Size Only\",\"\")","v":""}]
[{"$f":"IF(ModelNo=B42,14,\"\")","v":""},"3S40A","Egress Opening Area (sq.ft.)",{"$f":"IF(ISERROR(EO),\"N/A\",EO)","v":"N/A"},null,null,"0209","Excalibur 3 Lite Slider Equal Lite",0,0,null,null,37.25,9,120,72,192,"Standard (1/3-1/3-1/3)",null,null,null,"Half","Full",null,null,null,null,null,null,{"$f":"IF(OR(Glass=1,Glass=4,Glass=5,Glass=7,Glass=8),\"<< Not Available\",\"\")","v":""},""]
[{"$f":"IF(ModelNo=B43,1,\"\")","v":""},"3S10C","Operating Sash Width",{"$f":"INTGW3R10C+2.875","v":1.75},null,null,"02A0","Excalibur Single Hung",0,0,null,null,11,20,52,84,132,"Standard","Oriel (2/3 - 1/3)","Cottage (1/3 - 2/3)","Custom","Half","Full","Locking",null,null,null,null,null,{"$f":"IF(OR(Glass=4,Glass=5,Glass=7,Glass=8),\"<< Not Available\",\"\")","v":""},""]
[{"$f":"IF(ModelNo=B44,2,\"\")","v":""},"3S10C","Operating Sash Height",{"$f":"INTGH3R10C+2.875","v":-2.8125},null,null,"02A2","Excalibur 2 Lite Single Slider",0,0,null,null,18,12,84,66,148,"Standard",null,null,null,"Half","Full",null,null,null,null,null,null,{"$f":"IF(OR(Glass=4,Glass=5,Glass=7,Glass=8),\"<< Not Available\",\"\")","v":""},""]
[{"$f":"IF(ModelNo=B45,3,\"\")","v":""},"3S10C","Astragal Length",{"$f":"TRUNC((Frame_Height-2.17)*16+0.5)/16","v":-2.125},null,null,"02A3","Excalibur 3 Lite Slider (1/4-1/2-1/4)",0,0,null,null,46,12,116,66,182,"Standard (1/4-1/2-1/4)",null,null,null,"Half","Full",null,null,null,null,null,null,{"$f":"IF(OR(Glass=4,Glass=5,Glass=7,Glass=8),\"<< Not Available\",\"\")","v":""},""]
[{"$f":"IF(ModelNo=B46,4,\"\")","v":""},"3S10C","Operating Sash Glass Width",{"$f":"INTGW3R10C","v":-1.125},null,null,"02A4","Excalibur Picture Window",0,0,null,null,9,9,96,96,154,"Standard",null,null,null,null,null,null,null,null,null,null,null,{"$f":"IF(OR(Glass=1,Glass=4,Glass=5,Glass=7,Glass=8),\"<< Not Available\",\"\")","v":""},""]
[{"$f":"IF(ModelNo=B47,5,\"\")","v":""},"3S10C","Operating Sash Glass Height",{"$f":"INTGH3R10C","v":-5.6875},null,null,"02A9","Excalibur 3 Lite Slider Equal Lite",0,0,null,null,37.25,12,120,66,182,"Standard (1/3-1/3-1/3)",null,null,null,"Half","Full",null,null,null,null,null,null,{"$f":"IF(OR(Glass=4,Glass=5,Glass=7,Glass=8),\"<< Not Available\",\"\")","v":""},""]
[{"$f":"IF(ModelNo=B48,6,\"\")","v":""},"3S10C","Fixed Glass Width",{"$f":"EXTGW3R10C","v":-5.375},null,null,"3001","Mezzo Double Hung",0,0,null,null,12,20,{"$f":"IF(EXTSELECT=2,48,IF(EXTSELECT=3,52,\"\"))","v":""},{"$f":"IF(EXTSELECT=2,84,IF(EXTSELECT=3,96,\"\"))","v":""},{"$f":"IF(EXTSELECT=2,126,IF(EXTSELECT=3,148,\"\"))","v":""},"Standard","Oriel (2/3 - 1/3)","Cottage (1/3 - 2/3)","Custom","Half","Full","Locking","Select Reinforcement","Composite","Steel",null,null,{"$f":"IF(OR(Glass=1,Glass=4,Glass=5,Glass=7,Glass=8),\"<< Not Available\",\"\")","v":""},""]
[{"$f":"IF(ModelNo=B49,7,\"\")","v":""},"3S10C","Fixed Glass Height",{"$f":"EXTGH3R10C","v":-2.8125},null,null,"3002","Mezzo Two Lite Slider",0,0,null,null,18.5,11.25,{"$f":"IF(EXTSELECT=2,72,IF(EXTSELECT=3,84,\"\"))","v":""},{"$f":"IF(EXTSELECT=2,56,IF(EXTSELECT=3,72,\"\"))","v":""},{"$f":"IF(EXTSELECT=2,128,IF(EXTSELECT=3,156,\"\"))","v":""},"Standard",null,null,null,"Half","Full",null,"Select Reinforcement","Composite","Steel",null,null,{"$f":"IF(OR(Glass=1,Glass=4,Glass=5,Glass=7,Glass=8),\"<< Not Available\",\"\")","v":""},""]
[{"$f":"IF(ModelNo=B50,8,\"\")","v":""},"3S10C","Screen Width",{"$f":"DDIM3R10C-2.1875","v":-0.75},null,null,"3003","Mezzo Three Lite Slider (1/4-1/2-1/4)",0,0,null,null,47.5,11.25,{"$f":"IF(EXTSELECT=2,108,IF(EXTSELECT=3,120,\"\"))","v":""},{"$f":"IF(EXTSELECT=2,56,IF(EXTSELECT=3,72,\"\"))","v":""},{"$f":"IF(EXTSELECT=2,164,IF(EXTSELECT=3,192,\"\"))","v":""},"Standard (1/4-1/2-1/4)",null,null,null,"Half","Full",null,"Select Reinforcement","Composite","Steel",null,null,{"$f":"IF(OR(Glass=1,Glass=4,Glass=5,Glass=7,Glass=8),\"<< Not Available\",\"\")","v":""},""]
[{"$f":"IF(ModelNo=B51,9,\"\")","v":""},"3S10C","Screen Height",{"$f":"Frame_Height-3.9375","v":-3.9375},null,null,"3004","Mezzo Picture Window",0,0,null,null,9.5,9.5,112,96,154,"Standard",null,null,null,null,null,null,null,null,null,null,null,{"$f":"IF(OR(Glass=1,Glass=4,Glass=5,Glass=7,Glass=8),\"<< Not Available\",\"\")","v":""},""]
[{"$f":"IF(ModelNo=B52,10,\"\")","v":""},"3S10C","Egress Opening Width",{"$f":"TRUNC((DDIM3R10C-4.776)*16+0.5)/16","v":-3.25},null,null,"3009","Mezzo Three Lite Slider Equal Lite",0,0,null,null,37.25,11.25,{"$f":"IF(EXTSELECT=2,108,IF(EXTSELECT=3,120,\"\"))","v":""},{"$f":"IF(EXTSELECT=2,56,IF(EXTSELECT=3,72,\"\"))","v":""},{"$f":"IF(EXTSELECT=2,164,IF(EXTSELECT=3,192,\"\"))","v":""},"Standard (1/3-1/3-1/3)",null,null,null,"Half","Full",null,"Select Reinforcement","Composite","Steel",null,null,{"$f":"IF(OR(Glass=1,Glass=4,Glass=5,Glass=7,Glass=8),\"<< Not Available\",\"\")","v":""},""]
[{"$f":"IF(ModelNo=B53,11,\"\")","v":""},"3S10C","Egress Opening Height",{"$f":"TRUNC((Frame_Height-4.158)*16+0.5)/16","v":-4.125},null,null,"S140","Arched Top Single Hung (Round-Top)",0,0,null,null,24,43,52,96,134,"Standard","Oriel (2/3 - 1/3)","Cottage (1/3 - 2/3)","Custom","Half",null,null,"Select Extrusion","Mezzo","New Construction","0700 Series","Excalibur",{"$f":"IF(OR(Glass=1,Glass=4,Glass=5,Glass=7,Glass=8),\"<< Not Available\",\"\")","v":""},{"$f":"IF(RO=2,\"<< Exact Size Only\",\"\")","v":""}]
[{"$f":"IF(ModelNo=B54,12,\"\")","v":""},"3S10C","Egress Opening Area (sq.ft.)",{"$f":"(D52*D53)/144","v":9.3098958333333329E-2},null,null,"S144","Arched Top Single Hung (Eyebrow)",0,0,null,null,20,43,52,96,134,"Standard","Oriel (2/3 - 1/3)","Cottage (1/3 - 2/3)","Custom","Half",null,null,"Select Extrusion","Mezzo","New Construction","0700 Series","Excalibur","",""]
[{"$f":"IF(ModelNo=B55,1,\"\")","v":""},"3S21C","Operating Sash Width",{"$f":"INTGW3R21C+2.875","v":1.75},null,null,"S146","Arched Top Single Hung (1/2 Eyebrow)",0,0,null,null,20,43,52,96,134,"Standard","Oriel (2/3 - 1/3)","Cottage (1/3 - 2/3)","Custom","Half",null,null,"Select Extrusion","Mezzo","New Construction","0700 Series","Excalibur","",""]
[{"$f":"IF(ModelNo=B56,2,\"\")","v":""},"3S21C","Operating Sash Height",{"$f":"INTGH3R21C+2.875","v":-2.6875},null,null,"S140 (HP)","High Performance Arched Top Single Hung (Round-Top)",0,0,null,null,24,43,52,96,134,"Standard","Oriel (2/3 - 1/3)","Cottage (1/3 - 2/3)","Custom","Half",null,null,"Select Extrusion","Mezzo","New Construction","0700 Series","Excalibur","",""]
[{"$f":"IF(ModelNo=B57,3,\"\")","v":""},"3S21C","Astragal Length",{"$f":"TRUNC((Frame_Height-2.17)*16+0.5)/16","v":-2.125},null,null,"S144 (HP)","High Performance Arched Top Single Hung (Eyebrow)",0,0,null,null,20,43,52,96,134,"Standard","Oriel (2/3 - 1/3)","Cottage (1/3 - 2/3)","Custom","Half",null,null,"Select Extrusion","Mezzo","New Construction","0700 Series","Excalibur","",""]
[{"$f":"IF(ModelNo=B58,4,\"\")","v":""},"3S21C","Operating Sash Glass Width",{"$f":"INTGW3R21C","v":-1.125},null,null,"S146 (HP)","High Performance Arched Top Single Hung (1/2 Eyebrow)",0,0,null,null,20,43,52,96,134,"Standard","Oriel (2/3 - 1/3)","Cottage (1/3 - 2/3)","Custom","Half",null,null,"Select Extrusion","Mezzo","New Construction","0700 Series","Excalibur","",""]
[{"$f":"IF(ModelNo=B59,5,\"\")","v":""},"3S21C","Operating Sash Glass Height",{"$f":"INTGH3R21C","v":-5.5625}]
[{"$f":"IF(ModelNo=B60,6,\"\")","v":""},"3S21C","Fixed Glass Width",{"$f":"EXTGW3R21C","v":-5.375},null,null,{"$f":"IF(ISERROR(VLOOKUP(Model_Select,$F$191:$G$248,2,FALSE)),\"\",VLOOKUP(Model_Select,$F$191:$G$248,2,FALSE))","v":""},null,null,null,null,{"$f":"IF(OR(ModelNo=\"6405\",ModelNo=\"6406\",ModelNo=\"6408\",ModelNo=\"6409\",ModelNo=\"6412\",ModelNo=\"6422\",ModelNo=\"8405\",ModelNo=\"8406\",ModelNo=\"8408\",ModelNo=\"8409\",ModelNo=\"8412\",ModelNo=\"8422\"),1,0)","v":0},null,null,null,null,null,null,null,null,null,null,null,null,null,null,null,null,null,"1=Single Strength (2.5 mm)"]
[{"$f":"IF(ModelNo=B61,7,\"\")","v":""},"3S21C","Fixed Glass Height",{"$f":"EXTGH3R21C","v":-2.8125},null,null,{"$f":"IF(ISERROR(VLOOKUP(Model_Select,$F$43:$G$68,2,FALSE)),\"\",VLOOKUP(Model_Select,$F$43:$G$68,2,FALSE))","v":""},null,null,null,null,{"$f":"IF(HCONTROL=1,96,\"\")","v":""},null,null,null,null,null,null,null,null,null,null,null,null,null,null,null,null,null,"2=Double Strength (3 mm)"]
[{"$f":"IF(ModelNo=B62,8,\"\")","v":""},"3S21C","Screen Width",{"$f":"DDIM3R21C-2.1875","v":-0.75},null,null,{"$f":"IF(OR(Model_Select=\"S140\",Model_Select=\"S144\",Model_Select=\"S146\",Model_Select=\"S140 (HP)\",Model_Select=\"S144 (HP)\",Model_Select=\"S146 (HP)\"),1,0)","v":0},null,null,null,null,null,null,null,null,null,null,null,null,null,null,null,null,null,null,null,null,null,null,"3=Triple Strength (5 mm)"]
[{"$f":"IF(ModelNo=B63,9,\"\")","v":""},"3S21C","Screen Height",{"$f":"Frame_Height-3.9375","v":-3.9375},null,null,null,null,null,null,null,null,null,null,null,null,null,null,null,null,null,null,null,null,null,null,null,null,null,"4=Triple IG Single Strrength"]
[{"$f":"IF(ModelNo=B64,10,\"\")","v":""},"3S21C","Egress Opening Width",{"$f":"TRUNC((DDIM3R10C-4.776)*16+0.5)/16","v":-3.25},null,null,null,null,null,null,null,null,null,null,null,null,null,null,null,null,null,null,null,null,null,null,null,null,null,"5=Triple IG Double Strength"]
[{"$f":"IF(ModelNo=B65,11,\"\")","v":""},"3S21C","Egress Opening Height",{"$f":"TRUNC((Frame_Height-4.158)*16+0.5)/16","v":-4.125},null,null,null,null,null,null,null,null,null,null,null,null,null,null,null,null,null,null,null,null,null,null,null,null,null,"6=Laminated"]
[{"$f":"IF(ModelNo=B66,12,\"\")","v":""},"3S21C","Egress Opening Area (sq.ft.)",{"$f":"(D64*D65)/144","v":9.3098958333333329E-2},null,null,null,null,null,null,null,null,null,null,null,null,null,null,null,null,null,null,null,null,null,null,null,null,null,"7=HP Package"]
[{"$f":"IF(ModelNo=B67,1,\"\")","v":""},"8E10A","Exterior Sash Width",{"$f":"EXTGW8R10A+1.875","v":-1.5625},null,null,null,null,null,null,null,null,null,null,null,null,null,null,null,null,null,null,null,null,null,null,null,null,null,"8=Impact Laminated"]
[{"$f":"IF(ModelNo=B68,2,\"\")","v":""},"8E10A","Exterior Sash Height",{"$f":"EXTGH8R10A+1.875","v":-3.9375}]
[{"$f":"IF(ModelNo=B69,3,\"\")","v":""},"8E10A","Interior Sash Width",{"$f":"INTGW8R10A+2.875","v":-0.5625}]
[{"$f":"IF(ModelNo=B70,4,\"\")","v":""},"8E10A","Interior Sash Height",{"$f":"INTGH8R10A+2.875","v":-2.9375}]
[{"$f":"IF(ModelNo=B71,5,\"\")","v":""},"8E10A","Interior Glass Width",{"$f":"INTGW8R10A","v":-3.4375}]
[{"$f":"IF(ModelNo=B72,6,\"\")","v":""},"8E10A","Interior Glass Height",{"$f":"INTGH8R10A","v":-5.8125}]
[{"$f":"IF(ModelNo=B73,7,\"\")","v":""},"8E10A","Exterior Glass Width",{"$f":"EXTGW8R10A","v":-3.4375}]
[{"$f":"IF(ModelNo=B74,8,\"\")","v":""},"8E10A","Exterior Glass Height",{"$f":"EXTGH8R10A","v":-5.8125}]
[{"$f":"IF(ModelNo=B75,9,\"\")","v":""},"8E10A","Screen Width",{"$f":"IF(Screen=\"F\",Frame_Width-3.6875,DDIM8R10A-1.6875)","v":-1.6875}]
[{"$f":"IF(ModelNo=B76,10,\"\")","v":""},"8E10A","Screen Height",{"$f":"Frame_Height-3.1875","v":-3.1875}]
[{"$f":"IF(ModelNo=B77,11,\"\")","v":""},"8E10A","Egress Opening Width",{"$f":"TRUNC((CDIM3R10A-6)*16+0.5)/16","v":-5.9375}]
[{"$f":"IF(ModelNo=B78,12,\"\")","v":""},"8E10A","Egress Opening Height",{"$f":"TRUNC((Frame_Height-5.154)*16+0.5)/16","v":-5.0625}]
[{"$f":"IF(ModelNo=B79,13,\"\")","v":""},"8E10A","Egress Opening Area (sq.ft.)",{"$f":"(D77*D78)/144","v":0.208740234375}]
[{"$f":"IF(ModelNo=B80,1,\"\")","v":""},"8E21A","Exterior Sash Width",{"$f":"EXTGW8R21A+1.875","v":-1.5625}]
[{"$f":"IF(ModelNo=B81,2,\"\")","v":""},"8E21A","Exterior Sash Height",{"$f":"EXTGH8R21A+1.875","v":-3.8125}]
[{"$f":"IF(ModelNo=B82,3,\"\")","v":""},"8E21A","Interior Sash Width",{"$f":"INTGW8R21A+2.875","v":-0.5625}]
[{"$f":"IF(ModelNo=B83,4,\"\")","v":""},"8E21A","Interior Sash Height",{"$f":"INTGH8R21A+2.875","v":-2.8125}]
[{"$f":"IF(ModelNo=B84,5,\"\")","v":""},"8E21A","Interior Glass Width",{"$f":"INTGW8R21A","v":-3.4375}]
[{"$f":"IF(ModelNo=B85,6,\"\")","v":""},"8E21A","Interior Glass Height",{"$f":"INTGH8R21A","v":-5.6875}]
[{"$f":"IF(ModelNo=B86,7,\"\")","v":""},"8E21A","Exterior Glass Width",{"$f":"EXTGW8R21A","v":-3.4375}]
[{"$f":"IF(ModelNo=B87,8,\"\")","v":""},"8E21A","Exterior Glass Height",{"$f":"EXTGH8R21A","v":-5.6875}]
[{"$f":"IF(ModelNo=B88,9,\"\")","v":""},"8E21A","Screen Width",{"$f":"IF(Screen=\"F\",Frame_Width-3.6875,DDIM8R21A-1.6875)","v":-1.6875}]
[{"$f":"IF(ModelNo=B89,10,\"\")","v":""},"8E21A","Screen Height",{"$f":"Frame_Height-3.1875","v":-3.1875}]
[{"$f":"IF(ModelNo=B90,11,\"\")","v":""},"8E21A","Egress Opening Width",{"$f":"TRUNC((CDIM3R21A-7.25)*16+0.5)/16","v":-7.1875}]
[{"$f":"IF(ModelNo=B91,12,\"\")","v":""},"8E21A","Egress Opening Height",{"$f":"TRUNC((Frame_Height-4.779)*16+0.5)/16","v":-4.6875}]
[{"$f":"IF(ModelNo=B92,13,\"\")","v":""},"8E21A","Egress Opening Area (sq.ft.)",{"$f":"(D90*D91)/144","v":0.23396809895833334}]
[{"$f":"IF(ModelNo=B93,1,\"\")","v":""},"8E40A","Top Sash Width",{"$f":"TGW8R40A+1.875","v":-3.8125}]
[{"$f":"IF(ModelNo=B94,2,\"\")","v":""},"8E40A","Top Sash Height",{"$f":"TGH8R40A+1.875","v":-1.5625}]
[{"$f":"IF(ModelNo=B95,3,\"\")","v":""},"8E40A","Bottom Sash Width",{"$f":"BGW8R40A+2.875","v":-2.8125}]
[{"$f":"IF(ModelNo=B96,4,\"\")","v":""},"8E40A","Bottom Sash Height",{"$f":"BGH8R40A+2.875","v":-0.5625}]
[{"$f":"IF(ModelNo=B97,5,\"\")","v":""},"8E40A","Top Glass Width",{"$f":"TGW8R40A","v":-5.6875}]
[{"$f":"IF(ModelNo=B98,6,\"\")","v":""},"8E40A","Top Glass Height",{"$f":"TGH8R40A","v":-3.4375}]
[{"$f":"IF(ModelNo=B99,7,\"\")","v":""},"8E40A","Bottom Glass Width",{"$f":"BGW8R40A","v":-5.6875}]
[{"$f":"IF(ModelNo=B100,8,\"\")","v":""},"8E40A","Bottom Glass Height",{"$f":"BGH8R40A","v":-3.4375}]
[{"$f":"IF(ModelNo=B101,9,\"\")","v":""},"8E40A","Screen Width",{"$f":"Frame_Width-3.6875","v":-3.6875}]
[{"$f":"IF(ModelNo=B102,10,\"\")","v":""},"8E40A","Screen Height",{"$f":"IF(Screen=\"F\",TRUNC((Frame_Height-3.1875)*16+0.5)/16,TRUNC((CDIM8R40A-1.6875)*16+0.5)/16)","v":-1.625}]
[{"$f":"IF(ModelNo=B103,11,\"\")","v":""},"8E40A","Top Sash Weight (Plus 5 lb)",{"$f":"IF(ISERROR(TOP_WGT&\" \"&\"lb\"),\"N/A\",TOP_WGT&\" \"&\"lb\")","v":"N/A"}]
[{"$f":"IF(ModelNo=B104,12,\"\")","v":""},"8E40A","Top Balance Size",{"$f":"IF(ISERROR((VLOOKUP(TOP_WGT,CFB,2,FALSE))&(VLOOKUP(TOP_WGT,CFB,3,FALSE))),\"N/A\",(VLOOKUP(TOP_WGT,CFB,2,FALSE))&(VLOOKUP(TOP_WGT,CFB,3,FALSE)))","v":"N/A"}]
[{"$f":"IF(ModelNo=B105,13,\"\")","v":""},"8E40A","Bottom Sash Weight",{"$f":"IF(ISERROR(BTM_WGT&\" \"&\"lb\"),\"N/A\",BTM_WGT&\" \"&\"lb\")","v":"N/A"}]
[{"$f":"IF(ModelNo=B106,14,\"\")","v":""},"8E40A","Bottom Balance Size",{"$f":"IF(ISERROR((VLOOKUP(BTM_WGT,CFB,2,FALSE))&(VLOOKUP(BTM_WGT,CFB,3,FALSE))),\"N/A\",(VLOOKUP(BTM_WGT,CFB,2,FALSE))&(VLOOKUP(BTM_WGT,CFB,3,FALSE)))","v":"N/A"}]
[{"$f":"IF(ModelNo=B107,15,\"\")","v":""},"8E40A","Egress Opening Width",{"$f":"IF(ISERROR(EW),\"N/A\",EW)","v":"N/A"}]
[{"$f":"IF(ModelNo=B108,16,\"\")","v":""},"8E40A","Egress Opening Height",{"$f":"IF(ISERROR(EH),\"N/A\",EH)","v":"N/A"}]
[{"$f":"IF(ModelNo=B109,17,\"\")","v":""},"8E40A","Egress Opening Area (sq.ft.)",{"$f":"IF(ISERROR(EO),\"N/A\",EO)","v":"N/A"}]
[{"$f":"IF(ModelNo=B110,1,\"\")","v":""},"8V71F","Glass Width",{"$f":"Frame_Width-4.75","v":-4.75}]
[{"$f":"IF(ModelNo=B111,2,\"\")","v":""},"8V71F","Glass Height",{"$f":"Frame_Height-4.75","v":-4.75}]
[{"$f":"IF(ModelNo=B112,3,\"\")","v":""},"8V71F","Glass Area (sq.ft.)",{"$f":"(D110*D111)/144","v":0.15668402777777779}]
[{"$f":"IF(OR(ModelNo=\"8V71L\",ModelNo=\"8V71R\"),1,\"\")","v":""},"8V71L","Sash Width",{"$f":"Frame_Width-1.5","v":-1.5}]
[{"$f":"IF(OR(ModelNo=\"8V71L\",ModelNo=\"8V71R\"),2,\"\")","v":""},"8V71L","Sash Height",{"$f":"Frame_Height-1.5","v":-1.5}]
[{"$f":"IF(OR(ModelNo=\"8V71L\",ModelNo=\"8V71R\"),3,\"\")","v":""},"8V71L","Glass Width",{"$f":"Frame_Width-4.75","v":-4.75}]
[{"$f":"IF(OR(ModelNo=\"8V71L\",ModelNo=\"8V71R\"),4,\"\")","v":""},"8V71L","Glass Height",{"$f":"Frame_Height-4.75","v":-4.75}]
[{"$f":"IF(OR(ModelNo=\"8V71L\",ModelNo=\"8V71R\"),5,\"\")","v":""},"8V71L","Screen Width",{"$f":"Frame_Width-4.875","v":-4.875}]
[{"$f":"IF(OR(ModelNo=\"8V71L\",ModelNo=\"8V71R\"),6,\"\")","v":""},"8V71L","Screen Height",{"$f":"Frame_Height-5","v":-5}]
[{"$f":"IF(OR(ModelNo=\"8V71L\",ModelNo=\"8V71R\"),7,\"\")","v":""},"8V71L","Egress Opening Width (Standard Hinge)",{"$f":"Frame_Width-9.625","v":-9.625}]
[{"$f":"IF(OR(ModelNo=\"8V71L\",ModelNo=\"8V71R\"),8,\"\")","v":""},"8V71L","Egress Opening Height (Standard Hinge)",{"$f":"Frame_Height-5.25","v":-5.25}]
[{"$f":"IF(OR(ModelNo=\"8V71L\",ModelNo=\"8V71R\"),9,\"\")","v":""},"8V71L","Egress Opening Area w/Standard Hinge (sq.ft.)",{"$f":"(D119*D120)/144","v":0.35091145833333331}]
[{"$f":"IF(OR(ModelNo=\"8V71L\",ModelNo=\"8V71R\"),10,\"\")","v":""},"8V71L","Egress Opening Width (Egress Hinge)",{"$f":"Frame_Width-8","v":-8}]
[{"$f":"IF(OR(ModelNo=\"8V71L\",ModelNo=\"8V71R\"),11,\"\")","v":""},"8V71L","Egress Opening Height (Egress Hinge)",{"$f":"Frame_Height-5.5","v":-5.5}]
[{"$f":"IF(OR(ModelNo=\"8V71L\",ModelNo=\"8V71R\"),12,\"\")","v":""},"8V71L","Egress Opening Area w/Egress Hinge (sq.ft.)",{"$f":"(D122*D123)/144","v":0.30555555555555558}]
[{"$f":"IF(ModelNo=B125,1,\"\")","v":""},"3S55A","Sash Width",{"$f":"Frame_Width-2.875","v":-2.875}]
[{"$f":"IF(ModelNo=B126,2,\"\")","v":""},"3S55A","Sash Height",{"$f":"Frame_Height-2.8125","v":-2.8125}]
[{"$f":"IF(ModelNo=B127,3,\"\")","v":""},"3S55A","Glass Width",{"$f":"TRUNC((Frame_Width-4.75)*16+0.5)/16","v":-4.6875}]
[{"$f":"IF(ModelNo=B128,4,\"\")","v":""},"3S55A","Glass Height",{"$f":"TRUNC((Frame_Height-4.6875)*16+0.5)/16","v":-4.625}]
[{"$f":"IF(ModelNo=B129,5,\"\")","v":""},"3S55A","Glass Area (sq.ft.)",{"$f":"(D127*D128)/144","v":0.15055338541666666}]
[{"$f":"IF(ModelNo=B130,6,\"\")","v":""},"3S55A","Screen Width",{"$f":"Frame_Width-4","v":-4}]
[{"$f":"IF(ModelNo=B131,7,\"\")","v":""},"3S55A","Screen Height",{"$f":"Frame_Height-3.9375","v":-3.9375}]
[{"$f":"IF(ModelNo=B132,8,\"\")","v":""},"3S55A","Hopper Window Does Not Meet Egress","N/A"]
[{"$f":"IF(ModelNo=B133,1,\"\")","v":""},"3S56A","Sash Width",{"$f":"Frame_Width-2.875","v":-2.875}]
[{"$f":"IF(ModelNo=B134,2,\"\")","v":""},"3S56A","Sash Height",{"$f":"Frame_Height-2.8125","v":-2.8125}]
[{"$f":"IF(ModelNo=B135,3,\"\")","v":""},"3S56A","Glass Width",{"$f":"TRUNC((Frame_Width-4.625)*16+0.5)/16","v":-4.5625}]
[{"$f":"IF(ModelNo=B136,4,\"\")","v":""},"3S56A","Glass Height",{"$f":"TRUNC((Frame_Height-4.8125)*16+0.5)/16","v":-4.75}]
[{"$f":"IF(ModelNo=B137,5,\"\")","v":""},"3S56A","Glass Area (sq.ft.)",{"$f":"(D135*D136)/144","v":0.15049913194444445}]
[{"$f":"IF(ModelNo=B138,6,\"\")","v":""},"3S56A","Screen Width",{"$f":"Frame_Width-2.75","v":-2.75}]
[{"$f":"IF(ModelNo=B139,7,\"\")","v":""},"3S56A","Screen Height",{"$f":"Frame_Height-2.9375","v":-2.9375}]
[{"$f":"IF(ModelNo=B140,8,\"\")","v":""},"3S56A","Egress Opening Width",{"$f":"IFERROR(Frame_Width-4.5,\"N/A\")","v":-4.5}]
[{"$f":"IF(ModelNo=B141,9,\"\")","v":""},"3S56A","Egress Opening Height",{"$f":"IFERROR(Frame_Height-6,\"N/A\")","v":-6}]
[{"$f":"IF(ModelNo=B142,10,\"\")","v":""},"3S56A","Egress Opening Area (sq.ft.)",{"$f":"IFERROR((D140*D141)/144,\"N/A\")","v":0.1875}]
[{"$f":"IF(ModelNo=B143,1,\"\")","v":""},"8V81A","Sash Width",{"$f":"Frame_Width-1.25","v":-1.25}]
[{"$f":"IF(ModelNo=B144,2,\"\")","v":""},"8V81A","Sash Height",{"$f":"Frame_Height-1.25","v":-1.25}]
[{"$f":"IF(ModelNo=B145,3,\"\")","v":""},"8V81A","Glass Width",{"$f":"TRUNC((Frame_Width-4.75)*16+0.5)/16","v":-4.6875}]
[{"$f":"IF(ModelNo=B146,4,\"\")","v":""},"8V81A","Glass Height",{"$f":"TRUNC((Frame_Height-4.75)*16+0.5)/16","v":-4.6875}]
[{"$f":"IF(ModelNo=B147,5,\"\")","v":""},"8V81A","Glass Area (sq.ft.)",{"$f":"(D145*D146)/144","v":0.152587890625}]
[{"$f":"IF(ModelNo=B148,6,\"\")","v":""},"8V81A","Screen Width",{"$f":"Frame_Width-4.875","v":-4.875}]
[{"$f":"IF(ModelNo=B149,7,\"\")","v":""},"8V81A","Screen Height",{"$f":"Frame_Height-5","v":-5}]
[{"$f":"IF(ModelNo=B150,8,\"\")","v":""},"8V81A","Awning Does not Meet Egress","N/A"]
[{"$f":"IF(ModelNo=B151,1,\"\")","v":""},"L201","Top Sash Width",{"$f":"Frame_Width-3.25","v":-3.25}]
[{"$f":"IF(ModelNo=B152,2,\"\")","v":""},"L201","Top Sash Height",{"$f":"CMR!$E$26-1.5625","v":-1.5625}]
[{"$f":"IF(ModelNo=B153,3,\"\")","v":""},"L201","Bottom Sash Width",{"$f":"Frame_Width-2.25","v":-2.25}]
[{"$f":"IF(ModelNo=B154,4,\"\")","v":""},"L201","Bottom Sash Height",{"$f":"CMR!$E$27-0.5625","v":-0.5625}]
[{"$f":"IF(ModelNo=B155,5,\"\")","v":""},"L201","Top Glass Width",{"$f":"CMR!$E$29","v":-4.875}]
[{"$f":"IF(ModelNo=B156,6,\"\")","v":""},"L201","Top Glass Height",{"$f":"CMR!$E$31","v":-3.1875}]
[{"$f":"IF(ModelNo=B157,7,\"\")","v":""},"L201","Bottom Glass Width",{"$f":"CMR!$E$30","v":-3.875}]
[{"$f":"IF(ModelNo=B158,8,\"\")","v":""},"L201","Bottom Glass Height",{"$f":"CMR!$E$32","v":-2.1875}]
[{"$f":"IF(ModelNo=B159,9,\"\")","v":""},"L201","Screen Width",{"$f":"IF(Screen=\"L\",Frame_Width-1.6875,Frame_Width-3.6875)","v":-3.6875}]
[{"$f":"IF(ModelNo=B160,10,\"\")","v":""},"L201","Screen Height",{"$f":"IF(Screen=\"L\",TRUNC((CMR!$E$27-1.375)*16+0.5)/16,IF(Screen=\"F\",TRUNC((Frame_Height-2.875)*16+0.5)/16,TRUNC((CMR!$E$27-0.3125)*16+0.5)/16))","v":-0.25}]
[{"$f":"IF(ModelNo=B161,11,\"\")","v":""},"L201","Top Sash Weight (Plus 5 lb)",{"$f":"IF(ISERROR(TOP_WGT&\" \"&\"lb\"),\"N/A\",TOP_WGT&\" \"&\"lb\")","v":"N/A"}]
[{"$f":"IF(ModelNo=B162,12,\"\")","v":""},"L201","Top Balance Size (C.F)",{"$f":"IF(ISERROR((VLOOKUP(TOP_WGT,Fusion,2,FALSE))&(VLOOKUP(TOP_WGT,Fusion,3,FALSE))),\"N/A\",(VLOOKUP(TOP_WGT,Fusion,2,FALSE))&(VLOOKUP(TOP_WGT,Fusion,3,FALSE)))","v":"N/A"}]
[{"$f":"IF(ModelNo=B163,13,\"\")","v":""},"L201","Bottom Sash Weight",{"$f":"IF(ISERROR(BTM_WGT&\" \"&\"lb\"),\"N/A\",BTM_WGT&\" \"&\"lb\")","v":"N/A"}]
[{"$f":"IF(ModelNo=B164,14,\"\")","v":""},"L201","Bottom Balance Size (C.F)",{"$f":"IF(ISERROR((VLOOKUP(BTM_WGT,Fusion,2,FALSE))&(VLOOKUP(BTM_WGT,Fusion,3,FALSE))),\"N/A\",(VLOOKUP(BTM_WGT,Fusion,2,FALSE))&(VLOOKUP(BTM_WGT,Fusion,3,FALSE)))","v":"N/A"}]
[{"$f":"IF(ModelNo=B165,15,\"\")","v":""},"L201","Egress Opening Width",{"$f":"IF(ISERROR(EW),\"N/A\",EW)","v":"N/A"}]
[{"$f":"IF(ModelNo=B166,16,\"\")","v":""},"L201","Egress Opening Height",{"$f":"IF(ISERROR(EH),\"N/A\",EH)","v":"N/A"}]
[{"$f":"IF(ModelNo=B167,17,\"\")","v":""},"L201","Egress Opening Area (sq.ft.)",{"$f":"IF(ISERROR(EO),\"N/A\",EO)","v":"N/A"}]
[{"$f":"IF(ModelNo=B168,1,\"\")","v":""},"L202","Sash Width",{"$f":"(Frame_Width/2)-0.625","v":-0.625}]
[{"$f":"IF(ModelNo=B169,2,\"\")","v":""},"L202","Sash Height",{"$f":"Frame_Height-3.25","v":-3.25}]
[{"$f":"IF(ModelNo=B170,3,\"\")","v":""},"L202","Roller Track Length",{"$f":"Frame_Width-1.8125","v":-1.8125}]
[{"$f":"IF(ModelNo=B171,4,\"\")","v":""},"L202","Glass Width",{"$f":"(Frame_Width/2)-2.3125","v":-2.3125}]
[{"$f":"IF(ModelNo=B172,5,\"\")","v":""},"L202","Glass Height",{"$f":"Frame_Height-4.9375","v":-4.9375}]
[{"$f":"IF(ModelNo=B173,6,\"\")","v":""},"L202","Screen Width",{"$f":"IF(Screen=\"F\",Frame_Width-4.125,IF(Screen=\"L\",\"N/A\",(Frame_Width/2)-1.5))","v":-1.5}]
[{"$f":"IF(ModelNo=B174,7,\"\")","v":""},"L202","Screen Height",{"$f":"IF(Screen=\"H\",Frame_Height-3.6875,Frame_Height-3.75)","v":-3.6875}]
[{"$f":"IF(ModelNo=B175,8,\"\")","v":""},"L202","Egress Opening Width",{"$f":"(Frame_Width/2)-4.25","v":-4.25}]
[{"$f":"IF(ModelNo=B176,9,\"\")","v":""},"L202","Egress Opening Height",{"$f":"Frame_Height-4.4375","v":-4.4375}]
[{"$f":"IF(ModelNo=B177,10,\"\")","v":""},"L202","Egress Opening Area (sq.ft.)",{"$f":"(D175*D176)/144","v":0.13096788194444445}]
[{"$f":"IF(ModelNo=B178,1,\"\")","v":""},"L203","Operating Sash Width",{"$f":"(TRUNC((((Frame_Width/4)+0.6875))*16+0.5)/16)-0.4375","v":0.25}]
[{"$f":"IF(ModelNo=B179,2,\"\")","v":""},"L203","Operating Sash Height",{"$f":"Frame_Height-3.25","v":-3.25}]
[{"$f":"IF(ModelNo=B180,3,\"\")","v":""},"L203","Fixed Sash Width",{"$f":"(Frame_Width-(2*(TRUNC((((Frame_Width/4)+0.6875))*16+0.5)/16)))+0.125","v":-1.25}]
[{"$f":"IF(ModelNo=B181,4,\"\")","v":""},"L203","Fixed Sash Height",{"$f":"Frame_Height-3.25","v":-3.25}]
[{"$f":"IF(ModelNo=B182,5,\"\")","v":""},"L203","Roller Track Length",{"$f":"Frame_Width-2.3125","v":-2.3125}]
[{"$f":"IF(ModelNo=B183,6,\"\")","v":""},"L203","Operating Sash Glass Width",{"$f":"(TRUNC((Frame_Width/4+0.6875)*16+0.5)/16)-2.125","v":-1.4375}]
[{"$f":"IF(ModelNo=B184,7,\"\")","v":""},"L203","Operating Sash Glass Height",{"$f":"Frame_Height-4.9375","v":-4.9375}]
[{"$f":"IF(ModelNo=B185,8,\"\")","v":""},"L203","Fixed Sash Glass Width",{"$f":"(Frame_Width-2*(TRUNC((Frame_Width/4+0.6875)*16+0.5)/16))-1.5625","v":-2.9375}]
[{"$f":"IF(ModelNo=B186,9,\"\")","v":""},"L203","Fixed Sash Glass Height",{"$f":"Frame_Height-4.9375","v":-4.9375}]
[{"$f":"IF(ModelNo=B187,10,\"\")","v":""},"L203","Screen Width",{"$f":"IF(Screen=\"F\",Frame_Width-4.125,IF(Screen=\"L\",\"N/A\",(TRUNC(((Frame_Width/4)+0.6875)*16+0.5)/16)-1.1875))","v":-0.5}]
[{"$f":"IF(ModelNo=B188,11,\"\")","v":""},"L203","Screen Height",{"$f":"Frame_Height-3.6875","v":-3.6875}]
[{"$f":"IF(ModelNo=B189,12,\"\")","v":""},"L203","Egress Opening Width",{"$f":"(Frame_Width/4)-1.5","v":-1.5}]
[{"$f":"IF(ModelNo=B190,13,\"\")","v":""},"L203","Egress Opening Height",{"$f":"Frame_Height-3.875","v":-3.875}]
[{"$f":"IF(ModelNo=B191,14,\"\")","v":""},"L203","Egress Opening Area (sq.ft.)",{"$f":"(D189*D190)/144","v":4.0364583333333336E-2}]
[{"$f":"IF(ModelNo=B192,1,\"\")","v":""},"L204","Glass Width",{"$f":"Frame_Width-3.4375","v":-3.4375}]
[{"$f":"IF(ModelNo=B193,2,\"\")","v":""},"L204","Glass Height",{"$f":"Frame_Height-3.4375","v":-3.4375}]
[{"$f":"IF(ModelNo=B194,3,\"\")","v":""},"L204","Glass Area (sq.ft.)",{"$f":"(D192*D193)/144","v":8.2058376736111105E-2}]
[{"$f":"IF(ModelNo=B195,1,\"\")","v":""},"L209","Operating Sash Width",{"$f":"(TRUNC(((Frame_Width/3)+0.1875)*16+0.5)/16)-0.4375","v":-0.25}]
[{"$f":"IF(ModelNo=B196,2,\"\")","v":""},"L209","Operating Sash Height",{"$f":"Frame_Height-3.25","v":-3.25}]
[{"$f":"IF(ModelNo=B197,3,\"\")","v":""},"L209","Fixed Sash Width",{"$f":"((TRUNC(((Frame_Width/3)+0.1875)*16+0.5)/16)-0.5625)+0.125","v":-0.25}]
[{"$f":"IF(ModelNo=B198,4,\"\")","v":""},"L209","Fixed Sash Height",{"$f":"Frame_Height-3.25","v":-3.25}]
[{"$f":"IF(ModelNo=B199,5,\"\")","v":""},"L209","Roller Track Length",{"$f":"Frame_Width-2.3125","v":-2.3125}]
[{"$f":"IF(ModelNo=B200,6,\"\")","v":""},"L209","Operating Sash Glass Width",{"$f":"(TRUNC((Frame_Width/3+0.1875)*16+0.5)/16)-2.125","v":-1.9375}]
[{"$f":"IF(ModelNo=B201,7,\"\")","v":""},"L209","Operating Sash Glass Height",{"$f":"Frame_Height-4.9375","v":-4.9375}]
[{"$f":"IF(ModelNo=B202,8,\"\")","v":""},"L209","Fixed Sash Glass Width",{"$f":"(TRUNC((Frame_Width/3+0.1875)*16+0.5)/16)-2.125","v":-1.9375}]
[{"$f":"IF(ModelNo=B203,9,\"\")","v":""},"L209","Fixed Sash Glass Height",{"$f":"Frame_Height-4.9375","v":-4.9375}]
[{"$f":"IF(ModelNo=B204,10,\"\")","v":""},"L209","Screen Width",{"$f":"IF(Screen=\"F\",Frame_Width-4.125,IF(Screen=\"L\",\"N/A\",(TRUNC(((Frame_Width/3)+0.1875)*16+0.5)/16)-1.1875))","v":-1}]
[{"$f":"IF(ModelNo=B205,11,\"\")","v":""},"L209","Screen Height",{"$f":"Frame_Height-3.6875","v":-3.6875}]
[{"$f":"IF(ModelNo=B206,12,\"\")","v":""},"L209","Egress Opening Width",{"$f":"(TRUNC(((Frame_Width/3)+0.1875)*16+0.5)/16)-4.15","v":-3.9625000000000004}]
[{"$f":"IF(ModelNo=B207,13,\"\")","v":""},"L209","Egress Opening Height",{"$f":"Frame_Height-3.875","v":-3.875}]
[{"$f":"IF(ModelNo=B208,14,\"\")","v":""},"L209","Egress Opening Area (sq.ft.)",{"$f":"(D206*D207)/144","v":0.10662977430555556}]
[{"$f":"IF(ModelNo=B209,1,\"\")","v":""},"0970","Glass Width",{"$f":"Frame_Width-4.625","v":-4.625}]
[{"$f":"IF(ModelNo=B210,2,\"\")","v":""},"0970","Glass Height",{"$f":"Frame_Height-4.625","v":-4.625}]
[{"$f":"IF(ModelNo=B211,3,\"\")","v":""},"0970","Glass Area (sq.ft.)",{"$f":"(D209*D210)/144","v":0.14854600694444445}]
[{"$f":"IF(ModelNo=B212,1,\"\")","v":""},"0971","Sash Width",{"$f":"Frame_Width-1.625","v":-1.625}]
[{"$f":"IF(ModelNo=B213,2,\"\")","v":""},"0971","Sash Height",{"$f":"Frame_Height-1.625","v":-1.625}]
[{"$f":"IF(ModelNo=B214,3,\"\")","v":""},"0971","Glass Width",{"$f":"Frame_Width-4.625","v":-4.625}]
[{"$f":"IF(ModelNo=B215,4,\"\")","v":""},"0971","Glass Height",{"$f":"Frame_Height-4.625","v":-4.625}]
[{"$f":"IF(ModelNo=B216,5,\"\")","v":""},"0971","Screen Width",{"$f":"Frame_Width-4.0625","v":-4.0625}]
[{"$f":"IF(ModelNo=B217,6,\"\")","v":""},"0971","Screen Height",{"$f":"Frame_Height-4","v":-4}]
[{"$f":"IF(ModelNo=B218,7,\"\")","v":""},"0971","Egress Opening Width (Standard Hinge)",{"$f":"Frame_Width-11.25","v":-11.25}]
[{"$f":"IF(ModelNo=B219,8,\"\")","v":""},"0971","Egress Opening Height (Standard Hinge)",{"$f":"Frame_Height-4.375","v":-4.375}]
[{"$f":"IF(ModelNo=B220,9,\"\")","v":""},"0971","Egress Opening Area w/Standard Hinge (sq.ft.)",{"$f":"(D218*D219)/144","v":0.341796875}]
[{"$f":"IF(ModelNo=B221,10,\"\")","v":""},"0971","Egress Opening Width (Egress Hinge)",{"$f":"IF(D212<22.375,\"N/A\",Frame_Width-6.8125)","v":"N/A"}]
[{"$f":"IF(ModelNo=B222,11,\"\")","v":""},"0971","Egress Opening Height (Egress Hinge)",{"$f":"IF(D212<22.375,\"N/A\",Frame_Height-4.375)","v":"N/A"}]
[{"$f":"IF(ModelNo=B223,12,\"\")","v":""},"0971","Egress Opening Area w/Egress Hinge (sq.ft.)",{"$f":"IF(D212<22.375,\"N/A\",(D221*D222)/144)","v":"N/A"}]
[{"$f":"IF(ModelNo=B224,1,\"\")","v":""},"0972","Sash Width",{"$f":"(Frame_Width/2)-1.375","v":-1.375}]
[{"$f":"IF(ModelNo=B225,2,\"\")","v":""},"0972","Sash Height",{"$f":"Frame_Height-1.625","v":-1.625}]
[{"$f":"IF(ModelNo=B226,3,\"\")","v":""},"0972","Glass Width",{"$f":"(Frame_Width/2)-4.375","v":-4.375}]
[{"$f":"IF(ModelNo=B227,4,\"\")","v":""},"0972","Glass Height",{"$f":"Frame_Height-4.625","v":-4.625}]
[{"$f":"IF(ModelNo=B228,5,\"\")","v":""},"0972","Screen Width",{"$f":"(Frame_Width/2)-3.8125","v":-3.8125}]
[{"$f":"IF(ModelNo=B229,6,\"\")","v":""},"0972","Screen Height",{"$f":"Frame_Height-4","v":-4}]
[{"$f":"IF(ModelNo=B230,7,\"\")","v":""},"0972","Egress Opening Width (Standard Hinge)",{"$f":"(Frame_Width/2)-11","v":-11}]
[{"$f":"IF(ModelNo=B231,8,\"\")","v":""},"0972","Egress Opening Height (Standard Hinge)",{"$f":"Frame_Height-4.375","v":-4.375}]
[{"$f":"IF(ModelNo=B232,9,\"\")","v":""},"0972","Egress Opening Area w/Standard Hinge (sq.ft.)",{"$f":"(D230*D231)/144","v":0.3342013888888889}]
[{"$f":"IF(ModelNo=B233,10,\"\")","v":""},"0972","Egress Opening Width (Egress Hinge)",{"$f":"IF(D224<22.375,\"N/A\",(Frame_Width/2)-6.5625)","v":"N/A"}]
[{"$f":"IF(ModelNo=B234,11,\"\")","v":""},"0972","Egress Opening Height (Egress Hinge)",{"$f":"IF(D224<22.375,\"N/A\",Frame_Height-4.375)","v":"N/A"}]
[{"$f":"IF(ModelNo=B235,12,\"\")","v":""},"0972","Egress Opening Area w/Egress Hinge (sq.ft.)",{"$f":"IF(D224<22.375,\"N/A\",(D148*D149)/144)","v":"N/A"}]
[{"$f":"IF(ModelNo=B236,1,\"\")","v":""},"0973","Operating Sash Width",{"$f":"(Frame_Width/4)-1.375","v":-1.375}]
[{"$f":"IF(ModelNo=B237,2,\"\")","v":""},"0973","Operating Sash Height",{"$f":"Frame_Height-1.625","v":-1.625}]
[{"$f":"IF(ModelNo=B238,3,\"\")","v":""},"0973","Fixed Sash Width",{"$f":"(Frame_Width/2)-1.125","v":-1.125}]
[{"$f":"IF(ModelNo=B239,4,\"\")","v":""},"0973","Fixed Sash Height",{"$f":"Frame_Height-1.625","v":-1.625}]
[{"$f":"IF(ModelNo=B240,5,\"\")","v":""},"0973","Operating Sash Glass Width",{"$f":"(Frame_Width/4)-4.375","v":-4.375}]
[{"$f":"IF(ModelNo=B241,6,\"\")","v":""},"0973","Operating Sash Glass Height",{"$f":"Frame_Height-4.625","v":-4.625}]
[{"$f":"IF(ModelNo=B242,7,\"\")","v":""},"0973","Fixed Sash Glass Width",{"$f":"(Frame_Width/2)-4.125","v":-4.125}]
[{"$f":"IF(ModelNo=B243,8,\"\")","v":""},"0973","Fixed Sash Glass Height",{"$f":"Frame_Height-4.625","v":-4.625}]
[{"$f":"IF(ModelNo=B244,9,\"\")","v":""},"0973","Screen Width",{"$f":"(Frame_Width/4)-3.8125","v":-3.8125}]
[{"$f":"IF(ModelNo=B245,10,\"\")","v":""},"0973","Screen Height",{"$f":"Frame_Height-4","v":-4}]
[{"$f":"IF(ModelNo=B246,11,\"\")","v":""},"0973","Egress Opening Width (Standard Hinge)",{"$f":"(Frame_Width/4)-11","v":-11}]
[{"$f":"IF(ModelNo=B247,12,\"\")","v":""},"0973","Egress Opening Height (Standard Hinge)",{"$f":"Frame_Height-4.375","v":-4.375}]
[{"$f":"IF(ModelNo=B248,13,\"\")","v":""},"0973","Egress Opening Area w/Standard Hinge (sq.ft.)",{"$f":"(D246*D247)/144","v":0.3342013888888889}]
[{"$f":"IF(ModelNo=B249,14,\"\")","v":""},"0973","Egress Opening Width (Egress Hinge)",{"$f":"IF(D236<22.375,\"N/A\",(Frame_Width/4)-6.5625)","v":"N/A"}]
[{"$f":"IF(ModelNo=B250,15,\"\")","v":""},"0973","Egress Opening Height (Egress Hinge)",{"$f":"IF(D236<22.375,\"N/A\",Frame_Height-4.375)","v":"N/A"}]
[{"$f":"IF(ModelNo=B251,16,\"\")","v":""},"0973","Egress Opening Area w/Egress Hinge (sq.ft.)",{"$f":"IF(D236<22.375,\"N/A\",(D164*D165)/144)","v":"N/A"}]
[{"$f":"IF(ModelNo=B252,1,\"\")","v":""},"0979","Operating Sash Width",{"$f":"TRUNC(((Frame_Width/3)-1.291)*16+0.5)/16","v":-1.25}]
[{"$f":"IF(ModelNo=B253,2,\"\")","v":""},"0979","Operating Sash Height",{"$f":"Frame_Height-1.625","v":-1.625}]
[{"$f":"IF(ModelNo=B254,3,\"\")","v":""},"0979","Fixed Sash Width",{"$f":"TRUNC(((Frame_Width/3)-1.291)*16+0.5)/16","v":-1.25}]
[{"$f":"IF(ModelNo=B255,4,\"\")","v":""},"0979","Fixed Sash Height",{"$f":"Frame_Height-1.625","v":-1.625}]
[{"$f":"IF(ModelNo=B256,5,\"\")","v":""},"0979","Operating Sash Glass Width",{"$f":"TRUNC(((Frame_Width/3)-4.291)*16+0.5)/16","v":-4.25}]
[{"$f":"IF(ModelNo=B257,6,\"\")","v":""},"0979","Operating Sash Glass Height",{"$f":"Frame_Height-4.625","v":-4.625}]
[{"$f":"IF(ModelNo=B258,7,\"\")","v":""},"0979","Fixed Sash Glass Width",{"$f":"TRUNC(((Frame_Width/3)-4.291)*16+0.5)/16","v":-4.25}]
[{"$f":"IF(ModelNo=B259,8,\"\")","v":""},"0979","Fixed Sash Glass Height",{"$f":"Frame_Height-4.625","v":-4.625}]
[{"$f":"IF(ModelNo=B260,9,\"\")","v":""},"0979","Screen Width",{"$f":"TRUNC(((Frame_Width/3)-3.666)*32+0.5)/32","v":-3.625}]
[{"$f":"IF(ModelNo=B261,10,\"\")","v":""},"0979","Screen Height",{"$f":"Frame_Height-4","v":-4}]
[{"$f":"IF(ModelNo=B262,11,\"\")","v":""},"0979","Egress Opening Width (Standard Hinge)",{"$f":"TRUNC(((Frame_Width/3)-10.916)*16+0.5)/16","v":-10.875}]
[{"$f":"IF(ModelNo=B263,12,\"\")","v":""},"0979","Egress Opening Height (Standard Hinge)",{"$f":"Frame_Height-4.375","v":-4.375}]
[{"$f":"IF(ModelNo=B264,13,\"\")","v":""},"0979","Egress Opening Area w/Standard Hinge (sq.ft.)",{"$f":"(D262*D263)/144","v":0.33040364583333331}]
[{"$f":"IF(ModelNo=B265,14,\"\")","v":""},"0979","Egress Opening Width (Egress Hinge)",{"$f":"IF(D252<22.375,\"N/A\",TRUNC(((Frame_Width/3)-6.4785)*16+0.5)/16)","v":"N/A"}]
[{"$f":"IF(ModelNo=B266,15,\"\")","v":""},"0979","Egress Opening Height (Egress Hinge)",{"$f":"IF(D252<22.375,\"N/A\",Frame_Height-4.375)","v":"N/A"}]
[{"$f":"IF(ModelNo=B267,16,\"\")","v":""},"0979","Egress Opening Area w/Egress Hinge (sq.ft.)",{"$f":"IF(D252<22.375,\"N/A\",(D180*D181)/144)","v":"N/A"}]
[{"$f":"IF(ModelNo=B268,1,\"\")","v":""},"0974","Operating Sash Width",{"$f":"(Frame_Width/4)-1.25","v":-1.25}]
[{"$f":"IF(ModelNo=B269,2,\"\")","v":""},"0974","Operating Sash Height",{"$f":"Frame_Height-1.625","v":-1.625}]
[{"$f":"IF(ModelNo=B270,3,\"\")","v":""},"0974","Fixed Sash Width",{"$f":"(Frame_Width/4)-1.25","v":-1.25}]
[{"$f":"IF(ModelNo=B271,4,\"\")","v":""},"0974","Fixed Sash Height",{"$f":"Frame_Height-1.625","v":-1.625}]
[{"$f":"IF(ModelNo=B272,5,\"\")","v":""},"0974","Operating Sash Glass Width",{"$f":"(Frame_Width/4)-4.25","v":-4.25}]
[{"$f":"IF(ModelNo=B273,6,\"\")","v":""},"0974","Operating Sash Glass Height",{"$f":"Frame_Height-4.625","v":-4.625}]
[{"$f":"IF(ModelNo=B274,7,\"\")","v":""},"0974","Fixed Sash Glass Width",{"$f":"(Frame_Width/4)-4.25","v":-4.25}]
[{"$f":"IF(ModelNo=B275,8,\"\")","v":""},"0974","Fixed Sash Glass Height",{"$f":"Frame_Height-4.625","v":-4.625}]
[{"$f":"IF(ModelNo=B276,9,\"\")","v":""},"0974","Screen Width",{"$f":"(Frame_Width/4)-3.625","v":-3.625}]
[{"$f":"IF(ModelNo=B277,10,\"\")","v":""},"0974","Screen Height",{"$f":"Frame_Height-4","v":-4}]
[{"$f":"IF(ModelNo=B278,11,\"\")","v":""},"0974","Egress Opening Width (Standard Hinge)",{"$f":"(Frame_Width/4)-10.875","v":-10.875}]
[{"$f":"IF(ModelNo=B279,12,\"\")","v":""},"0974","Egress Opening Height (Standard Hinge)",{"$f":"Frame_Height-4.375","v":-4.375}]
[{"$f":"IF(ModelNo=B280,13,\"\")","v":""},"0974","Egress Opening Area w/Standard Hinge (sq.ft.)",{"$f":"(D278*D279)/144","v":0.33040364583333331}]
[{"$f":"IF(ModelNo=B281,14,\"\")","v":""},"0974","Egress Opening Width (Egress Hinge)",{"$f":"IF(D268<22.375,\"N/A\",(Frame_Width/4)-6.4375)","v":"N/A"}]
[{"$f":"IF(ModelNo=B282,15,\"\")","v":""},"0974","Egress Opening Height (Egress Hinge)",{"$f":"IF(D268<22.375,\"N/A\",Frame_Height-4.375)","v":"N/A"}]
[{"$f":"IF(ModelNo=B283,16,\"\")","v":""},"0974","Egress Opening Area w/Egress Hinge (sq.ft.)",{"$f":"IF(D268<22.375,\"N/A\",(D196*D197)/144)","v":"N/A"}]
[{"$f":"IF(ModelNo=B284,1,\"\")","v":""},"0975","Operating Sash Width",{"$f":"TRUNC(((Frame_Width/5)-1.225)*16+0.5)/16","v":-1.1875}]
[{"$f":"IF(ModelNo=B285,2,\"\")","v":""},"0975","Operating Sash Height",{"$f":"Frame_Height-1.625","v":-1.625}]
[{"$f":"IF(ModelNo=B286,3,\"\")","v":""},"0975","Fixed Sash Width",{"$f":"TRUNC(((Frame_Width/5)-1.225)*16+0.5)/16","v":-1.1875}]
[{"$f":"IF(ModelNo=B287,4,\"\")","v":""},"0975","Fixed Sash Height",{"$f":"Frame_Height-1.625","v":-1.625}]
[{"$f":"IF(ModelNo=B288,5,\"\")","v":""},"0975","Operating Sash Glass Width",{"$f":"TRUNC(((Frame_Width/5)-4.225)*16+0.5)/16","v":-4.1875}]
[{"$f":"IF(ModelNo=B289,6,\"\")","v":""},"0975","Operating Sash Glass Height",{"$f":"Frame_Height-4.625","v":-4.625}]
[{"$f":"IF(ModelNo=B290,7,\"\")","v":""},"0975","Fixed Sash Glass Width",{"$f":"TRUNC(((Frame_Width/5)-4.225)*16+0.5)/16","v":-4.1875}]
[{"$f":"IF(ModelNo=B291,8,\"\")","v":""},"0975","Fixed Sash Glass Height",{"$f":"Frame_Height-4.625","v":-4.625}]
[{"$f":"IF(ModelNo=B292,9,\"\")","v":""},"0975","Screen Width",{"$f":"TRUNC(((Frame_Width/5)-3.7625)*16+0.5)/16","v":-3.6875}]
[{"$f":"IF(ModelNo=B293,10,\"\")","v":""},"0975","Screen Height",{"$f":"Frame_Height-4","v":-4}]
[{"$f":"IF(ModelNo=B294,11,\"\")","v":""},"0975","Egress Opening Width (Standard Hinge)",{"$f":"TRUNC(((Frame_Width/5)-10.875)*16+0.5)/16","v":-10.8125}]
[{"$f":"IF(ModelNo=B295,12,\"\")","v":""},"0975","Egress Opening Height (Standard Hinge)",{"$f":"Frame_Height-4.375","v":-4.375}]
[{"$f":"IF(ModelNo=B296,13,\"\")","v":""},"0975","Egress Opening Area w/Standard Hinge (sq.ft.)",{"$f":"(D294*D295)/144","v":0.32850477430555558}]
[{"$f":"IF(ModelNo=B297,14,\"\")","v":""},"0975","Egress Opening Width (Egress Hinge)",{"$f":"IF(D284<22.375,\"N/A\",TRUNC(((Frame_Width/5)-6.4375)*16+0.5)/16)","v":"N/A"}]
[{"$f":"IF(ModelNo=B298,15,\"\")","v":""},"0975","Egress Opening Height (Egress Hinge)",{"$f":"IF(D284<22.375,\"N/A\",Frame_Height-4.375)","v":"N/A"}]
[{"$f":"IF(ModelNo=B299,16,\"\")","v":""},"0975","Egress Opening Area w/Egress Hinge (sq.ft.)",{"$f":"IF(D284<22.375,\"N/A\",(D212*D213)/144)","v":"N/A"}]
[{"$f":"IF(ModelNo=B300,1,\"\")","v":""},"03A0","Bottom Sash Width",{"$f":"Frame_Width-3.125","v":-3.125}]
[{"$f":"IF(ModelNo=B301,2,\"\")","v":""},"03A0","Bottom Sash Height",{"$f":"CDIM03A0-1.125","v":-1.125}]
[{"$f":"IF(ModelNo=B302,3,\"\")","v":""},"03A0","Bottom Glass Width",{"$f":"BGW03A0","v":-4.75}]
[{"$f":"IF(ModelNo=B303,4,\"\")","v":""},"03A0","Bottom Glass Height",{"$f":"BGH03A0","v":-2.71875}]
[{"$f":"IF(ModelNo=B304,5,\"\")","v":""},"03A0","Top Glass Width",{"$f":"TGW03A0","v":-4.6875}]
[{"$f":"IF(ModelNo=B305,6,\"\")","v":""},"03A0","Top Glass Height",{"$f":"TGH03A0","v":-2.59375}]
[{"$f":"IF(ModelNo=B306,7,\"\")","v":""},"03A0","Astragal Length",{"$f":"TRUNC((Frame_Width-4.125)*16+0.5)/16","v":-4.0625}]
[{"$f":"IF(ModelNo=B307,8,\"\")","v":""},"03A0","Screen Width",{"$f":"Frame_Width-4.5","v":-4.5}]
[{"$f":"IF(ModelNo=B308,9,\"\")","v":""},"03A0","Screen Height",{"$f":"IF(Screen=\"F\",Frame_Height-3.3125,IF(Screen=\"L\",CDIM03A0-1.0625,CDIM03A0-1.3125))","v":-1.3125}]
[{"$f":"IF(ModelNo=B309,10,\"\")","v":""},"03A0","Bottom Sash Weight",{"$f":"IF(ISERROR(BTM_WGT&\" \"&\"lb\"),\"N/A\",BTM_WGT&\" \"&\"lb\")","v":"N/A"}]
[{"$f":"IF(ModelNo=B310,11,\"\")","v":""},"03A0","Balance Size",{"$f":"IF(ISERROR((VLOOKUP(BTM_WGT,CFB,2,FALSE))&(VLOOKUP(BTM_WGT,CFB,3,FALSE))),\"N/A\",(VLOOKUP(BTM_WGT,CFB,2,FALSE))&(VLOOKUP(BTM_WGT,CFB,3,FALSE)))","v":"N/A"}]
[{"$f":"IF(ModelNo=B311,12,\"\")","v":""},"03A0","Egress Opening Width",{"$f":"IF(ISERROR(EW),\"N/A\",EW)","v":"N/A"}]
[{"$f":"IF(ModelNo=B312,13,\"\")","v":""},"03A0","Egress Opening Height",{"$f":"IF(ISERROR(EH),\"N/A\",EH)","v":"N/A"}]
[{"$f":"IF(ModelNo=B313,14,\"\")","v":""},"03A0","Egress Opening Area (sq.ft.)",{"$f":"IF(ISERROR(EO),\"N/A\",EO)","v":"N/A"}]
[{"$f":"IF(ModelNo=B314,1,\"\")","v":""},"03A2","Sash Width",{"$f":"TRUNC(((Frame_Width/2)-1.0625)*16+0.5)/16","v":-1}]
[{"$f":"IF(ModelNo=B315,2,\"\")","v":""},"03A2","Sash Height",{"$f":"Frame_Height-3.0625","v":-3.0625}]
[{"$f":"IF(ModelNo=B316,3,\"\")","v":""},"03A2","Roller Track Length",{"$f":"Frame_Width-1.9375","v":-1.9375}]
[{"$f":"IF(ModelNo=B317,4,\"\")","v":""},"03A2","Sash Glass Width",{"$f":"TRUNC(((Frame_Width/2)-2.75)*16+0.5)/16","v":-2.6875}]
[{"$f":"IF(ModelNo=B318,5,\"\")","v":""},"03A2","Sash Glass Height",{"$f":"Frame_Height-4.6875","v":-4.6875}]
[{"$f":"IF(ModelNo=B319,6,\"\")","v":""},"03A2","Fixed Glass Width",{"$f":"TRUNC(((Frame_Width/2)-2.625)*16+0.5)/16","v":-2.5625}]
[{"$f":"IF(ModelNo=B320,7,\"\")","v":""},"03A2","Fixed Glass Height",{"$f":"TRUNC((Frame_Height-4.8125)*16+0.5)/16","v":-4.75}]
[{"$f":"IF(ModelNo=B321,8,\"\")","v":""},"03A2","Screen Width",{"$f":"IF(Screen=\"F\",Frame_Width-5,IF(Screen=\"L\",\"N/A\",TRUNC(((Frame_Width/2)-3.0625)*16+0.5)/16))","v":-3}]
[{"$f":"IF(ModelNo=B322,9,\"\")","v":""},"03A2","Screen Height",{"$f":"Frame_Height-4.5625","v":-4.5625}]
[{"$f":"IF(ModelNo=B323,10,\"\")","v":""},"03A2","Egress Opening Width",{"$f":"(Frame_Width/2)-4.75","v":-4.75}]
[{"$f":"IF(ModelNo=B324,11,\"\")","v":""},"03A2","Egress Opening Height",{"$f":"Frame_Height-5.875","v":-5.875}]
[{"$f":"IF(ModelNo=B325,12,\"\")","v":""},"03A2","Egress Opening Area (sq.ft.)",{"$f":"(D323*D324)/144","v":0.19379340277777779}]
[{"$f":"IF(ModelNo=B326,1,\"\")","v":""},"03A3","Operating Sash Width",{"$f":"TRUNC((((Frame_Width/4)+0.25))*16+0.5)/16","v":0.25}]
[{"$f":"IF(ModelNo=B327,2,\"\")","v":""},"03A3","Operating Sash Height",{"$f":"Frame_Height-3.0625","v":-3.0625}]
[{"$f":"IF(ModelNo=B328,3,\"\")","v":""},"03A3","Roller Track Length",{"$f":"Frame_Width-1.9375","v":-1.9375}]
[{"$f":"IF(ModelNo=B329,4,\"\")","v":""},"03A3","Operating Sash Glass Width",{"$f":"TRUNC(((TRUNC((((Frame_Width/4)+0.25))*16+0.5)/16)-1.6875)*16+0.5)/16","v":-1.375}]
[{"$f":"IF(ModelNo=B330,5,\"\")","v":""},"03A3","Operating Sash Glass Height",{"$f":"Frame_Height-4.6875","v":-4.6875}]
[{"$f":"IF(ModelNo=B331,6,\"\")","v":""},"03A3","Fixed Sash Glass Width",{"$f":"TRUNC((((Frame_Width-(2*(TRUNC((((Frame_Width/4)+0.6875))*16+0.5)/16)))+1)-2.75)*16+0.5)/16","v":-3.0625}]
[{"$f":"IF(ModelNo=B332,7,\"\")","v":""},"03A3","Fixed Sash Glass Height",{"$f":"Frame_Height-4.8125","v":-4.8125}]
[{"$f":"IF(ModelNo=B333,8,\"\")","v":""},"03A3","Screen Width",{"$f":"IF(Screen=\"F\",Frame_Width-5,IF(Screen=\"L\",\"N/A\",(TRUNC((Frame_Width/4+0.75)*16+0.5)/16)-2.5))","v":-1.75}]
[{"$f":"IF(ModelNo=B334,9,\"\")","v":""},"03A3","Screen Height",{"$f":"Frame_Height-4.5625","v":-4.5625}]
[{"$f":"IF(ModelNo=B335,10,\"\")","v":""},"03A3","Egress Opening Width",{"$f":"(Frame_Width/4)-2.875","v":-2.875}]
[{"$f":"IF(ModelNo=B336,11,\"\")","v":""},"03A3","Egress Opening Height",{"$f":"Frame_Height-5.875","v":-5.875}]
[{"$f":"IF(ModelNo=B337,12,\"\")","v":""},"03A3","Egress Opening Area (sq.ft.)",{"$f":"(D335*D336)/144","v":0.11729600694444445}]
[{"$f":"IF(ModelNo=B338,1,\"\")","v":""},"03A9","Operating Sash Width",{"$f":"TRUNC(((Frame_Width/3)-0.3125)*16+0.5)/16","v":-0.25}]
[{"$f":"IF(ModelNo=B339,2,\"\")","v":""},"03A9","Operating Sash Height",{"$f":"Frame_Height-3.0625","v":-3.0625}]
[{"$f":"IF(ModelNo=B340,3,\"\")","v":""},"03A9","Roller Track Length",{"$f":"Frame_Width-1.9375","v":-1.9375}]
[{"$f":"IF(ModelNo=B341,4,\"\")","v":""},"03A9","Operating Sash Glass Width",{"$f":"TRUNC(((TRUNC(((Frame_Width/3)-0.3125)*16+0.5)/16)-1.6875)*16+0.5)/16","v":-1.875}]
[{"$f":"IF(ModelNo=B342,5,\"\")","v":""},"03A9","Operating Sash Glass Height",{"$f":"Frame_Height-4.6875","v":-4.6875}]
[{"$f":"IF(ModelNo=B343,6,\"\")","v":""},"03A9","Fixed Sash Glass Width",{"$f":"((Frame_Width-((TRUNC(((Frame_Width/3)+0.1875)*16+0.5)/16)*2))+1.1875)-2.8125","v":-2}]
[{"$f":"IF(ModelNo=B344,7,\"\")","v":""},"03A9","Fixed Sash Glass Height",{"$f":"Frame_Height-4.8125","v":-4.8125}]
[{"$f":"IF(ModelNo=B345,8,\"\")","v":""},"03A9","Screen Width",{"$f":"IF(Screen=\"F\",Frame_Width-5,IF(Screen=\"L\",\"N/A\",(TRUNC((Frame_Width/3+0.1875)*16+0.5)/16)-2.5))","v":-2.3125}]
[{"$f":"IF(ModelNo=B346,9,\"\")","v":""},"03A9","Screen Height",{"$f":"Frame_Height-4.5625","v":-4.5625}]
[{"$f":"IF(ModelNo=B347,10,\"\")","v":""},"03A9","Egress Opening Width",{"$f":"(Frame_Width/3)-4.375","v":-4.375}]
[{"$f":"IF(ModelNo=B348,11,\"\")","v":""},"03A9","Egress Opening Height",{"$f":"Frame_Height-5.875","v":-5.875}]
[{"$f":"IF(ModelNo=B349,12,\"\")","v":""},"03A9","Egress Opening Area (sq.ft.)",{"$f":"(D347*D348)/144","v":0.1784939236111111}]
[{"$f":"IF(ModelNo=B350,1,\"\")","v":""},"03A4","Glass Width",{"$f":"Frame_Width-4.1875","v":-4.1875}]
[{"$f":"IF(ModelNo=B351,2,\"\")","v":""},"03A4","Glass Height",{"$f":"Frame_Height-4.1875","v":-4.1875}]
[{"$f":"IF(ModelNo=B352,3,\"\")","v":""},"03A4","Glass Area (sq.ft.)",{"$f":"(D350*D351)/144","v":0.12177191840277778}]

{"sheet":"Balance","index":2,"n_rows":229,"n_cols":117,"rows_kept":229,"cut":false,"hidden":true,"merged":[[79,16,79,21],[1,108,1,111],[2,51,2,53],[1,113,1,116],[0,108,0,116],[1,24,1,25],[1,1,1,3],[1,14,1,21],[0,41,0,45],[1,39,1,42],[1,44,1,47],[1,5,1,7]]}
[null,null,null,null,null,null,null,null,null,null,null,null,null,null,null,null,null,null,null,null,null,null,null,null,null,null,null,null,null,null,null,null,null,null,null,null,null,null,null,null,null,"BLOCK & TACKLE BALANCE CHART",null,null,null,null,null,null,null,null,null,null,null,null,null,"Spiral Balance",null,null,null,null,null,null,null,null,null,null,null,null,null,null,null,null,null,null,null,null,null,null,null,null,null,null,null,null,null,null,null,null,null,null,null,null,null,null,null,null,null,null,null,null,null,null,null,null,null,null,null,null,"V-Series BLOCK & TACKLE BALANCE CHART"]
[null,"CFB",null,null,null,"Curve CFB",null,null,null,null,null,null,"Glass Strength",null,"Weight Calculation",null,null,null,null,null,null,null,null,null,"Egress Calculation",null,null,null,null,null,null,null,null,null,null,null,null,null,null,"TOP SASH",null,null,null,null,"BOTTOM SASH",null,null,null,null,null,null,null,null,null,"Top Sash",{"$f":"IF(ISERROR(VLOOKUP((TRUNC(TOP_WGT)),$BD$7:$DB$41,TOPTUBELENGTH,FALSE)),\"N/A\",VLOOKUP((TRUNC(TOP_WGT)),$BD$7:$DB$41,TOPTUBELENGTH,FALSE))","v":"N/A"},{"$f":"TOPTUBELENGTH","v":{"$error":"#N/A"}},null,null,null,null,null,null,null,null,null,null,null,null,null,null,null,null,null,null,null,null,null,null,null,null,null,null,null,null,null,null,null,null,null,null,null,null,null,null,null,null,null,null,null,null,null,null,null,null,null,null,null,"TOP SASH",null,null,null,null,"BOTTOM SASH"]
[null,4,3,"RD",null,4,3,"BN",null,1,"S",{"$f":"1.157*2","v":2.3140000000000001},"Single Strength (2.5 mm)",null,"Model","CDIM","Bott. Sash Height","Bottom Sash Weight","Top Sash Weight","Bal. Loc.","H+S+SS","Sill","EW",null,"# of Coils",{"$f":"IF(ModelNo=\"L201\",VLOOKUP(BTM_WGT,Fusion_W,3,FALSE),VLOOKUP(BTM_WGT,CFB_W,3,FALSE))","v":{"$error":"#N/A"}},null,null,"3S40A","Length","Weight/ft","Weight",null,"8S40A","Length","Weight/ft","Weight",null,null,"Sash Weight","Tube Length","Balance","Weight",null,"Sash Weight","Tube Length","Balance","Weight",null,null,null,"Tube Length",null,null,"Bott. Sash",{"$f":"IF(ISERROR(VLOOKUP((TRUNC(BTM_WGT)),$BD$7:$DB$41,BOTTUBELENGTH,FALSE)),\"N/A\",VLOOKUP((TRUNC(BTM_WGT)),$BD$7:$DB$41,BOTTUBELENGTH,FALSE))","v":"N/A"},{"$f":"BOTTUBELENGTH","v":{"$error":"#N/A"}},null,null,null,null,"  TUBE LENGTH ",null,null,null,null,null,null,null,null,null,null,null,null,null,null,null,"TUBE LENGTH ",null,null,null,null,null,null,null,null,null,null,null,null,null,null,null,null,null,"TUBE LENGTH ",null,null,null,null,null,null,null,null,null,null,null,null,"Sash Weight","Tube Length","Balance","Weight",null,"Sash Weight","Tube Length","Balance","Weight"]
[null,{"$f":"B3+1","v":5},3,"RD",null,{"$f":"F3+1","v":5},3,"BN",null,2,"D",{"$f":"1.6*2","v":3.2},"Double Strength (3 mm)",null,{"$f":"ModelNo","v":"Select Model"},{"$f":"VLOOKUP(ModelNo,WEIGHTCALC,2,FALSE)","v":{"$error":"#N/A"}},{"$f":"VLOOKUP(ModelNo,WEIGHTCALC,3,FALSE)","v":{"$error":"#N/A"}},{"$f":"VLOOKUP(ModelNo,WEIGHTCALC,4,FALSE)","v":{"$error":"#N/A"}},{"$f":"VLOOKUP(ModelNo,WEIGHTCALC,5,FALSE)","v":{"$error":"#N/A"}},{"$f":"VLOOKUP(ModelNo,WEIGHTCALC,6,FALSE)","v":{"$error":"#N/A"}},{"$f":"VLOOKUP(ModelNo,WEIGHTCALC,7,FALSE)","v":{"$error":"#N/A"}},{"$f":"VLOOKUP(ModelNo,WEIGHTCALC,8,FALSE)","v":{"$error":"#N/A"}},{"$f":"VLOOKUP(ModelNo,WEIGHTCALC,9,FALSE)","v":{"$error":"#N/A"}},null,"Displacement",{"$f":"IF($Q$4>37.5,$Q$4-36,0)","v":{"$error":"#N/A"}},null,null,"Top Top Rail",0,0,{"$f":"AD4*AE4","v":0},null,"Top Top Rail",{"$f":"(Frame_Width-3.875)/12","v":-0.32291666666666669},0.36899999999999999,{"$f":"AI4*AJ4","v":-0.11915625000000001},null,null,{"$f":"TRUNC(TOP_WGT)","v":{"$error":"#N/A"}},{"$f":"$AN$9","v":0},"Number","Range",null,{"$f":"TRUNC(BTM_WGT)","v":{"$error":"#N/A"}},{"$f":"$AS$9","v":0},"Number","Range",null,null,null,"Model","Top","Bott",null,null,2,3,4,5,6,7,8,9,10,11,12,13,14,15,16,17,18,19,20,21,22,23,24,25,26,27,28,29,30,31,32,33,34,35,36,37,38,39,40,41,42,43,44,45,46,47,48,49,50,51,null,null,{"$f":"TRUNC(TOP_WGT)","v":{"$error":"#N/A"}},{"$f":"TOPTUBELENGTH","v":{"$error":"#N/A"}},"Number","Range",null,{"$f":"TRUNC(BTM_WGT)","v":{"$error":"#N/A"}},{"$f":"BOTTUBELENGTH","v":{"$error":"#N/A"}},"Number","Range"]
[null,6,3,"RD",null,6,3,"BN",null,3,"T",{"$f":"2.408*2","v":4.8159999999999998},"Triple Strength (5 mm)",null,"3S40A",{"$f":"CDIM3R40A","v":0},{"$f":"BGH3R40A+2.875","v":0.28125},{"$f":"BSW3R40A","v":0},null,1.03125,7.625,1.5369999999999999,4.375,null,"Coil Loc. From CMR",{"$f":"(($Z$3-1)*1.58)+$Z$4+$T$4+1.5","v":{"$error":"#N/A"}},null,null,"Top Bottom Rail",0,0,{"$f":"AD5*AE5","v":0},null,"Top Bottom Rail",{"$f":"(Frame_Width-3.875)/12","v":-0.32291666666666669},0.36899999999999999,-0.11915625000000001,null,null,"Balance Size",{"$f":"IF(AND(AP5>0,AQ5>0),AP5,0)","v":{"$error":"#N/A"}},{"$f":"IF($AO$4<=6,6,0)","v":6},{"$f":"IF(AND(AP5=6,$AN$4>=2,$AN$4<=5),AP5&\"A\",0)","v":{"$error":"#N/A"}},null,"Balance Size",{"$f":"IF(AND(AU5>0,AV5>0),AU5,0)","v":{"$error":"#N/A"}},{"$f":"IF($AT$4<=6,6,0)","v":6},{"$f":"IF(AND(AU5=6,$AS$4>=2,$AS$4<=5),AU5&\"A\",0)","v":{"$error":"#N/A"}},null,"Standard",null,"0100",null,{"$f":"(INT(INT(Frame_Height/2-0.25)/2)+0.5)*2","v":-1},null,"Sash Weight",null,null,null,null,null,null,null,null,null,null,null,null,null,null,null,null,null,null,null,null,null,null,null,null,null,null,null,null,null,null,null,null,null,null,null,null,null,null,null,null,null,null,null,null,null,null,null,null,null,null,null,null,"Balance Size",{"$f":"IF(AND(DG5>0,DH5>0),DG5,0)","v":{"$error":"#N/A"}},{"$f":"IF($DF$4<=8,8,0)","v":{"$error":"#N/A"}},{"$f":"IF(AND(DG5=8,$DE$4>=2,$DE$4<=6),DG5&\"A\",0)","v":{"$error":"#N/A"}},null,"Balance Size",{"$f":"IF(AND(DL5>0,DM5>0),DL5,0)","v":{"$error":"#N/A"}},{"$f":"IF($DK$4<=8,8,0)","v":{"$error":"#N/A"}},{"$f":"IF(AND(DL5=8,$DJ$4>=2,$DJ$4<=6),DL5&\"A\",0)","v":{"$error":"#N/A"}}]
[null,7,3,"RD",null,7,4,"RD",null,4,"STG",{"$f":"1.157*3","v":3.4710000000000001},"Triple IG Single Strrength",null,"8E40A",{"$f":"CDIM8R40A","v":0},{"$f":"BGH8R40A+2.875","v":-0.5625},{"$f":"BSW8R40A","v":0},{"$f":"TSW8R40A","v":0},1.03125,7.9020000000000001,2.294,4.75,null,"Sash H < 37.5",{"$f":"TRUNC((Frame_Height-$Q$4-$U$4)*16+0.5)/16","v":{"$error":"#N/A"}},null,null,"Top Stile",0,0,{"$f":"(AD6*AE6)/12","v":0},null,"Top Stile",{"$f":"(2*(DDIM8R40A-1.625))/12","v":-0.27083333333333331},0.36899999999999999,-9.9937499999999999E-2,null,null,{"$f":"VLOOKUP((MAX(AO5:AO229)),AO5:AQ229,3,FALSE)","v":{"$error":"#N/A"}},{"$error":"#N/A"},6,{"$f":"IF(AND(AP6=6,$AN$4>=6,$AN$4<=9),AP6&\"B\",0)","v":{"$error":"#N/A"}},null,{"$f":"VLOOKUP((MAX(AT5:AT229)),AT5:AV229,3,FALSE)","v":{"$error":"#N/A"}},{"$error":"#N/A"},6,{"$f":"IF(AND(AU6=6,$AS$4>=6,$AS$4<=9),AU6&\"B\",0)","v":{"$error":"#N/A"}},null,{"$f":"IF(ModelNo=Climatech_Control,\"Climatech-4\",\"Climatech\")","v":"Climatech"},null,"02A0",null,null,null,null,null,null,null,null,null,null,null,null,null,null,null,null,null,null,null,null,null,null,null,null,null,null,null,null,null,null,null,null,null,null,null,null,null,null,null,null,null,null,null,null,null,null,null,null,null,null,null,null,null,null,null,null,{"$f":"VLOOKUP((MAX(DF5:DF229)),DF5:DH229,3,FALSE)","v":{"$error":"#N/A"}},{"$error":"#N/A"},{"$f":"IF($DF$4<=8,8,0)","v":{"$error":"#N/A"}},{"$f":"IF(AND(DG6=8,$DE$4>=7,$DE$4<=10),DG6&\"B\",0)","v":{"$error":"#N/A"}},null,{"$f":"VLOOKUP((MAX(DK5:DK229)),DK5:DM229,3,FALSE)","v":{"$error":"#N/A"}},{"$error":"#N/A"},{"$f":"IF($DK$4<=8,8,0)","v":{"$error":"#N/A"}},{"$f":"IF(AND(DL6=8,$DJ$4>=7,$DJ$4<=10),DL6&\"B\",0)","v":{"$error":"#N/A"}}]
[null,8,4,"GN",null,8,4,"RD",null,5,"DTG",{"$f":"1.6*3","v":4.8000000000000007},"Triple IG Double Strength",null,"L201",{"$f":"CMR!$E$27","v":0},{"$f":"CMR!$E$27-0.5625","v":-0.5625},{"$f":"$AF$45","v":0},{"$f":"$AF$44","v":0},1.3125,7.319,1.75,4.4059999999999997,null,"Egress Height",{"$f":"IF($Z$6<(TRUNC((P4-Z5-V4)*16+0.5)/16),$Z$6,TRUNC(($P$4-$Z$5-$V$4)*16+0.5)/16)","v":{"$error":"#N/A"}},null,null,"Top Rail Reinf.",0,0,0,null,"Top Rail Reinf.",{"$f":"(TRUNC(((Frame_Width-3.875)-6)/2)*2)/12","v":-0.66666666666666663},0.26400000000000001,-0.17599999999999999,null,null,null,{"$error":"#N/A"},6,{"$f":"IF(AND(AP7=6,$AN$4>=10,$AN$4<=12),AP7&\"C\",0)","v":{"$error":"#N/A"}},null,null,{"$error":"#N/A"},6,{"$f":"IF(AND(AU7=6,$AS$4>=10,$AS$4<=12),AU7&\"C\",0)","v":{"$error":"#N/A"}},null,{"$f":"IF(ModelNo=Climatech_Control,\"Climatech-SC\",\"Climatech-2\")","v":"Climatech-2"},null,"0201",{"$f":"IF(CMR!$E$26>=Frame_Height/2-0.07,(INT(INT((Frame_Height/2-4.875)+1)/2)-0.5)*2,(INT(INT((CMR!$E$26-4.181)+1)/2)-0.5)*2)","v":-5},{"$f":"IF(Frame_Height>63.6875,IF(Frame_Height<66.3125,30,(INT(INT((Frame_Height/2-0.875)+1)/2)-0.5)*2),(INT(INT((Frame_Height/2-0.875)+1)/2)-0.5)*2)","v":-1},null,6,null,null,null,null,null,null,null,null,null,null,"2R","2R","2R","2R","2R","2R","2R","2R","2R","2R","2R",null,null,null,null,null,null,null,null,null,null,null,null,null,null,null,null,null,null,null,null,null,null,null,null,null,null,null,null,null,null,null,null,{"$error":"#N/A"},{"$f":"IF($DF$4<=8,8,0)","v":{"$error":"#N/A"}},{"$f":"IF(AND(DG7=8,$DE$4>=11,$DE$4<=13),DG7&\"C\",0)","v":{"$error":"#N/A"}},null,null,{"$error":"#N/A"},{"$f":"IF($DK$4<=8,8,0)","v":{"$error":"#N/A"}},{"$f":"IF(AND(DL7=8,$DJ$4>=11,$DJ$4<=13),DL7&\"C\",0)","v":{"$error":"#N/A"}}]
[null,9,5,"BN",null,9,5,"BU",null,6,"L",{"$f":"2.683*2","v":5.3659999999999997},"Laminated",null,"03A0",{"$f":"CMR!$E$133","v":0},{"$f":"CDIM03A0-1.125","v":-1.125},{"$f":"$AF$191","v":0},0,1.3125,7.875,1.875,5.8125,null,"Egress Width",{"$f":"Frame_Width-W4","v":{"$error":"#N/A"}},null,null,"Top Stile Reinf",0,0,0,null,"Top Stile Reinf",{"$f":"IF(TGH8R40A>26.625,((TRUNC((DDIM8R40A-10)/2)*2)/12)*2,0)","v":0},0.26400000000000001,0,null,null,"Top Tube length",{"$error":"#N/A"},6,{"$f":"IF(AND(AP8=6,$AN$4>=13,$AN$4<=15),AP8&\"D\",0)","v":{"$error":"#N/A"}},null,"Bott. Tube Length",{"$error":"#N/A"},6,{"$f":"IF(AND(AU8=6,$AS$4>=13,$AS$4<=15),AU8&\"D\",0)","v":{"$error":"#N/A"}},null,{"$f":"IF(ModelNo=Climatech_Control,\"Climatech-7\",\"Climatech Plus\")","v":"Climatech Plus"},null,"0301",{"$f":"IF(CMR!$E$42>=Frame_Height/2-0.07,(INT(INT((Frame_Height/2-4.875)+1)/2)-0.5)*2,(INT(INT((CMR!$E$42-4.181)+1)/2)-0.5)*2)","v":-5},{"$f":"IF(Frame_Height>63.6875,IF(Frame_Height<66.3125,30,(INT(INT((Frame_Height/2-0.875)+1)/2)-0.5)*2),(INT(INT((Frame_Height/2-0.875)+1)/2)-0.5)*2)","v":-1},null,7,null,null,null,null,null,null,null,null,null,"2R","2R","2R","2R","2R","2R","2R","2R","2R","2R","2R","2R","2R","2R","2R","2R","2R","2R","2R","2R","2R","2R",null,null,null,null,null,null,null,null,null,null,null,null,null,null,null,null,null,null,null,null,null,null,{"$error":"#N/A"},{"$f":"IF(AND($DF$4<=10,$DF$4>8),10,0)","v":{"$error":"#N/A"}},{"$f":"IF(AND(DG8=10,$DE$4>=2,$DE$4<=6),DG8&\"A\",0)","v":{"$error":"#N/A"}},null,null,{"$error":"#N/A"},{"$f":"IF(AND($DK$4<=10,$DK$4>8),10,0)","v":{"$error":"#N/A"}},{"$f":"IF(AND(DL8=10,$DJ$4>=2,$DJ$4<=6),DL8&\"A\",0)","v":{"$error":"#N/A"}}]
[null,10,5,"BN",null,10,5,"BU",null,7,"H",{"$f":"2.408*2","v":4.8159999999999998},"HP Package",null,"02A0",{"$f":"CMR!$L$27","v":0},{"$f":"CMR!$L$27-0.75","v":-0.75},{"$f":"$AF$67","v":0},{"$f":"$AF$66","v":0},1.3125,7.319,1.75,4.5,null,"Egress Area",{"$f":"IF(E301EH>0,ROUND(((E301EH*EW)/144),3),ROUND(((EH*EW)/144),3))","v":{"$error":"#N/A"}},null,null,"Top Glass",0,0,0,null,"Top Glass",{"$f":"(TGW8R40A*TGH8R40A)/144","v":0.1357693142361111},{"$f":"$L$12","v":3.2},0.43446180555555558,null,null,{"$f":"IF(OR(ModelNo=\"8001\",ModelNo=\"R601\"),TOPTUBELENGTH,0)","v":0},{"$error":"#N/A"},6,{"$f":"IF(AND(AP9=6,$AN$4>=16,$AN$4<=20),AP9&\"E\",0)","v":{"$error":"#N/A"}},null,{"$f":"IF(OR(ModelNo=\"8001\",ModelNo=\"R601\"),BOTTUBELENGTH,0)","v":0},{"$error":"#N/A"},6,{"$f":"IF(AND(AU9=6,$AS$4>=16,$AS$4<=20),AU9&\"E\",0)","v":{"$error":"#N/A"}},null,{"$f":"IF(ModelNo=Climatech_Control,\"Climatech-10\",IF(ModelNo=Climatech_Control1,\"Climatech TG2\",\"\"))","v":""},null,"0401",{"$f":"IF(CMR!$E$58>=Frame_Height/2-0.07,(INT(INT((Frame_Height/2-4.0625)+1)/2)-0.5)*2,(INT(INT((CMR!$E$58-4.375)+1)/2)-0.5)*2)","v":-5},{"$f":"(INT(INT((Frame_Height/2-0.0625)+1)/2)-0.5)*2","v":-1},null,8,null,null,null,null,null,null,null,"2R","2R","2R","2R","2R","2R","2R","2R","2R","2R","2R","2R","2R","2R","2R","2R","2R","2R","2R","2R","2R","3R","3R","3R",null,null,null,null,null,null,null,null,null,null,null,null,null,null,null,null,null,null,null,null,null,null,{"$error":"#N/A"},{"$f":"IF(AND($DF$4<=10,$DF$4>8),10,0)","v":{"$error":"#N/A"}},{"$f":"IF(AND(DG9=10,$DE$4>=7,$DE$4<=10),DG9&\"B\",0)","v":{"$error":"#N/A"}},null,null,{"$error":"#N/A"},{"$f":"IF(AND($DK$4<=10,$DK$4>8),10,0)","v":{"$error":"#N/A"}},{"$f":"IF(AND(DL9=10,$DJ$4>=7,$DJ$4<=10),DL9&\"B\",0)","v":{"$error":"#N/A"}}]
[null,11,6,"OR",null,11,6,"YW",null,8,"IL",{"$f":"2.683*2","v":5.3659999999999997},"Impact Laminated",null,"0301",{"$f":"CMR!$E$43","v":0},{"$f":"CMR!$E$43-0.625","v":-0.625},{"$f":"$AF$89","v":0},{"$f":"$AF$88","v":0},1.3125,7.6181200000000002,2.0590600000000001,4.375,null,null,null,null,null,"Top Spacer",0,0,0,null,"Top Spacer",{"$f":"((TGW8R40A*2)+(TGH8R40A*2))/12","v":-1.5208333333333333},5.3600000000000002E-2,-8.1516666666666668E-2,null,null,null,{"$error":"#N/A"},6,{"$f":"IF(AND(AP10=6,$AN$4>=21,$AN$4<=24),\"Dbl.\"&AP10&\"C\",0)","v":{"$error":"#N/A"}},null,null,{"$error":"#N/A"},6,{"$f":"IF(AND(AU10=6,$AS$4>=21,$AS$4<=24),\"Dbl.\"&AU10&\"C\",0)","v":{"$error":"#N/A"}},null,1,null,"0501",{"$f":"IF(CMR!$L$42>=Frame_Height/2-0.07,(INT(INT((Frame_Height/2-4.75)+1)/2)-0.5)*2,(INT(INT((CMR!$L$42-4.75)+1)/2)-0.5)*2)","v":-5},{"$f":"(INT(INT((Frame_Height/2-0.75)+1)/2)-0.5)*2","v":-1},null,9,null,null,null,null,null,"2R","2R","2R","2R","2R","2R","2R","2R","2R","2R","2R","3R","3R","3R","3R","3R","3R","3R","3R","3R","3R","3R","3R","3R","3R","3R",null,null,null,null,null,null,null,null,null,null,null,null,null,null,null,null,null,null,null,null,null,null,{"$error":"#N/A"},{"$f":"IF(AND($DF$4<=10,$DF$4>8),10,0)","v":{"$error":"#N/A"}},{"$f":"IF(AND(DG10=10,$DE$4>=11,$DE$4<=13),DG10&\"C\",0)","v":{"$error":"#N/A"}},null,null,{"$error":"#N/A"},{"$f":"IF(AND($DK$4<=10,$DK$4>8),10,0)","v":{"$error":"#N/A"}},{"$f":"IF(AND(DL10=10,$DJ$4>=11,$DJ$4<=13),DL10&\"C\",0)","v":{"$error":"#N/A"}}]
[null,12,6,"OR",null,12,6,"YW",null,null,null,null,2,null,"E301(3250)",{"$f":"CMR!$E$43","v":0},{"$f":"CMR!$E$43-0.625","v":-0.625},{"$f":"$AF$89","v":0},{"$f":"$AF$88","v":0},null,null,null,4.375,null,"E301(3250)",25.1875,null,null,"Top Hardware",0,0,0,null,"Top Hardware",1,0.2,0.2,null,null,null,{"$error":"#N/A"},6,{"$f":"IF(AND(AP11=6,$AN$4>=25,$AN$4<=30),\"Dbl.\"&AP11&\"D\",0)","v":{"$error":"#N/A"}},null,null,{"$error":"#N/A"},6,{"$f":"IF(AND(AU11=6,$AS$4>=25,$AS$4<=30),\"Dbl.\"&AU11&\"D\",0)","v":{"$error":"#N/A"}},null,"Glass Thickness",null,"0601",{"$f":"IF(CMR!$L$58>=Frame_Height/2-0.07,(INT(INT((Frame_Height/2-4.75)+1)/2)-0.5)*2,(INT(INT((CMR!$L$58-4.75)+1)/2)-0.5)*2)","v":-5},{"$f":"(INT(INT((Frame_Height/2-0.75)+1)/2)-0.5)*2","v":-1},null,10,null,null,null,null,null,"2R","2R","2R","2R","2R","2R","2R","3R","3R","3R","3R","3R","3R","3R","3R","3R","3R","3R","3R","3R","3R","3R","3R","4R","4R","4R",null,null,null,null,null,null,null,null,null,null,null,null,null,null,null,null,null,null,null,null,null,null,{"$error":"#N/A"},{"$f":"IF(AND($DF$4<=10,$DF$4>8),10,0)","v":{"$error":"#N/A"}},{"$f":"IF(AND(DG11=10,$DE$4>=14,$DE$4<=16),DG11&\"D\",0)","v":{"$error":"#N/A"}},null,null,{"$error":"#N/A"},{"$f":"IF(AND($DK$4<=10,$DK$4>8),10,0)","v":{"$error":"#N/A"}},{"$f":"IF(AND(DL11=10,$DJ$4>=14,$DJ$4<=16),DL11&\"D\",0)","v":{"$error":"#N/A"}}]
[null,13,7,"BU",null,13,7,"GN",null,null,null,{"$f":"VLOOKUP(Glass,J3:L10,3,FALSE)","v":3.2},{"$f":"VLOOKUP(Glass,J3:L10,2,FALSE)","v":"D"},null,"E301(3052)",{"$f":"CMR!$E$43","v":0},{"$f":"CMR!$E$43-0.625","v":-0.625},{"$f":"$AF$89","v":0},{"$f":"$AF$88","v":0},null,null,null,4.375,null,"E301(3052)",26.375,null,null,"Top Bead",0,0,0,null,"Top Handle Bead",{"$f":"(TGW8R40A+0.235)/12","v":-0.45437499999999997},8.8999999999999996E-2,-4.0439374999999993E-2,null,null,null,{"$error":"#N/A"},6,{"$f":"IF(AND(AP12=6,$AN$4>=31,$AN$4<=40),\"Dbl.\"&AP12&\"E\",0)","v":{"$error":"#N/A"}},null,null,{"$error":"#N/A"},6,{"$f":"IF(AND(AU12=6,$AS$4>=31,$AS$4<=40),\"Dbl.\"&AU12&\"E\",0)","v":{"$error":"#N/A"}},null,{"$f":"IF(Data!#REF!=1,\"3/4\"\"\",IF(Data!#REF!=4,\"7/8\"\"\",IF(Data!#REF!=5,\"1\"\"\",\"13/16\"\"\")))","v":{"$error":"#REF!"}},null,"0700",null,{"$f":"(INT(INT(Frame_Height/2-0.25)/2)+0.5)*2","v":-1},null,11,null,null,null,null,null,"2R","2R","2R","2R","2R","3R","3R","3R","3R","3R","3R","3R","3R","3R","4R","4R","3R","3R","4R","4R","4R","4R","4R","4R","4R","4R",null,null,null,null,null,null,null,null,null,null,null,null,null,null,null,null,null,null,null,null,null,null,{"$error":"#N/A"},{"$f":"IF(AND($DF$4<=12,$DF$4>10),12,0)","v":{"$error":"#N/A"}},{"$f":"IF(AND(DG12=12,$DE$4>=3,$DE$4<=7),DG12&\"A\",0)","v":{"$error":"#N/A"}},null,null,{"$error":"#N/A"},{"$f":"IF(AND($DK$4<=12,$DK$4>10),12,0)","v":{"$error":"#N/A"}},{"$f":"IF(AND(DL12=12,$DJ$4>=3,$DJ$4<=7),DL12&\"A\",0)","v":{"$error":"#N/A"}}]
[null,14,7,"BU",null,14,7,"GN",null,null,null,null,null,null,"E301(2862)",{"$f":"CMR!$E$43","v":0},{"$f":"CMR!$E$43-0.625","v":-0.625},{"$f":"$AF$89","v":0},{"$f":"$AF$88","v":0},null,null,null,4.375,null,"E301(2862)",32.3125,null,null,"Bottom Top Rail",{"$f":"(Frame_Width-2.75)/12","v":-0.22916666666666666},0.47299999999999998,{"$f":"AD13*AE13","v":-0.10839583333333333},null,"Top Bead",{"$f":"((TGW8R40A+0.235)+((TGH8R40A-0.875)*2))/12","v":-1.173125},6.5000000000000002E-2,-7.6253125000000005E-2,null,null,null,{"$error":"#N/A"},{"$f":"IF(AND($AO$4<=8,$AO$4>6),8,0)","v":0},{"$f":"IF(AND(AP13=8,$AN$4>=2,$AN$4<=6),AP13&\"A\",0)","v":{"$error":"#N/A"}},null,null,{"$error":"#N/A"},{"$f":"IF(AND($AT$4<=8,$AT$4>6),8,0)","v":0},{"$f":"IF(AND(AU13=8,$AS$4>=2,$AS$4<=6),AU13&\"A\",0)","v":{"$error":"#N/A"}},null,{"$f":"IF(Data!#REF!=1,\"13/16\"\"\",IF(Data!#REF!=3,\"1\"\"\",\"\"))","v":{"$error":"#REF!"}},null,"01HP",null,{"$f":"(INT(INT(Frame_Height/2-0.25)/2)+0.5)*2","v":-1},null,12,null,null,null,null,null,"2R","2R","2R","2R","3R","3R","3R","3R","4R","4R","4R","4R","4R","4R","4R","4R","3R","4R","4R","4R","5R","5R","5R","5R","5R","5R","4R","4R","4R","4R","4R","4R","5R","5R","5R","5R","5R","5R","5R",null,null,null,null,null,null,null,null,null,{"$error":"#N/A"},{"$f":"IF(AND($DF$4<=12,$DF$4>10),12,0)","v":{"$error":"#N/A"}},{"$f":"IF(AND(DG13=12,$DE$4>=8,$DE$4<=10),DG13&\"B\",0)","v":{"$error":"#N/A"}},null,null,{"$error":"#N/A"},{"$f":"IF(AND($DK$4<=12,$DK$4>10),12,0)","v":{"$error":"#N/A"}},{"$f":"IF(AND(DL13=12,$DJ$4>=8,$DJ$4<=10),DL13&\"B\",0)","v":{"$error":"#N/A"}}]
[null,15,8,"BK",null,15,8,"LG",null,null,null,null,"Extrusion",null,"0401",{"$f":"CMR!$E$59","v":-2.875},{"$f":"CMR!$E$59","v":-2.875},{"$f":"$AF$111","v":0},{"$f":"$AF$110","v":0},0.6875,7.5708700000000002,2.0078800000000001,4.375,null,null,{"$f":"IF(OR(ModelNo=\"E301(3250)\",ModelNo=\"E301(3052)\",ModelNo=\"E301(2862)\"),VLOOKUP(ModelNo,$Y$11:$Z$13,2,FALSE),0)","v":0},null,null,"Bottom Bottom Rail",{"$f":"(Frame_Width-2.75)/12","v":-0.22916666666666666},0.437,-0.10014583333333332,null,"Bottom Top Rail",{"$f":"(BGW8R40A+2.875)/12","v":-0.234375},0.47299999999999998,{"$f":"AI14*AJ14","v":-0.110859375},null,null,null,{"$error":"#N/A"},0,{"$f":"IF(AND(AP14=8,$AN$4>=7,$AN$4<=10),AP14&\"B\",0)","v":{"$error":"#N/A"}},null,null,{"$error":"#N/A"},0,{"$f":"IF(AND(AU14=8,$AS$4>=7,$AS$4<=10),AU14&\"B\",0)","v":{"$error":"#N/A"}},null,1,null,"07HP",null,{"$f":"(INT(INT(Frame_Height/2-0.25)/2)+0.5)*2","v":-1},null,13,null,null,null,null,null,"2R","2R","2R","2R","3R","3R","3R","3R","4R","4R","4R","4R","4R","4R","5R","5R","4R","4R","4R","5R","5R","5R","5R","5R","5R","5R","4R","4R","4R","4R","4R","5R","5R","5R","5R","5R","5R","5R","5R",null,null,null,null,null,null,null,null,null,{"$error":"#N/A"},{"$f":"IF(AND($DF$4<=12,$DF$4>10),12,0)","v":{"$error":"#N/A"}},{"$f":"IF(AND(DG14=12,$DE$4>=11,$DE$4<=16),DG14&\"C\",0)","v":{"$error":"#N/A"}},null,null,{"$error":"#N/A"},{"$f":"IF(AND($DK$4<=12,$DK$4>10),12,0)","v":{"$error":"#N/A"}},{"$f":"IF(AND(DL14=12,$DJ$4>=11,$DJ$4<=16),DL14&\"C\",0)","v":{"$error":"#N/A"}}]
[null,16,8,"BK",null,16,8,"LG",null,null,null,1,{"$f":"IF(EXT_1=0,\"\",EXT_1)","v":""},null,"0501",{"$f":"CMR!$L$43","v":0},{"$f":"CMR!$L$43-1.3125","v":-1.3125},{"$f":"$AF$135","v":0},{"$f":"$AF$134","v":0},1.875,9.0139999999999993,2.9550000000000001,5.375,null,null,null,null,null,"Bottom Stile",{"$f":"((CDIM3R40A+0.25)*2)/12","v":4.1666666666666664E-2},0.437,1.8208333333333333E-2,null,"Bottom Bottom Rail",{"$f":"(BGW8R40A+2.875)/12","v":-0.234375},0.437,-0.102421875,null,null,null,{"$error":"#N/A"},0,{"$f":"IF(AND(AP15=8,$AN$4>=11,$AN$4<=13),AP15&\"C\",0)","v":{"$error":"#N/A"}},null,null,{"$error":"#N/A"},0,{"$f":"IF(AND(AU15=8,$AS$4>=11,$AS$4<=13),AU15&\"C\",0)","v":{"$error":"#N/A"}},null,null,null,"0901",{"$f":"IF(CMR!$E$74>=Frame_Height/2-0.07,(INT(INT((Frame_Height/2-3.625)+1)/2)-0.5)*2,(INT(INT((CMR!$E$74-3.625)+1)/2)-0.5)*2)","v":-5},{"$f":"(INT(INT((Frame_Height/2-0.625)+1)/2)-0.5)*2","v":-1},null,14,null,null,null,null,null,"2R","2R","2R","2R","3R","3R","3R","4R","4R","4R","4R","4R","5R","5R","5R","5R","4R","4R","5R","5R","5R","6R","6R","6R","6R","6R","4R","5R","5R","5R","5R","5R","5R","5R","5R","5R","6R","6R","6R","6R","6R",null,null,null,null,null,null,null,{"$error":"#N/A"},{"$f":"IF(AND($DF$4<=12,$DF$4>10),12,0)","v":{"$error":"#N/A"}},{"$f":"IF(AND(DG15=12,$DE$4>=17,$DE$4<=18),DG15&\"D\",0)","v":{"$error":"#N/A"}},null,null,{"$error":"#N/A"},{"$f":"IF(AND($DK$4<=12,$DK$4>10),12,0)","v":{"$error":"#N/A"}},{"$f":"IF(AND(DL15=12,$DJ$4>=17,$DJ$4<=18),DL15&\"D\",0)","v":{"$error":"#N/A"}}]
[null,17,9,"WT",null,17,9,"NAT",null,null,null,2,{"$f":"IF(EXT_2=0,\"\",EXT_2)","v":""},null,"B501",{"$f":"CMR!$L$43","v":0},{"$f":"CMR!$L$43-1.3125","v":-1.3125},{"$f":"$AF$135","v":0},{"$f":"$AF$134","v":0},1.875,9.0139999999999993,2.9550000000000001,5.375,null,"V100",{"$f":"Frame_Height-(CMR!$L$99-0.844)-3.64625","v":-2.8022500000000004},null,null,"Bottom Rail Reinf.",{"$f":"(TRUNC(((AD13*12)-6)/2)*2)/12","v":-0.66666666666666663},0.43440000000000001,-0.28959999999999997,null,"Bottom Stile",{"$f":"(2*(BGH8R40A+2.875))/12","v":-9.375E-2},0.437,-4.0968749999999998E-2,null,null,null,{"$error":"#N/A"},0,{"$f":"IF(AND(AP16=8,$AN$4>=14,$AN$4<=15),AP16&\"D\",0)","v":{"$error":"#N/A"}},null,null,{"$error":"#N/A"},0,{"$f":"IF(AND(AU16=8,$AS$4>=14,$AS$4<=15),AU16&\"D\",0)","v":{"$error":"#N/A"}},null,null,null,"09A1",{"$f":"IF(CMR!$E$74>=Frame_Height/2-0.07,(INT(INT((Frame_Height/2-3.625)+1)/2)-0.5)*2,(INT(INT((CMR!$E$74-3.625)+1)/2)-0.5)*2)","v":-5},{"$f":"(INT(INT((Frame_Height/2-0.625)+1)/2)-0.5)*2","v":-1},null,15,null,null,null,null,null,"2R","2R","2R","2R","3R","4R","4R","4R","5R","5R","5R","5R","5R","5R","6R","6R","5R","5R","5R","6R","6R","6R","6R","6R","6R","6R","4R","5R","5R","5R","5R","5R","5R","5R","5R","6R","6R","6R","6R","6R","6R",null,null,null,null,null,null,null,{"$error":"#N/A"},{"$f":"IF(AND($DF$4<=12,$DF$4>10),12,0)","v":{"$error":"#N/A"}},{"$f":"IF(AND(DG16=12,$DE$4>=19,$DE$4<=21),DG16&\"E\",0)","v":{"$error":"#N/A"}},null,null,{"$error":"#N/A"},{"$f":"IF(AND($DK$4<=12,$DK$4>10),12,0)","v":{"$error":"#N/A"}},{"$f":"IF(AND(DL16=12,$DJ$4>=19,$DJ$4<=21),DL16&\"E\",0)","v":{"$error":"#N/A"}}]
[null,18,9,"WT",null,18,9,"NAT",null,null,null,3,{"$f":"IF(EXT_3=0,\"\",EXT_3)","v":""},null,"U501",{"$f":"CMR!$L$43","v":0},{"$f":"CMR!$L$43-1.3125","v":-1.3125},{"$f":"$AF$135","v":0},{"$f":"$AF$134","v":0},1.875,9.0139999999999993,2.9550000000000001,5.375,null,"V101",{"$f":"Frame_Height-(CMR!$L$115-0.3125)-4.948","v":-4.6355000000000004},null,null,"Bottom Stile Reinf.",{"$f":"IF(OR(CMR!$E$16>=28.5,ModelNo=\"01HP\",ModelNo=\"07HP\",ModelNo=\"S140 (HP)\",ModelNo=\"S144 (HP)\",ModelNo=\"S146 (HP)\"),(((CMR!$E$11-1.625)/2)*2)/12,0)","v":0},null,0,null,"Bottom Rail Reinf.",{"$f":"(TRUNC(((Frame_Width-2.875)-6)/2)*2)/12","v":-0.66666666666666663},0.43440000000000001,-0.28959999999999997,null,null,null,{"$error":"#N/A"},0,{"$f":"IF(AND(AP17=8,$AN$4>=16,$AN$4<=18),AP17&\"E\",0)","v":{"$error":"#N/A"}},null,null,{"$error":"#N/A"},0,{"$f":"IF(AND(AU17=8,$AS$4>=16,$AS$4<=18),AU17&\"E\",0)","v":{"$error":"#N/A"}},null,null,null,"09B1",{"$f":"IF(CMR!$E$74>=Frame_Height/2-0.07,(INT(INT((Frame_Height/2-3.625)+1)/2)-0.5)*2,(INT(INT((CMR!$E$74-3.625)+1)/2)-0.5)*2)","v":-5},{"$f":"(INT(INT((Frame_Height/2-0.625)+1)/2)-0.5)*2","v":-1},null,16,null,null,null,null,null,"2R","2R","2R","2R","3R","4R","4R","4R","5R","5R","5R","5R","6R","6R","6R","6R","5R","5R","6R","6R","6R","6R","7R","7R","7R","7R","5R","5R","5R","5R","5R","6R","6R","6R","6R","6R","7R","7R","7R","7R","7R","7R","7R",null,null,null,null,null,{"$error":"#N/A"},{"$f":"IF(AND($DF$4<=14,$DF$4>12),14,0)","v":{"$error":"#N/A"}},{"$f":"IF(AND(DG17=14,$DE$4>=3,$DE$4<=7),DG17&\"A\",0)","v":{"$error":"#N/A"}},null,null,{"$error":"#N/A"},{"$f":"IF(AND($DK$4<=14,$DK$4>12),14,0)","v":{"$error":"#N/A"}},{"$f":"IF(AND(DL17=14,$DJ$4>=3,$DJ$4<=7),DL17&\"A\",0)","v":{"$error":"#N/A"}}]
[null,19,10,"PK",null,19,10,"PK",null,null,null,4,{"$f":"IF(EXT_4=0,\"\",EXT_4)","v":""},null,"0601",{"$f":"CMR!$L$59","v":-2.875},{"$f":"CMR!$L$59-0.9375","v":-3.8125},{"$f":"$AK$25","v":0},{"$f":"$AK$24","v":0},1.875,8.75,2.6890000000000001,5.375,null,"V200",{"$f":"Frame_Height-(TRUNC(((CMR!$L$124-0.8125)*32+0.5))/32-0.0625)-4.047","v":-3.2032499999999997},null,null,"Bottom Glass",{"$f":"(BGW3R40A*BGH3R40A)/144","v":0.1001925998263889},{"$f":"$L$12","v":3.2},{"$f":"IF(AND(Frame_Width=35.5,Frame_Height=59.5),($AD$18*$AE$18)-2.25,$AD$18*$AE$18)","v":0.32061631944444446},"*","Bottom Stile Reinf.",{"$f":"IF(CMR!$L$64>26.1875,((TRUNC((CMR!$L$59-4)/2)*2)/12)*2,0)","v":0},null,0,null,null,null,{"$error":"#N/A"},0,{"$f":"IF(AND(AP18=8,$AN$4>=19,$AN$4<=20),\"Dbl.\"&AP18&\"B\",0)","v":{"$error":"#N/A"}},null,null,{"$error":"#N/A"},0,{"$f":"IF(AND(AU18=8,$AS$4>=19,$AS$4<=20),\"Dbl.\"&AU18&\"B\",0)","v":{"$error":"#N/A"}},null,null,null,"B501",{"$f":"IF(CMR!$L$42>=Frame_Height/2-0.07,(INT(INT((Frame_Height/2-4.75)+1)/2)-0.5)*2,(INT(INT((CMR!$L$42-4.75)+1)/2)-0.5)*2)","v":-5},{"$f":"(INT(INT((Frame_Height/2-0.75)+1)/2)-0.5)*2","v":-1},null,17,null,null,null,null,null,"2R","3R","3R","3R","4R","4R","4R","5R","5R","5R","5R","6R","6R","6R","7R","7R","5R","6R","6R","7R","7R","7R","7R","7R","7R","7R","5R","5R","6R","6R","6R","6R","6R","6R","6R","7R","7R","7R","7R","7R","7R","7R","7R",null,null,null,null,null,{"$error":"#N/A"},{"$error":"#N/A"},{"$f":"IF(AND(DG18=14,$DE$4>=8,$DE$4<=10),DG18&\"B\",0)","v":{"$error":"#N/A"}},null,null,{"$error":"#N/A"},{"$error":"#N/A"},{"$f":"IF(AND(DL18=14,$DJ$4>=8,$DJ$4<=10),DL18&\"B\",0)","v":{"$error":"#N/A"}}]
[null,20,10,"PK",null,20,10,"PK",null,null,null,5,{"$f":"IF(EXT_5=0,\"\",EXT_5)","v":""},null,"B601",{"$f":"CMR!$L$59","v":-2.875},{"$f":"CMR!$L$59-0.9375","v":-3.8125},{"$f":"$AK$25","v":0},{"$f":"$AK$24","v":0},1.875,8.75,2.6890000000000001,5.375,null,null,{"$f":"IF(OR(ModelNo=\"V100\",ModelNo=\"V101\",ModelNo=\"V200\"),VLOOKUP(ModelNo,$Y$16:$Z$18,2,FALSE),0)","v":0},null,null,"Bottom Spacer",{"$f":"((BGW3R40A*2)+(BGH3R40A*2))/12","v":-1.359375},5.3600000000000002E-2,-7.2862499999999997E-2,null,"Bottom Glass",{"$f":"(BGW8R40A*BGH8R40A)/144","v":0.1357693142361111},{"$f":"$L$12","v":3.2},0.43446180555555558,null,null,null,{"$error":"#N/A"},0,{"$f":"IF(AND(AP19=8,$AN$4>=21,$AN$4<=26),\"Dbl.\"&AP19&\"C\",0)","v":{"$error":"#N/A"}},null,null,{"$error":"#N/A"},0,{"$f":"IF(AND(AU19=8,$AS$4>=21,$AS$4<=26),\"Dbl.\"&AU19&\"C\",0)","v":{"$error":"#N/A"}},null,null,null,"U501",{"$f":"IF(CMR!$L$42>=Frame_Height/2-0.07,(INT(INT((Frame_Height/2-4.75)+1)/2)-0.5)*2,(INT(INT((CMR!$L$42-4.75)+1)/2)-0.5)*2)","v":-5},{"$f":"(INT(INT((Frame_Height/2-0.75)+1)/2)-0.5)*2","v":-1},null,18,null,null,null,null,null,"3R","3R","3R","3R","4R","5R","5R","5R","5R","5R","5R","6R","7R","7R","7R","7R","6R","6R","7R","7R","7R","7R","8R","8R","8R","8R","6R","6R","6R","6R","6R","7R","7R","7R","7R","7R","8R","8R","8R","8R","8R","8R","8R","8R","8R",null,null,null,{"$error":"#N/A"},{"$error":"#N/A"},{"$f":"IF(AND(DG19=14,$DE$4>=11,$DE$4<=16),DG19&\"C\",0)","v":{"$error":"#N/A"}},null,null,{"$error":"#N/A"},{"$error":"#N/A"},{"$f":"IF(AND(DL19=14,$DJ$4>=11,$DJ$4<=16),DL19&\"C\",0)","v":{"$error":"#N/A"}}]
[null,21,10,"PK",null,21,56,"BU",null,null,null,null,1,{"$f":"VLOOKUP(EXTSELECT,L15:M19,2,FALSE)","v":""},"U601",{"$f":"CMR!$L$59","v":-2.875},{"$f":"CMR!$L$59-0.9375","v":-3.8125},{"$f":"$AK$25","v":0},{"$f":"$AK$24","v":0},1.875,8.75,2.6890000000000001,5.375,null,null,{"$f":"IF(VEH>0,ROUND(((VEH*EW)/144),3))","v":false},null,null,"Bottom Hardware",1,0.36,0.36,null,"Bottom Spacer",{"$f":"((BGW8R40A*2)+(BGH8R40A*2))/12","v":-1.5208333333333333},5.3600000000000002E-2,-8.1516666666666668E-2,null,null,null,{"$error":"#N/A"},0,{"$f":"IF(AND(AP20=8,$AN$4>=27,$AN$4<=32),\"Dbl.\"&AP20&\"D\",0)","v":{"$error":"#N/A"}},null,null,{"$error":"#N/A"},0,{"$f":"IF(AND(AU20=8,$AS$4>=27,$AS$4<=32),\"Dbl.\"&AU20&\"D\",0)","v":{"$error":"#N/A"}},null,null,null,"B601",{"$f":"IF(CMR!$L$58>=Frame_Height/2-0.07,(INT(INT((Frame_Height/2-4.75)+1)/2)-0.5)*2,(INT(INT((CMR!$L$58-4.75)+1)/2)-0.5)*2)","v":-5},{"$f":"(INT(INT((Frame_Height/2-0.75)+1)/2)-0.5)*2","v":-1},null,19,null,null,null,null,null,"2B","3R","3R","3R","4R","2B","2B","3B","3B","3B","6R","7R","7R","7R","7R","7R","6R","7R","7R","8R","8R","8R","8R","8R","8R","8R","6R","6R","7R","7R","7R","7R","7R","8R","8R","8R","8R","8R","8R","8R","8R","8R","8R","8R","8R",null,null,null,{"$error":"#N/A"},{"$error":"#N/A"},{"$f":"IF(AND(DG20=14,$DE$4>=17,$DE$4<=19),DG20&\"D\",0)","v":{"$error":"#N/A"}},null,null,{"$error":"#N/A"},{"$error":"#N/A"},{"$f":"IF(AND(DL20=14,$DJ$4>=17,$DJ$4<=19),DL20&\"D\",0)","v":{"$error":"#N/A"}}]
[null,22,"8/4","BU",null,22,56,"BU",null,null,null,null,{"$f":"IF($M$20=1,0,IF($M$20=5,1.75,IF($M$20=2,2.40625,1)))","v":0},null,"0700",{"$f":"CMR!$E$11","v":0},{"$f":"CMR!$E$11+0.125","v":0.125},{"$f":"$AF$23","v":0},{"$f":"$AF$22","v":0},1.03125,3.0739999999999998,1.5369999999999999,3.0625,null,null,null,null,null,"Bottom Bead",{"$f":"(((BGW3R40A+0.235)*2)+((BGH3R40A-0.875)*2))/12","v":-1.4660416666666667},6.5000000000000002E-2,-9.5292708333333337E-2,null,"Bottom Hardware",1,0.36,0.36,null,null,null,{"$error":"#N/A"},0,{"$f":"IF(AND(AP21=8,$AN$4>=33,$AN$4<=36),\"Dbl.\"&AP21&\"E\",0)","v":{"$error":"#N/A"}},null,null,{"$error":"#N/A"},0,{"$f":"IF(AND(AU21=8,$AS$4>=33,$AS$4<=36),\"Dbl.\"&AU21&\"E\",0)","v":{"$error":"#N/A"}},null,null,null,"U601",{"$f":"IF(CMR!$L$58>=Frame_Height/2-0.07,(INT(INT((Frame_Height/2-4.75)+1)/2)-0.5)*2,(INT(INT((CMR!$L$58-4.75)+1)/2)-0.5)*2)","v":-5},{"$f":"(INT(INT((Frame_Height/2-0.75)+1)/2)-0.5)*2","v":-1},null,20,null,null,null,null,null,"3B","3B","3B","3B","3B","3B","3B","3B","4B","4B","4B","5B","5B","6B","7B","7B","7R","7R","8R","8R","8R","8R","8R","9R","9R","9R","7R","7R","7R","7R","7R","8R","8R","8R","8R","8R","9R","9R","9R","9R","9R","9R","9R","9R","9R",null,null,null,{"$error":"#N/A"},{"$error":"#N/A"},{"$f":"IF(AND(DG21=14,$DE$4>=20,$DE$4<=22),DG21&\"E\",0)","v":{"$error":"#N/A"}},null,null,{"$error":"#N/A"},{"$error":"#N/A"},{"$f":"IF(AND(DL21=14,$DJ$4>=20,$DJ$4<=22),DL21&\"E\",0)","v":{"$error":"#N/A"}}]
[null,23,"8/4","BU",null,23,66,"YW",null,null,null,null,{"$f":"IF(AND(EXTSELECT=1,OR(SELECTEXT=\"Select Reinforcement\",SELECTEXT=\"Select Extrusion\")),\"<< Must Select\",\"\")","v":""},null,"07HP",{"$f":"CMR!$L$11","v":0},{"$f":"CMR!$L$11+0.125","v":0.125},{"$f":"$AF$23","v":0},{"$f":"$AF$22","v":0},1.03125,3.1680000000000001,1.631,3.0625,null,null,null,null,null,null,null,"Top Sash",0,null,"Bottom Keeper Bead",{"$f":"(BGW8R40A-0.235)/12","v":-0.49354166666666671},0.109,-5.3796041666666669E-2,null,null,null,{"$error":"#N/A"},{"$f":"IF(AND($AO$4<=10,$AO$4>8),10,0)","v":0},{"$f":"IF(AND(AP22=10,$AN$4>=1,$AN$4<=6),AP22&\"A\",0)","v":{"$error":"#N/A"}},null,null,{"$error":"#N/A"},{"$f":"IF(AND($AT$4<=10,$AT$4>8),10,0)","v":0},{"$f":"IF(AND(AU22=10,$AS$4>=1,$AS$4<=6),AU22&\"A\",0)","v":{"$error":"#N/A"}},null,null,null,"R601",{"$f":"IF(CMR!$L$74>=Frame_Height/2-0.07,(INT(INT((Frame_Height/2-4.75)+0.25)/2))*2,(INT(INT((CMR!$L$74-4.75)+0.25)/2))*2)","v":-6},{"$f":"(INT(INT((Frame_Height/2-2.75)+0.25)/2)*2)","v":-4},null,21,null,null,null,null,null,"3B","3B","3B","3B","3B","3B","3B","4B","5B","5B","5B","5B","5B","7B","7B","7B","8R","8R","8R","9R","9R","9R","9R","9R","9R","10R","7R","7R","8R","8R","8R","8R","8R","9R","9R","9R","9R","9R","9R","9R","9R","9R","9R","9R","9R",null,null,null,{"$error":"#N/A"},{"$error":"#N/A"},{"$f":"IF(AND(DG22=14,$DE$4>=23,$DE$4<=25),DG22&\"F\",0)","v":{"$error":"#N/A"}},null,null,{"$error":"#N/A"},{"$error":"#N/A"},{"$f":"IF(AND(DL22=14,$DJ$4>=23,$DJ$4<=25),DL22&\"F\",0)","v":{"$error":"#N/A"}}]
[null,24,"8/4","BU",null,24,66,"YW",null,null,null,null,{"$f":"IF(AND(EXT_CONTROL=0,W>0,H>0,LEG>0),\"<< Not a Valid Entry\",IF(AND(EXT_CONTROL=1,W>0,H>0,LEG=0),\"<< Need Leg Height\",IF(AND(OR(ModelNo=\"S140\",ModelNo=\"S140 (HP)\"),W>0,H>0,LEG<>(Frame_Height-(Frame_Width/2))),\"<< Leg Should be\"&\" \"&(Frame_Height-(Frame_Width/2)),\"\")))","v":""},null,"0901",{"$f":"CMR!$E$75","v":0},{"$f":"CMR!$E$75-0.6875","v":-0.6875},{"$f":"$AK$49","v":0},{"$f":"$AK$48","v":0},0.9375,7.9269999999999996,2.125,4.0625,null,null,null,null,null,null,null,"Bottom Sash",{"$f":"IF(ModelNo=\"3S40A\",TRUNC(SUM(AF13:AF21)),0)","v":0},null,"Bottom Bead",{"$f":"((BGW8R40A+0.235)+((BGH8R40A+0.875)*2))/12","v":-0.88145833333333334},7.3999999999999996E-2,-6.5227916666666663E-2,null,null,null,{"$error":"#N/A"},0,{"$f":"IF(AND(AP23=10,$AN$4>=7,$AN$4<=10),AP23&\"B\",0)","v":{"$error":"#N/A"}},null,null,{"$error":"#N/A"},0,{"$f":"IF(AND(AU23=10,$AS$4>=7,$AS$4<=10),AU23&\"B\",0)","v":{"$error":"#N/A"}},null,null,null,"8001",{"$f":"IF(CMR!$L$74>=Frame_Height/2-0.07,(INT(INT((Frame_Height/2-4.75)+0.25)/2))*2,(INT(INT((CMR!$L$74-4.75)+0.25)/2))*2)","v":-6},{"$f":"(INT(INT((Frame_Height/2-2.75)+0.25)/2)*2)","v":-4},null,22,null,null,null,null,null,"3B","3B","3B","3B","4B","4B","4B","4B","5B","5B","5B","5B","5B","7B","8B","8B","9R","9R","9R","9R","9R","9R","9R","10R","10R","10R","8R","8R","8R","8R","8R","9R","9R","9R","9R","9R","10R","10R","10R","10R","10R","10R","10R","10R","10R",null,null,null,{"$error":"#N/A"},{"$f":"IF(AND($DF$4<=16,$DF$4>14),16,0)","v":{"$error":"#N/A"}},{"$f":"IF(AND(DG23=16,$DE$4>=3,$DE$4<=7),DG23&\"A\",0)","v":{"$error":"#N/A"}},null,null,{"$error":"#N/A"},{"$f":"IF(AND($DK$4<=16,$DK$4>14),16,0)","v":{"$error":"#N/A"}},{"$f":"IF(AND(DL23=16,$DJ$4>=3,$DJ$4<=7),DL23&\"A\",0)","v":{"$error":"#N/A"}}]
[null,25,"8/4","BU",null,25,67,"GN",null,null,null,null,"Type",null,"09A1",{"$f":"CMR!$E$75","v":0},{"$f":"CMR!$E$75-0.6875","v":-0.6875},{"$f":"$AK$49","v":0},{"$f":"$AK$48","v":0},0.9375,7.9269999999999996,2.125,4.0625,null,null,null,null,null,null,null,null,null,null,null,null,"Top Sash",{"$f":"IF(ModelNo=\"8E40A\",TRUNC(SUM(AK4:AK13))+5,0)","v":0},null,null,null,{"$error":"#N/A"},0,{"$f":"IF(AND(AP24=10,$AN$4>=11,$AN$4<=13),AP24&\"C\",0)","v":{"$error":"#N/A"}},null,null,{"$error":"#N/A"},0,{"$f":"IF(AND(AU24=10,$AS$4>=11,$AS$4<=13),AU24&\"C\",0)","v":{"$error":"#N/A"}},null,null,null,"V100",null,{"$f":"FLOOR(Frame_Height/2-2,2)","v":-2},null,23,null,null,null,null,null,"3B","3B","3B","3B","4B","4B","5B","5B","5B","5B","5B","6B","6B","7B","8B","8B","9R","9R","9R","10R","10R","10R","10R","10R","11R","11R","8R","8R","8R","9R","9R","9R","9R","9R","9R","10R","10R","10R","10R","10R","10R","10R","10R","10R","11R",null,null,null,{"$error":"#N/A"},{"$error":"#N/A"},{"$f":"IF(AND(DG24=16,$DE$4>=8,$DE$4<=10),DG24&\"B\",0)","v":{"$error":"#N/A"}},null,null,{"$error":"#N/A"},{"$error":"#N/A"},{"$f":"IF(AND(DL24=16,$DJ$4>=8,$DJ$4<=10),DL24&\"B\",0)","v":{"$error":"#N/A"}}]
[null,26,"8/6","BN",null,26,67,"GN",null,null,null,1,{"$f":"IF(TYPE1>\"\",TYPE1,\"\")","v":""},null,"09B1",{"$f":"CMR!$E$75","v":0},{"$f":"CMR!$E$75-0.6875","v":-0.6875},{"$f":"$AK$49","v":0},{"$f":"$AK$48","v":0},0.9375,7.9269999999999996,2.125,4.0625,null,null,null,null,null,"0201","Length","Weight/ft","Weight",null,null,null,"Bottom Sash",{"$f":"IF(ModelNo=\"8E40A\",TRUNC(SUM(AK14:AK23)),0)","v":0},null,null,null,{"$error":"#N/A"},0,{"$f":"IF(AND(AP25=10,$AN$4>=14,$AN$4<=16),AP25&\"D\",0)","v":{"$error":"#N/A"}},null,null,{"$error":"#N/A"},0,{"$f":"IF(AND(AU25=10,$AS$4>=14,$AS$4<=16),AU25&\"D\",0)","v":{"$error":"#N/A"}},null,null,null,"V101",{"$f":"IF(CMR!$L$115>=Frame_Height/2-0.07,(INT(INT((Frame_Height/2-4.75))/2))*2,(INT(INT((CMR!$L$115-4.75))/2))*2)","v":-6},{"$f":"(INT(INT((Frame_Height/2-2.75)+0.25)/2)*2)","v":-4},null,24,null,null,null,null,null,"4B","4B","4B","4B","4B","4B","5B","5B","5B","5B","5B","6B","6B","8R","9B","9B","10R","10R","10R","11R","11R","11R","11R","11R","12R","12R","8R","8R","9R","9R","9R","9R","10R","10R","10R","10R","11R","11R","11R","11R","11R","11R","11R","11R","12R",null,null,null,{"$error":"#N/A"},{"$error":"#N/A"},{"$f":"IF(AND(DG25=16,$DE$4>=11,$DE$4<=16),DG25&\"C\",0)","v":{"$error":"#N/A"}},null,null,{"$error":"#N/A"},{"$error":"#N/A"},{"$f":"IF(AND(DL25=16,$DJ$4>=11,$DJ$4<=16),DL25&\"C\",0)","v":{"$error":"#N/A"}}]
[null,27,"8/6","BN",null,27,77,"LG",null,null,null,2,{"$f":"IF(TYPE2>\"\",TYPE2,\"\")","v":""},null,"09L1",{"$f":"CMR!$E$75","v":0},{"$f":"CMR!$E$75-0.6875","v":-0.6875},{"$f":"$AK$49","v":0},{"$f":"$AK$48","v":0},0.9375,7.9269999999999996,2.125,4.0625,null,null,null,null,null,"Top Top Rail",{"$f":"(Frame_Width-3.25)/12","v":-0.27083333333333331},0.25700000000000001,{"$f":"AD26*AE26","v":-6.9604166666666661E-2},null,null,null,null,null,null,null,null,{"$error":"#N/A"},0,{"$f":"IF(AND(AP26=10,$AN$4>=17,$AN$4<=19),AP26&\"E\",0)","v":{"$error":"#N/A"}},null,null,{"$error":"#N/A"},0,{"$f":"IF(AND(AU26=10,$AS$4>=17,$AS$4<=19),AU26&\"E\",0)","v":{"$error":"#N/A"}},null,null,null,"V200",null,{"$f":"FLOOR(Frame_Height/2-2,2)","v":-2},null,25,null,null,null,null,null,null,"4B","4B","4B","4B","4B","5B","6B","6B","6B","6B","6B","6B","8B","9B","9B","10R","10R","11R","11R","11R","11R","11R","11R","12R","12R","9R","9R","9R","9R","9R","10R","10R","10R","10R","11R","11R","11R","11R","11R","11R","11R","11R","12R","13R",null,null,null,{"$error":"#N/A"},{"$error":"#N/A"},{"$f":"IF(AND(DG26=16,$DE$4>=17,$DE$4<=19),DG26&\"D\",0)","v":{"$error":"#N/A"}},null,null,{"$error":"#N/A"},{"$error":"#N/A"},{"$f":"IF(AND(DL26=16,$DJ$4>=17,$DJ$4<=19),DL26&\"D\",0)","v":{"$error":"#N/A"}}]
[null,28,"8/6","BN",null,28,77,"LG",null,null,null,null,{"$f":"IF(TYPE3>\"\",TYPE3,\"\")","v":""},null,"i201",{"$f":"CMR!$E$27","v":0},{"$f":"CMR!$E$27-0.5625","v":-0.5625},{"$f":"$AK$144","v":0},{"$f":"$AK$143","v":0},1.25,7.3125,1.75,4.4059999999999997,null,null,null,null,null,"Top Bottom Rail",{"$f":"(Frame_Width-3.25)/12","v":-0.27083333333333331},0.27300000000000002,-7.3937500000000003E-2,null,"0901","Length","Weight/ft","Weight",null,null,null,{"$error":"#N/A"},0,{"$f":"IF(AND(AP27=10,$AN$4=20),\"Dbl.\"&AP27&\"B\",0)","v":{"$error":"#N/A"}},null,null,{"$error":"#N/A"},0,{"$f":"IF(AND(AU27=10,$AS$4=20),\"Dbl.\"&AU27&\"B\",0)","v":{"$error":"#N/A"}},null,null,null,{"$f":"ModelNo","v":"Select Model"},{"$f":"VLOOKUP($AZ$27,$AZ$5:$BB$26,2,FALSE)","v":{"$error":"#N/A"}},{"$f":"VLOOKUP($AZ$27,$AZ$5:$BB$26,3,FALSE)","v":{"$error":"#N/A"}},null,26,null,null,null,null,null,null,null,"4B","4B","4B","4B","6B","6B","6B","6B","6B","6B","7B","9B","9B","9B","11R","11R","11R","12R","12R","12R","12R","12R","13R","13R","9R","9R","10R","10R","10R","10R","10R","10R","11R","11R","12R","12R","12R","12R","12R","12R","12R","13R","14R",null,null,null,{"$error":"#N/A"},{"$error":"#N/A"},{"$f":"IF(AND(DG27=16,$DE$4>=20,$DE$4<=22),DG27&\"E\",0)","v":{"$error":"#N/A"}},null,null,{"$error":"#N/A"},{"$error":"#N/A"},{"$f":"IF(AND(DL27=16,$DJ$4>=20,$DJ$4<=22),DL27&\"E\",0)","v":{"$error":"#N/A"}}]
[null,29,"8/6","BN",null,29,78,"OR",null,null,null,null,{"$f":"IF(TYPE4>\"\",TYPE4,\"\")","v":""},null,"3100",{"$f":"CMR!$E$91","v":0},{"$f":"TRUNC(((CMR!$E$91-0.375)*32+0.5))/32","v":-0.34375},{"$f":"$AK$121","v":0},0,1.25,3.42977,2.42977,4.8600000000000003,null,null,null,null,null,"Top Stile",{"$f":"(2*(CMR!$E$26-1.5625))/12","v":-0.26041666666666669},0.23300000000000001,-6.067708333333334E-2,null,"Top Top Rail",{"$f":"(Frame_Width-3.4375)/12","v":-0.28645833333333331},0.35199999999999998,{"$f":"AI28*AJ28","v":-0.10083333333333332},null,null,null,{"$error":"#N/A"},0,{"$f":"IF(AND(AP28=10,$AN$4>=21,$AN$4<=26),\"Dbl.\"&AP28&\"C\",0)","v":{"$error":"#N/A"}},null,null,{"$error":"#N/A"},0,{"$f":"IF(AND(AU28=10,$AS$4>=21,$AS$4<=26),\"Dbl.\"&AU28&\"C\",0)","v":{"$error":"#N/A"}},null,null,null,null,null,null,null,27,null,null,null,null,null,null,null,null,null,null,null,null,null,"6B","6B","6B","7B","7B","9B","10B","10B","11R","11R","12R","12R","12R","12R","12R","12R","13R","13R","9R","10R","10R","10R","10R","11R","11R","11R","12R","12R","12R","12R","12R","12R","12R","13R","13R","14R","14R",null,null,null,{"$error":"#N/A"},{"$error":"#N/A"},{"$f":"IF(AND(DG28=16,$DE$4>=23,$DE$4<=24),DG28&\"F\",0)","v":{"$error":"#N/A"}},null,null,{"$error":"#N/A"},{"$error":"#N/A"},{"$f":"IF(AND(DL28=16,$DJ$4>=23,$DJ$4<=24),DL28&\"F\",0)","v":{"$error":"#N/A"}}]
[null,30,"8/8","RD",null,30,78,"OR",null,null,null,1,{"$f":"VLOOKUP(TYPE,L25:M26,2,FALSE)","v":""},null,"R601",{"$f":"CMR!$L$75","v":0},{"$f":"CMR!$L$75-0.65625","v":-0.65625},{"$f":"$AK$73","v":0},{"$f":"$AK$72","v":0},null,null,null,5.9375,null,null,null,null,null,"Top Rail Reinf.",{"$f":"(TRUNC(((Frame_Width-3.25)-6)/2)*2)/12","v":-0.66666666666666663},0.29899999999999999,-0.19933333333333331,null,"Top Bottom Rail",{"$f":"(Frame_Width-3.4375)/12","v":-0.28645833333333331},0.34399999999999997,-9.8541666666666652E-2,null,null,null,{"$error":"#N/A"},0,{"$f":"IF(AND(AP29=10,$AN$4>=27,$AN$4<=32),\"Dbl.\"&AP29&\"D\",0)","v":{"$error":"#N/A"}},null,null,{"$error":"#N/A"},0,{"$f":"IF(AND(AU29=10,$AS$4>=27,$AS$4<=32),\"Dbl.\"&AU29&\"D\",0)","v":{"$error":"#N/A"}},null,null,null,null,null,null,null,28,null,null,null,null,null,null,null,null,null,null,null,null,null,"6B","6B","7B","8B","8B","9B","10B","10B","12R","12R","12R","12R","12R","12R","12R","13R","13R","13R","10R","10R","11R","11R","11R","11R","12R","12R","12R","12R","13R","13R","13R","13R","13R","13R","14R","14R","15R",null,null,null,{"$error":"#N/A"},{"$error":"#N/A"},{"$f":"IF(AND(DG29=16,$DE$4>=25,$DE$4<=27),DG29&\"G\",0)","v":{"$error":"#N/A"}},null,null,{"$error":"#N/A"},{"$error":"#N/A"},{"$f":"IF(AND(DL29=16,$DJ$4>=25,$DJ$4<=27),DL29&\"G\",0)","v":{"$error":"#N/A"}}]
[null,31,"8/8","RD",null,31,88,"WT",null,null,null,null,null,null,"8001",{"$f":"CMR!$L$75","v":0},{"$f":"INT((CMR!$L$75-0.811-0.0625)*32+0.5)/32","v":-0.875},{"$f":"$AK$73","v":0},{"$f":"$AK$72","v":0},null,null,null,5.9375,null,null,null,null,null,"Top Stile Reinf",{"$f":"IF(CMR!$E$31>26.6875,((TRUNC((CMR!$E$26-9.5)/2)*2)/12)*2,0)","v":0},0.29899999999999999,0,null,"Top Stile",{"$f":"(2*(CMR!$E$74-0.8125))/12","v":-0.13541666666666666},0.218,-2.9520833333333333E-2,null,null,null,{"$error":"#N/A"},0,{"$f":"IF(AND(AP30=10,$AN$4>=33,$AN$4<=38),\"Dbl.\"&AP30&\"E\",0)","v":{"$error":"#N/A"}},null,null,{"$error":"#N/A"},0,{"$f":"IF(AND(AU30=10,$AS$4>=33,$AS$4<=38),\"Dbl.\"&AU30&\"E\",0)","v":{"$error":"#N/A"}},null,null,null,null,null,null,null,29,null,null,null,null,null,null,null,null,null,null,null,null,null,null,null,"4H","4H","8B","10B","10B","10B","12R","12R","13R","13R","13R","13R","13R","13R","13R","13R","10R","11R","11R","11R","11R","12R","12R","12R","12R","13R","13R","13R","13R","13R","13R","14R","14R","15R","16R",null,null,null,{"$error":"#N/A"},{"$f":"IF(AND($DF$4<=18,$DF$4>16),18,0)","v":{"$error":"#N/A"}},{"$f":"IF(AND(DG30=18,$DE$4>=4,$DE$4<=9),DG30&\"A\",0)","v":{"$error":"#N/A"}},null,null,{"$error":"#N/A"},{"$f":"IF(AND($DK$4<=18,$DK$4>16),18,0)","v":{"$error":"#N/A"}},{"$f":"IF(AND(DL30=18,$DJ$4>=4,$DJ$4<=9),DL30&\"A\",0)","v":{"$error":"#N/A"}}]
[null,32,"8/8","RD",null,32,88,"WT",null,null,null,null,"Opening",null,"S140",{"$f":"CDIMS140","v":{"$error":"#NAME?"}},{"$f":"Data!$D$993","v":0},{"$f":"IF(EXTSELECT=2,BSW03A0,IF(EXTSELECT=5,$AF$67,$AF$23))","v":0},0,{"$f":"IF(OR(EXTSELECT=2,EXTSELECT=5),1.3125,1.03125)","v":1.03125},{"$f":"IF(EXTSELECT=5,1.75,IF(EXTSELECT=2,2.40625,1.537))","v":1.5369999999999999},{"$f":"IF(EXTSELECT=5,1.75,IF(EXTSELECT=2,1.875,1.537))","v":1.5369999999999999},{"$f":"IF(EXTSELECT=2,4.406,IF(EXTSELECT=5,4.5,3.0625))","v":3.0625},null,null,null,null,null,"Top Glass",{"$f":"(CMR!$E$29*CMR!$E$31)/144","v":0.10791015625},{"$f":"$L$12","v":3.2},0.34531250000000002,null,"Top Rail Reinf.",{"$f":"(ROUND(Frame_Width-13,2))/12","v":-1.0833333333333333},0.14599999999999999,-0.15816666666666665,null,null,null,{"$error":"#N/A"},{"$f":"IF(AND($AO$4<=12,$AO$4>10),12,0)","v":0},{"$f":"IF(AND(AP31=12,$AN$4>=3,$AN$4<=7),AP31&\"A\",0)","v":{"$error":"#N/A"}},null,null,{"$error":"#N/A"},{"$f":"IF(AND($AT$4<=12,$AT$4>10),12,0)","v":0},{"$f":"IF(AND(AU31=12,$AS$4>=3,$AS$4<=7),AU31&\"A\",0)","v":{"$error":"#N/A"}},null,null,null,null,null,null,null,30,null,null,null,null,null,null,null,null,null,null,null,null,null,null,null,"4H","4H","4H","4H","5H","5H","5H","5H","5H","5H","6H","6H","6H","6H","7H","7H","10R","11R","11R","12R","12R","13R","13R","13R","13R","14R","14R","14R","14R","14R","14R","14R","15R","15R","17R",null,null,null,{"$error":"#N/A"},{"$error":"#N/A"},{"$f":"IF(AND(DG31=18,$DE$4>=10,$DE$4<=13),DG31&\"B\",0)","v":{"$error":"#N/A"}},null,null,{"$error":"#N/A"},{"$error":"#N/A"},{"$f":"IF(AND(DL31=18,$DJ$4>=10,$DJ$4<=13),DL31&\"B\",0)","v":{"$error":"#N/A"}}]
[null,33,"8/8","RD",null,33,89,"NAT",null,null,null,1,"Exact Size",null,"S144",{"$error":"#NAME?"},{"$f":"Data!$D$993","v":0},0,0,1.03125,1.5369999999999999,1.5369999999999999,3.0625,null,null,null,null,null,"Top Spacer",{"$f":"((CMR!$E$29*2)+(CMR!$E$31*2))/12","v":-1.34375},5.3600000000000002E-2,-7.2025000000000006E-2,null,"Top Stile Reinf",null,0.14599999999999999,0,null,null,null,{"$error":"#N/A"},0,{"$f":"IF(AND(AP32=12,$AN$4>=8,$AN$4<=10),AP32&\"B\",0)","v":{"$error":"#N/A"}},null,null,{"$error":"#N/A"},0,{"$f":"IF(AND(AU32=12,$AS$4>=8,$AS$4<=10),AU32&\"B\",0)","v":{"$error":"#N/A"}},null,null,null,null,null,null,null,31,null,null,null,null,null,null,null,null,null,null,null,null,null,null,null,"4H","4H","4H","5H","5H","5H","6H","6H","6H","6H","6H","6H","7H","7H","7H","7H","8H","8H","9H","9H","9H","9H","10H","10H","10H","10H","11H","11H","11H","11H","12H","12H","12H","12H","12H",null,null,null,{"$error":"#N/A"},{"$error":"#N/A"},{"$f":"IF(AND(DG32=18,$DE$4>=14,$DE$4<=18),DG32&\"C\",0)","v":{"$error":"#N/A"}},null,null,{"$error":"#N/A"},{"$error":"#N/A"},{"$f":"IF(AND(DL32=18,$DJ$4>=14,$DJ$4<=18),DL32&\"C\",0)","v":{"$error":"#N/A"}}]
[null,34,"9/9","PU",null,34,89,"NAT",null,null,null,2,"Rough Opening",null,"S146",{"$error":"#NAME?"},{"$f":"Data!$D$993","v":0},0,0,1.03125,1.5369999999999999,1.5369999999999999,3.0625,null,null,null,null,null,"Top Hardware",1,0.2,0.2,null,"Top Glass",{"$f":"(CMR!$E$77*CMR!$E$79)/144","v":0.13875325520833334},{"$f":"$L$12","v":3.2},0.44401041666666674,null,null,null,{"$error":"#N/A"},0,{"$f":"IF(AND(AP33=12,$AN$4>=11,$AN$4<=16),AP33&\"C\",0)","v":{"$error":"#N/A"}},null,null,{"$error":"#N/A"},0,{"$f":"IF(AND(AU33=12,$AS$4>=11,$AS$4<=16),AU33&\"C\",0)","v":{"$error":"#N/A"}},null,null,null,null,null,null,null,32,null,null,null,null,null,null,null,null,null,null,null,null,null,null,null,"4H","4H","4H","5H","5H","5H","6H","6H","6H","6H","6H","6H","7H","7H","7H","7H","8H","8H","9H","9H","9H","9H","10H","10H","10H","10H","11H","11H","11H","11H","12H","12H","12H","12H","12H",null,null,null,{"$error":"#N/A"},{"$error":"#N/A"},{"$f":"IF(AND(DG33=18,$DE$4>=19,$DE$4<=21),DG33&\"D\",0)","v":{"$error":"#N/A"}},null,null,{"$error":"#N/A"},{"$error":"#N/A"},{"$f":"IF(AND(DL33=18,$DJ$4>=19,$DJ$4<=21),DL33&\"D\",0)","v":{"$error":"#N/A"}}]
[null,35,"9/9","PU",null,35,99,"PU",null,null,null,1,{"$f":"VLOOKUP(RO,L32:M33,2,FALSE)","v":"Exact Size"},null,"S140 (HP)",{"$error":"#NAME?"},{"$f":"Data!$D$993","v":0},0,0,1.03125,1.5369999999999999,1.5369999999999999,3.0625,null,null,null,null,null,"Top Bead",{"$f":"(((Frame_Width-4.3125)*2)+((CMR!$E$26-2.625)*2))/12","v":-1.15625},2.8000000000000001E-2,-3.2375000000000001E-2,null,"Top Spacer",{"$f":"((CMR!$E$77*2)+(CMR!$E$79*2))/12","v":-1.5416666666666667},5.3600000000000002E-2,-8.2633333333333336E-2,null,null,null,{"$error":"#N/A"},0,{"$f":"IF(AND(AP34=12,$AN$4>=17,$AN$4<=18),AP34&\"D\",0)","v":{"$error":"#N/A"}},null,null,{"$error":"#N/A"},0,{"$f":"IF(AND(AU34=12,$AS$4>=17,$AS$4<=18),AU34&\"D\",0)","v":{"$error":"#N/A"}},null,null,null,null,null,null,null,33,null,null,null,null,null,null,null,null,null,null,null,null,null,null,null,"5H","5H","5H","5H","6H","6H","6H","6H","6H","6H","7H","7H","7H","7H","8H","8H","9H","9H","10H","10H","10H","10H","11H","11H","11H","11H","12H","12H","12H","12H","13H","13H","13H","13H","13H",null,null,null,{"$error":"#N/A"},{"$error":"#N/A"},{"$f":"IF(AND(DG34=18,$DE$4>=22,$DE$4<=24),DG34&\"E\",0)","v":{"$error":"#N/A"}},null,null,{"$error":"#N/A"},{"$error":"#N/A"},{"$f":"IF(AND(DL34=18,$DJ$4>=22,$DJ$4<=24),DL34&\"E\",0)","v":{"$error":"#N/A"}}]
[null,36,"9/9","PU",null,36,99,"PU",null,null,null,null,null,null,"S144 (HP)",{"$error":"#NAME?"},{"$f":"Data!$D$993","v":0},0,0,1.03125,1.5369999999999999,1.5369999999999999,3.0625,null,null,null,null,null,"Bottom Top Rail",{"$f":"(Frame_Width-2.25)/12","v":-0.1875},0.246,{"$f":"AD35*AE35","v":-4.6124999999999999E-2},null,"Top Hardware",1,0.24,0.24,null,null,null,{"$error":"#N/A"},0,{"$f":"IF(AND(AP35=12,$AN$4>=19,$AN$4<=21),AP35&\"E\",0)","v":{"$error":"#N/A"}},null,null,{"$error":"#N/A"},0,{"$f":"IF(AND(AU35=12,$AS$4>=19,$AS$4<=21),AU35&\"E\",0)","v":{"$error":"#N/A"}},null,null,null,null,null,null,null,34,null,null,null,null,null,null,null,null,null,null,null,null,null,null,null,"5H","5H","5H","6H","6H","6H","6H","6H","6H","6H","7H","7H","7H","7H","8H","8H","9H","9H","10H","10H","10H","10H","11H","11H","11H","11H","12H","12H","12H","12H","13H","13H","13H","13H","14H",null,null,null,{"$error":"#N/A"},{"$error":"#N/A"},{"$f":"IF(AND(DG35=18,$DE$4>=25,$DE$4<=26),DG35&\"F\",0)","v":{"$error":"#N/A"}},null,null,{"$error":"#N/A"},{"$error":"#N/A"},{"$f":"IF(AND(DL35=18,$DJ$4>=25,$DJ$4<=26),DL35&\"F\",0)","v":{"$error":"#N/A"}}]
[null,37,"9/9","PU",null,37,766,"BU",null,null,null,{"$f":"IF(OR(ModelNo=\"0100\",ModelNo=\"01HP\",ModelNo=\"0102\",ModelNo=\"0103\",ModelNo=\"0104\",ModelNo=\"0109\",ModelNo=\"0151\",ModelNo=\"0152\",ModelNo=\"0153\",ModelNo=\"0154\",ModelNo=\"0155\",ModelNo=\"0170\",ModelNo=\"0171\",ModelNo=\"0172\",ModelNo=\"0173\",ModelNo=\"S174\",ModelNo=\"S175\",ModelNo=\"0179\",ModelNo=\"0301\"),1,0)","v":0},"Screen",null,"S146 (HP)",{"$error":"#NAME?"},{"$f":"Data!$D$993","v":0},0,0,1.03125,1.5369999999999999,1.5369999999999999,3.0625,null,null,null,null,null,"Bottom Bottom Rail",{"$f":"(Frame_Width-2.25)/12","v":-0.1875},0.25700000000000001,-4.8187500000000001E-2,null,"Top Handle Bead",{"$f":"(Frame_Width-5.9375)/12","v":-0.49479166666666669},7.8E-2,-3.8593750000000003E-2,null,null,null,{"$error":"#N/A"},0,{"$f":"IF(AND(AP36=12,$AN$4>=22,$AN$4<=32),\"Dbl.\"&AP36&\"C\",0)","v":{"$error":"#N/A"}},null,null,{"$error":"#N/A"},0,{"$f":"IF(AND(AU36=12,$AS$4>=22,$AS$4<=32),\"Dbl.\"&AU36&\"C\",0)","v":{"$error":"#N/A"}},null,null,null,null,null,null,null,35,null,null,null,null,null,null,null,null,null,null,null,null,null,null,null,"5H","5H","5H","6H","6H","6H","7H","7H","7H","7H","7H","7H","8H","8H","9H","9H","10H","10H","10H","10H","11H","11H","11H","11H","12H","12H","13H","13H","13H","13H","14H","14H","14H","14H","15H",null,null,null,{"$error":"#N/A"},{"$error":"#N/A"},{"$f":"IF(AND(DG36=18,$DE$4>=27,$DE$4<=29),DG36&\"G\",0)","v":{"$error":"#N/A"}},null,null,{"$error":"#N/A"},{"$error":"#N/A"},{"$f":"IF(AND(DL36=18,$DJ$4>=27,$DJ$4<=29),DL36&\"G\",0)","v":{"$error":"#N/A"}}]
[null,38,"10/10","PK",null,38,766,"BU",null,null,null,1,{"$f":"IF(SCREEN1>\"\",SCREEN1,\"\")","v":""},null,"V100",{"$f":"CMR!$L$100","v":0},{"$f":"TRUNC(((CMR!$L$100-0.844)*32+0.5))/32","v":-0.8125},{"$f":"AF157","v":0},{"$f":"AF156","v":0},null,1,2,4.625,null,null,null,null,null,"Bottom Stile",{"$f":"(2*(CMR!$E$27-0.5625))/12","v":-9.375E-2},0.23300000000000001,-2.1843750000000002E-2,null,"Top Bead",{"$f":"((Frame_Width-5.9375)+((CMR!$E$74-3.0625)*2))/12","v":-1.0052083333333333},7.8E-2,-7.8406249999999997E-2,null,null,null,{"$f":"IF(AND(AP37>0,AQ37>0),AP37,0)","v":{"$error":"#N/A"}},0,{"$f":"IF(AND(AP37=12,$AN$4>=33,$AN$4<=36),\"Dbl.\"&AP37&\"D\",0)","v":{"$error":"#N/A"}},null,null,{"$error":"#N/A"},0,{"$f":"IF(AND(AU37=12,$AS$4>=33,$AS$4<=36),\"Dbl.\"&AU37&\"D\",0)","v":{"$error":"#N/A"}},null,null,null,null,null,null,null,36,null,null,null,null,null,null,null,null,null,null,null,null,null,null,null,"5H","5H","5H","6H","6H","6H","7H","7H","7H","7H","7H","7H","8H","8H","9H","9H","10H","10H","10H","10H","11H","11H","11H","11H","12H","12H","13H","13H","13H","13H","14H","14H","14H","14H","15H",null,null,null,{"$error":"#N/A"},{"$error":"#N/A"},{"$f":"IF(AND(DG37=18,$DE$4>=30,$DE$4<=32),DG37&\"H\",0)","v":{"$error":"#N/A"}},null,null,{"$error":"#N/A"},{"$error":"#N/A"},{"$f":"IF(AND(DL37=18,$DJ$4>=30,$DJ$4<=32),DL37&\"H\",0)","v":{"$error":"#N/A"}}]
[null,39,"10/10","PK",null,39,866,"YW",null,null,null,2,{"$f":"IF(SCREEN2>\"\",SCREEN2,\"\")","v":""},null,"V101",{"$f":"CMR!$L$116","v":0},{"$f":"TRUNC(((CMR!$L$116-0.3125)*32+0.5))/32","v":-0.28125},{"$f":"AF179","v":0},{"$f":"AF178","v":0},null,1,2,4.625,null,null,null,null,null,"Bottom Rail Reinf.",{"$f":"(TRUNC(((Frame_Width-2.25)-6)/2)*2)/12","v":-0.66666666666666663},0.37,-0.24666666666666665,null,"Bottom Top Rail",{"$f":"(Frame_Width-3)/12","v":-0.25},0.42899999999999999,-0.10725,null,null,null,{"$error":"#N/A"},0,{"$f":"IF(AND(AP38=12,$AN$4>=37,$AN$4<=42),\"Dbl.\"&AP38&\"E\",0)","v":{"$error":"#N/A"}},null,null,{"$error":"#N/A"},0,{"$f":"IF(AND(AU38=12,$AS$4>=37,$AS$4<=42),\"Dbl.\"&AU38&\"E\",0)","v":{"$error":"#N/A"}},null,null,null,null,null,null,null,37,null,null,null,null,null,null,null,null,null,null,null,null,null,null,null,"6H","6H","6H","7H","7H","7H","7H","7H","7H","7H","8H","8H","9H","9H","10H","10H","11H","11H","11H","11H","12H","12H","12H","12H","13H","13H","14H","14H","14H","14H","15H","15H","15H","15H","16H",null,null,null,{"$error":"#N/A"},{"$f":"IF(AND($DF$4<=20,$DF$4>18),20,0)","v":{"$error":"#N/A"}},{"$f":"IF(AND(DG38=20,$DE$4>=5,$DE$4<=10),DG38&\"A\",0)","v":{"$error":"#N/A"}},null,null,{"$error":"#N/A"},{"$f":"IF(AND($DK$4<=20,$DK$4>18),20,0)","v":{"$error":"#N/A"}},{"$f":"IF(AND(DL38=20,$DJ$4>=5,$DJ$4<=10),DL38&\"A\",0)","v":{"$error":"#N/A"}}]
[null,40,"10/10","PK",null,40,866,"YW",null,null,null,3,{"$f":"IF(SCREEN3>\"\",SCREEN3,\"\")","v":""},null,"V200",{"$f":"CMR!$L$125","v":0},{"$f":"TRUNC(((CMR!$L$125-0.8125)*32+0.5))/32-0.0625","v":-0.84375},{"$f":"AK167","v":0},{"$f":"AK166","v":0},null,1,1.8180000000000001,4.625,null,null,null,null,null,"Bottom Stile Reinf.",{"$f":"IF(CMR!$E$32>27.6875,((TRUNC((CMR!$E$27-4.5)/2)*2)/12)*2,0)","v":0},0.29899999999999999,0,null,"Bottom Bottom Rail",{"$f":"(Frame_Width-3)/12","v":-0.25},0.42899999999999999,-0.10725,null,null,null,{"$error":"#N/A"},{"$f":"IF(AND($AO$4<=14,$AO$4>12),14,0)","v":0},{"$f":"IF(AND(AP39=14,$AN$4>=3,$AN$4<=7),AP39&\"A\",0)","v":{"$error":"#N/A"}},null,null,{"$error":"#N/A"},{"$f":"IF(AND($AT$4<=14,$AT$4>12),14,0)","v":0},{"$f":"IF(AND(AU39=14,$AS$4>=3,$AS$4<=7),AU39&\"A\",0)","v":{"$error":"#N/A"}},null,null,null,null,null,null,null,38,null,null,null,null,null,null,null,null,null,null,null,null,null,null,null,"6H","6H","6H","7H","7H","7H","7H","7H","7H","7H","8H","8H","9H","9H","10H","10H","11H","11H","11H","11H","12H","12H","12H","12H","13H","13H","14H","14H","14H","14H","15H","15H","16H","16H","17H",null,null,null,{"$error":"#N/A"},{"$error":"#N/A"},{"$f":"IF(AND(DG39=20,$DE$4>=11,$DE$4<=14),DG39&\"B\",0)","v":{"$error":"#N/A"}},null,null,{"$error":"#N/A"},{"$error":"#N/A"},{"$f":"IF(AND(DL39=20,$DJ$4>=11,$DJ$4<=14),DL39&\"B\",0)","v":{"$error":"#N/A"}}]
[null,41,"10/10","PK",null,41,777,"GN",null,null,null,1,{"$f":"IF(Screen_Type=3,\"L\",IF(Screen_Type=2,\"F\",\"H\"))","v":"H"},null,"P601",{"$f":"CMR!$L$91","v":0},{"$f":"CMR!$L$91-1.0625","v":-1.0625},{"$f":"$AK$97","v":0},{"$f":"$AK$96","v":0},null,null,null,5.9375,null,null,null,null,null,"Bottom Glass",{"$f":"(CMR!$E$30*CMR!$E$32)/144","v":5.8865017361111112E-2},{"$f":"$L$12","v":3.2},0.18836805555555558,null,"Bottom Stile",{"$f":"(2*(CMR!$E$75-0.8125))/12","v":-0.13541666666666666},0.23300000000000001,-3.1552083333333335E-2,null,null,null,{"$error":"#N/A"},0,{"$f":"IF(AND(AP40=14,$AN$4>=8,$AN$4<=10),AP40&\"B\",0)","v":{"$error":"#N/A"}},null,null,{"$error":"#N/A"},0,{"$f":"IF(AND(AU40=14,$AS$4>=8,$AS$4<=10),AU40&\"B\",0)","v":{"$error":"#N/A"}},null,null,null,null,null,null,null,39,null,null,null,null,null,null,null,null,null,null,null,null,null,null,null,"6H","6H","7H","7H","7H","7H","7H","7H","8H","8H","8H","8H","9H","9H","10H","10H","11H","11H","12H","12H","13H","13H","13H","13H","14H","14H","15H","15H","15H","15H","16H","16H","17H","17H","17H",null,null,null,{"$error":"#N/A"},{"$error":"#N/A"},{"$f":"IF(AND(DG40=20,$DE$4>=15,$DE$4<=18),DG40&\"C\",0)","v":{"$error":"#N/A"}},null,null,{"$error":"#N/A"},{"$error":"#N/A"},{"$f":"IF(AND(DL40=20,$DJ$4>=15,$DJ$4<=18),DL40&\"C\",0)","v":{"$error":"#N/A"}}]
[null,42,"6/8/8","GN",null,42,777,"GN",null,null,null,null,null,null,"9001",{"$f":"CMR!$L$91","v":0},{"$f":"CMR!$L$91-1.0625","v":-1.0625},{"$f":"$AK$97","v":0},{"$f":"$AK$96","v":0},null,null,null,5.9375,null,null,null,null,null,"Bottom Spacer",{"$f":"((CMR!$E$30*2)+(CMR!$E$32*2))/12","v":-1.0104166666666667},5.3600000000000002E-2,-5.4158333333333336E-2,null,"Bottom Rail Reinf.",{"$f":"(ROUND(Frame_Width-13,2))/12","v":-1.0833333333333333},0.14599999999999999,-0.15816666666666665,null,null,null,{"$error":"#N/A"},0,{"$f":"IF(AND(AP41=14,$AN$4>=11,$AN$4<=16),AP41&\"C\",0)","v":{"$error":"#N/A"}},null,null,{"$error":"#N/A"},0,{"$f":"IF(AND(AU41=14,$AS$4>=11,$AS$4<=16),AU41&\"C\",0)","v":{"$error":"#N/A"}},null,null,null,null,null,null,null,40,null,null,null,null,null,null,null,null,null,null,null,null,null,null,null,"6H","7H","7H","7H","7H","7H","7H","7H","8H","8H","8H","8H","9H","9H","10H","10H","11H","11H","12H","12H","13H","13H","13H","13H","14H","14H","15H","15H","15H","15H","16H","16H","17H","17H","17H",null,null,null,{"$error":"#N/A"},{"$error":"#N/A"},{"$f":"IF(AND(DG41=20,$DE$4>=19,$DE$4<=22),DG41&\"D\",0)","v":{"$error":"#N/A"}},null,null,{"$error":"#N/A"},{"$error":"#N/A"},{"$f":"IF(AND(DL41=20,$DJ$4>=19,$DJ$4<=22),DL41&\"D\",0)","v":{"$error":"#N/A"}}]
[null,43,"6/8/8","GN",null,43,877,"LG",null,null,null,null,null,null,"3001",{"$f":"CMR!$E$117","v":0},{"$f":"CMR!$E$117-0.625","v":-0.625},{"$f":"$AK$189","v":0},{"$f":"$AK$188","v":0},1.3125,7.875,1.875,5.25,null,null,null,null,null,"Bottom Hardware",1,0.36,0.36,null,"Bottom Stile Reinf.",null,0.14599999999999999,0,null,null,null,{"$error":"#N/A"},0,{"$f":"IF(AND(AP42=14,$AN$4>=17,$AN$4<=19),AP42&\"D\",0)","v":{"$error":"#N/A"}},null,null,{"$error":"#N/A"},0,{"$f":"IF(AND(AU42=14,$AS$4>=17,$AS$4<=19),AU42&\"D\",0)","v":{"$error":"#N/A"}},null,null,null,null,null,null,null,null,null,null,null,null,null,null,null,null,null,null,null,null,null,null,null,null,null,null,null,null,null,null,null,null,null,null,null,null,null,null,null,null,null,null,null,null,null,null,null,null,null,null,null,null,null,null,null,null,null,null,null,null,null,{"$error":"#N/A"},{"$error":"#N/A"},{"$f":"IF(AND(DG42=20,$DE$4>=23,$DE$4<=26),DG42&\"E\",0)","v":{"$error":"#N/A"}},null,null,{"$error":"#N/A"},{"$error":"#N/A"},{"$f":"IF(AND(DL42=20,$DJ$4>=23,$DJ$4<=26),DL42&\"E\",0)","v":{"$error":"#N/A"}}]
[null,44,"6/8/8","GN",null,44,877,"LG",null,null,null,null,null,null,null,null,null,null,null,null,null,null,null,null,null,null,null,null,"Bottom Bead",{"$f":"(((Frame_Width-3.3125)*2)+((CMR!$E$27-1.625)*2))/12","v":-0.82291666666666663},2.8000000000000001E-2,-2.3041666666666665E-2,null,"Bottom Glass",{"$f":"(CMR!$E$78*CMR!$E$80)/144","v":0.13875325520833334},{"$f":"$L$12","v":3.2},0.44401041666666674,null,null,null,{"$error":"#N/A"},0,{"$f":"IF(AND(AP43=14,$AN$4>=20,$AN$4<=22),AP43&\"E\",0)","v":{"$error":"#N/A"}},null,null,{"$error":"#N/A"},0,{"$f":"IF(AND(AU43=14,$AS$4>=20,$AS$4<=22),AU43&\"E\",0)","v":{"$error":"#N/A"}},null,null,null,null,null,null,null,null,null,null,null,null,null,null,null,null,null,null,null,null,null,null,null,null,null,null,null,null,null,null,null,null,null,null,null,null,null,null,null,null,null,null,null,null,null,null,null,null,null,null,null,null,null,null,null,null,null,null,null,null,null,{"$error":"#N/A"},{"$error":"#N/A"},{"$f":"IF(AND(DG43=20,$DE$4>=27,$DE$4<=30),DG43&\"F\",0)","v":{"$error":"#N/A"}},null,null,{"$error":"#N/A"},{"$error":"#N/A"},{"$f":"IF(AND(DL43=20,$DJ$4>=27,$DJ$4<=30),DL43&\"F\",0)","v":{"$error":"#N/A"}}]
[null,45,"6/8/8","GN",null,45,878,"OR",null,null,null,null,null,null,null,null,null,null,null,null,null,null,null,null,null,null,null,null,null,null,"Top Sash",{"$f":"IF(OR(ModelNo=\"0201\",ModelNo=\"L201\"),(TRUNC((SUM(AF26:AF34))))+5,0)","v":0},null,"Bottom Spacer",{"$f":"((CMR!$E$78*2)+(CMR!$E$80*2))/12","v":-1.5416666666666667},5.3600000000000002E-2,-8.2633333333333336E-2,null,null,null,{"$error":"#N/A"},0,{"$f":"IF(AND(AP44=14,$AN$4>=23,$AN$4<=25),AP44&\"F\",0)","v":{"$error":"#N/A"}},null,null,{"$error":"#N/A"},0,{"$f":"IF(AND(AU44=14,$AS$4>=23,$AS$4<=25),AU44&\"F\",0)","v":{"$error":"#N/A"}},null,null,null,null,null,null,null,null,null,null,null,null,null,null,null,null,null,null,null,null,null,null,null,null,null,null,null,null,null,null,null,null,null,null,null,null,null,null,null,null,null,null,null,null,null,null,null,null,null,null,null,null,null,null,null,null,null,null,null,null,null,{"$error":"#N/A"},{"$error":"#N/A"},{"$f":"IF(AND(DG44=20,$DE$4>=31,$DE$4<=34),DG44&\"G\",0)","v":{"$error":"#N/A"}},null,null,{"$error":"#N/A"},{"$error":"#N/A"},{"$f":"IF(AND(DL44=20,$DJ$4>=31,$DJ$4<=34),DL44&\"G\",0)","v":{"$error":"#N/A"}}]
[null,46,"8/8/8","OR",null,46,878,"OR",null,null,null,null,null,null,null,null,null,null,null,null,null,null,null,null,null,null,null,null,null,null,"Bottom Sash",{"$f":"IF(OR(ModelNo=\"0201\",ModelNo=\"L201\"),TRUNC((SUM(AF35:AF43))),0)","v":0},null,"Bottom Hardware",1,0.32200000000000001,0.32200000000000001,null,null,null,{"$error":"#N/A"},0,{"$f":"IF(AND(AP45=14,$AN$4>=26,$AN$4<=28),AP45&\"G\",0)","v":{"$error":"#N/A"}},null,null,{"$error":"#N/A"},0,{"$f":"IF(AND(AU45=14,$AS$4>=26,$AS$4<=28),AU45&\"G\",0)","v":{"$error":"#N/A"}},null,null,null,null,null,null,null,null,null,null,null,null,null,null,null,null,null,null,null,null,null,null,null,null,null,null,null,null,null,null,null,null,null,null,null,null,null,null,null,null,null,null,null,null,null,null,null,null,null,null,null,null,null,null,null,null,null,null,null,null,null,{"$error":"#N/A"},{"$f":"IF(AND($DF$4<=22,$DF$4>20),22,0)","v":{"$error":"#N/A"}},{"$f":"IF(AND(DG45=22,$DE$4>=5,$DE$4<=10),DG45&\"A\",0)","v":{"$error":"#N/A"}},null,null,{"$error":"#N/A"},{"$f":"IF(AND($DK$4<=22,$DK$4>20),22,0)","v":{"$error":"#N/A"}},{"$f":"IF(AND(DL45=22,$DJ$4>=5,$DJ$4<=10),DL45&\"A\",0)","v":{"$error":"#N/A"}}]
[null,47,"8/8/8","OR",null,47,888,"WT",null,null,null,null,null,null,null,null,null,null,null,null,null,null,null,null,null,null,null,null,null,null,null,null,null,"Bottom Keeper Bead",{"$f":"(Frame_Width-5.9375)/12","v":-0.49479166666666669},7.8E-2,-3.8593750000000003E-2,null,null,null,{"$error":"#N/A"},0,{"$f":"IF(AND(AP46=14,$AN$4>=29,$AN$4<=31),AP46&\"H\",0)","v":{"$error":"#N/A"}},null,null,{"$error":"#N/A"},0,{"$f":"IF(AND(AU46=14,$AS$4>=29,$AS$4<=31),AU46&\"H\",0)","v":{"$error":"#N/A"}},null,null,null,null,null,null,null,null,null,null,null,null,null,null,null,null,null,null,null,null,null,null,null,null,null,null,null,null,null,null,null,null,null,null,null,null,null,null,null,null,null,null,null,null,null,null,null,null,null,null,null,null,null,null,null,null,null,null,null,null,null,{"$error":"#N/A"},{"$error":"#N/A"},{"$f":"IF(AND(DG46=22,$DE$4>=11,$DE$4<=16),DG46&\"B\",0)","v":{"$error":"#N/A"}},null,null,{"$error":"#N/A"},{"$error":"#N/A"},{"$f":"IF(AND(DL46=22,$DJ$4>=11,$DJ$4<=16),DL46&\"B\",0)","v":{"$error":"#N/A"}}]
[null,48,"8/8/8","OR",null,48,888,"WT",null,null,null,null,null,null,null,null,null,null,null,null,null,null,null,null,null,null,null,null,"02A0","Length","Weight/ft","Weight",null,"Bottom Bead",{"$f":"((Frame_Width-5.9375)+((CMR!$E$75-3.0625)*2))/12","v":-1.0052083333333333},7.8E-2,-7.8406249999999997E-2,null,null,null,{"$error":"#N/A"},0,{"$f":"IF(AND(AP47=14,$AN$4>=32,$AN$4<=34),AP47&\"I\",0)","v":{"$error":"#N/A"}},null,null,{"$error":"#N/A"},0,{"$f":"IF(AND(AU47=14,$AS$4>=32,$AS$4<=34),AU47&\"I\",0)","v":{"$error":"#N/A"}},null,null,null,null,null,null,null,null,null,null,null,null,null,null,null,null,null,null,null,null,null,null,null,null,null,null,null,null,null,null,null,null,null,null,null,null,null,null,null,null,null,null,null,null,null,null,null,null,null,null,null,null,null,null,null,null,null,null,null,null,null,{"$error":"#N/A"},{"$error":"#N/A"},{"$f":"IF(AND(DG47=22,$DE$4>=17,$DE$4<=21),DG47&\"C\",0)","v":{"$error":"#N/A"}},null,null,{"$error":"#N/A"},{"$error":"#N/A"},{"$f":"IF(AND(DL47=22,$DJ$4>=17,$DJ$4<=21),DL47&\"C\",0)","v":{"$error":"#N/A"}}]
[null,49,"8/8/8","OR",null,49,889,"BN",null,null,null,null,null,null,null,null,null,null,null,null,null,null,null,null,null,null,null,null,"Top Top Rail",0,0,{"$f":"AD48*AE48","v":0},null,null,null,"Top Sash",{"$f":"IF(OR(ModelNo=\"0901\",ModelNo=\"09A1\",ModelNo=\"09B1\",ModelNo=\"09L1\"),(TRUNC((SUM(AK28:AK37))))+5,0)","v":0},null,null,null,{"$error":"#N/A"},0,{"$f":"IF(AND(AP48=14,$AN$4>=35,$AN$4<=38),\"Dbl.\"&AP48&\"D\",0)","v":{"$error":"#N/A"}},null,null,{"$error":"#N/A"},0,{"$f":"IF(AND(AU48=14,$AS$4>=35,$AS$4<=38),\"Dbl.\"&AU48&\"D\",0)","v":{"$error":"#N/A"}},null,null,null,null,null,null,null,null,null,null,null,null,null,null,null,null,null,null,null,null,null,null,null,null,null,null,null,null,null,null,null,null,null,null,null,null,null,null,null,null,null,null,null,null,null,null,null,null,null,null,null,null,null,null,null,null,null,null,null,null,null,{"$error":"#N/A"},{"$error":"#N/A"},{"$f":"IF(AND(DG48=22,$DE$4>=22,$DE$4<=24),DG48&\"D\",0)","v":{"$error":"#N/A"}},null,null,{"$error":"#N/A"},{"$error":"#N/A"},{"$f":"IF(AND(DL48=22,$DJ$4>=22,$DJ$4<=24),DL48&\"D\",0)","v":{"$error":"#N/A"}}]
[null,50,"8/9/9","BK",null,50,889,"BN",null,null,null,null,null,null,null,null,null,null,null,null,null,null,null,null,null,null,null,null,"Top Bottom Rail",0,0,0,null,null,null,"Bottom Sash",{"$f":"IF(OR(ModelNo=\"0901\",ModelNo=\"09A1\",ModelNo=\"09B1\",ModelNo=\"09L1\"),TRUNC((SUM(AK38:AK47))),0)","v":0},null,null,null,{"$error":"#N/A"},0,{"$f":"IF(AND(AP49=14,$AN$4>=39,$AN$4<=44),\"Dbl.\"&AP49&\"E\",0)","v":{"$error":"#N/A"}},null,null,{"$error":"#N/A"},0,{"$f":"IF(AND(AU49=14,$AS$4>=39,$AS$4<=44),\"Dbl.\"&AU49&\"E\",0)","v":{"$error":"#N/A"}},null,null,null,null,null,null,null,null,null,null,null,null,null,null,null,null,null,null,null,null,null,null,null,null,null,null,null,null,null,null,null,null,null,null,null,null,null,null,null,null,null,null,null,null,null,null,null,null,null,null,null,null,null,null,null,null,null,null,null,null,null,{"$error":"#N/A"},{"$error":"#N/A"},{"$f":"IF(AND(DG49=22,$DE$4>=25,$DE$4<=27),DG49&\"E\",0)","v":{"$error":"#N/A"}},null,null,{"$error":"#N/A"},{"$error":"#N/A"},{"$f":"IF(AND(DL49=22,$DJ$4>=25,$DJ$4<=27),DL49&\"E\",0)","v":{"$error":"#N/A"}}]
[null,51,"8/9/9","BK",null,51,899,"RD",null,null,null,null,null,null,null,null,null,null,null,null,null,null,null,null,null,null,null,null,"Top Stile",0,0,0,null,null,null,null,null,null,null,null,{"$error":"#N/A"},0,{"$f":"IF(AND(AP50=14,$AN$4>=45,$AN$4<=50),\"Dbl.\"&AP50&\"F\",0)","v":{"$error":"#N/A"}},null,null,{"$error":"#N/A"},0,{"$f":"IF(AND(AU50=14,$AS$4>=45,$AS$4<=50),\"Dbl.\"&AU50&\"F\",0)","v":{"$error":"#N/A"}},null,null,null,null,null,null,null,null,null,null,null,null,null,null,null,null,null,null,null,null,null,null,null,null,null,null,null,null,null,null,null,null,null,null,null,null,null,null,null,null,null,null,null,null,null,null,null,null,null,null,null,null,null,null,null,null,null,null,null,null,null,{"$error":"#N/A"},{"$error":"#N/A"},{"$f":"IF(AND(DG50=22,$DE$4>=28,$DE$4<=30),DG50&\"F\",0)","v":{"$error":"#N/A"}},null,null,{"$error":"#N/A"},{"$error":"#N/A"},{"$f":"IF(AND(DL50=22,$DJ$4>=28,$DJ$4<=30),DL50&\"F\",0)","v":{"$error":"#N/A"}}]
[null,52,"8/9/9","BK",null,52,899,"RD",null,null,null,null,null,null,null,null,null,null,null,null,null,null,null,null,null,null,null,null,"Top Rail Reinf.",0,0,0,null,"8001","Length","Weight/ft","Weight",null,null,null,{"$error":"#N/A"},0,{"$f":"IF(AND(AP51=14,$AN$4>=51,$AN$4<=56),\"Dbl.\"&AP51&\"G\",0)","v":{"$error":"#N/A"}},null,null,{"$error":"#N/A"},0,{"$f":"IF(AND(AU51=14,$AS$4>=51,$AS$4<=56),\"Dbl.\"&AU51&\"G\",0)","v":{"$error":"#N/A"}},null,null,null,null,null,null,null,null,null,null,null,null,null,null,null,null,null,null,null,null,null,null,null,null,null,null,null,null,null,null,null,null,null,null,null,null,null,null,null,null,null,null,null,null,null,null,null,null,null,null,null,null,null,null,null,null,null,null,null,null,null,{"$error":"#N/A"},{"$error":"#N/A"},{"$f":"IF(AND(DG51=22,$DE$4>=31,$DE$4<=34),DG51&\"G\",0)","v":{"$error":"#N/A"}},null,null,{"$error":"#N/A"},{"$error":"#N/A"},{"$f":"IF(AND(DL51=22,$DJ$4>=31,$DJ$4<=34),DL51&\"G\",0)","v":{"$error":"#N/A"}}]
[null,53,"8/9/9","BK",null,53,999,"NAT",null,null,null,null,null,null,null,null,null,null,null,null,null,null,null,null,null,null,null,null,"Top Stile Reinf",0,0,0,null,"Top Top Rail",{"$f":"(Data!$D$842)/12","v":0},0.34100000000000003,{"$f":"AI52*AJ52","v":0},null,null,null,{"$error":"#N/A"},0,{"$f":"IF(AND(AP52=14,$AN$4>=57,$AN$4<=62),\"Dbl.\"&AP52&\"H\",0)","v":{"$error":"#N/A"}},null,null,{"$error":"#N/A"},0,{"$f":"IF(AND(AU52=14,$AS$4>=57,$AS$4<=62),\"Dbl.\"&AU52&\"H\",0)","v":{"$error":"#N/A"}},null,null,null,null,null,null,null,null,null,null,null,null,null,null,null,null,null,null,null,null,null,null,null,null,null,null,null,null,null,null,null,null,null,null,null,null,null,null,null,null,null,null,null,null,null,null,null,null,null,null,null,null,null,null,null,null,null,null,null,null,null,{"$error":"#N/A"},{"$error":"#N/A"},{"$f":"IF(AND(DG52=22,$DE$4>=35,$DE$4<=37),DG52&\"H\",0)","v":{"$error":"#N/A"}},null,null,{"$error":"#N/A"},{"$error":"#N/A"},{"$f":"IF(AND(DL52=22,$DJ$4>=35,$DJ$4<=37),DL52&\"H\",0)","v":{"$error":"#N/A"}}]
[null,54,"9/9/10","PU",null,54,999,"NAT",null,null,null,null,null,null,null,null,null,null,null,null,null,null,null,null,null,null,null,null,"Top Glass",0,0,0,null,"Top Bottom Rail",{"$f":"(Data!$D$842)/12","v":0},0.38400000000000001,0,null,null,null,{"$error":"#N/A"},0,{"$f":"IF(AND(AP53=14,$AN$4>=63,$AN$4<=68),\"Dbl.\"&AP53&\"I\",0)","v":{"$error":"#N/A"}},null,null,{"$error":"#N/A"},0,{"$f":"IF(AND(AU53=14,$AS$4>=63,$AS$4<=68),\"Dbl.\"&AU53&\"I\",0)","v":{"$error":"#N/A"}},null,null,null,null,null,null,null,null,null,null,null,null,null,null,null,null,null,null,null,null,null,null,null,null,null,null,null,null,null,null,null,null,null,null,null,null,null,null,null,null,null,null,null,null,null,null,null,null,null,null,null,null,null,null,null,null,null,null,null,null,null,{"$error":"#N/A"},{"$f":"IF(AND($DF$4<=24,$DF$4>22),24,0)","v":{"$error":"#N/A"}},{"$f":"IF(AND(DG53=24,$DE$4>=6,$DE$4<=10),DG53&\"A\",0)","v":{"$error":"#N/A"}},null,null,{"$error":"#N/A"},{"$f":"IF(AND($DK$4<=24,$DK$4>22),24,0)","v":{"$error":"#N/A"}},{"$f":"IF(AND(DL53=24,$DJ$4>=6,$DJ$4<=10),DL53&\"A\",0)","v":{"$error":"#N/A"}}]
[null,55,"9/9/10","PU",null,55,6679,"BU",null,null,null,null,null,null,null,null,null,null,null,null,null,null,null,null,null,null,null,null,"Top Spacer",0,0,0,null,"Top Stile",{"$f":"(Data!$D$843*2)/12","v":0},0.311,0,null,null,null,{"$error":"#N/A"},{"$f":"IF(AND($AO$4<=16,$AO$4>14),16,0)","v":0},{"$f":"IF(AND(AP54=16,$AN$4>=3,$AN$4<=7),AP54&\"A\",0)","v":{"$error":"#N/A"}},null,null,{"$error":"#N/A"},{"$f":"IF(AND($AT$4<=16,$AT$4>14),16,0)","v":0},{"$f":"IF(AND(AU54=16,$AS$4>=3,$AS$4<=7),AU54&\"A\",0)","v":{"$error":"#N/A"}},null,null,null,null,null,null,null,null,null,null,null,null,null,null,null,null,null,null,null,null,null,null,null,null,null,null,null,null,null,null,null,null,null,null,null,null,null,null,null,null,null,null,null,null,null,null,null,null,null,null,null,null,null,null,null,null,null,null,null,null,null,{"$error":"#N/A"},{"$error":"#N/A"},{"$f":"IF(AND(DG54=24,$DE$4>=11,$DE$4<=17),DG54&\"B\",0)","v":{"$error":"#N/A"}},null,null,{"$error":"#N/A"},{"$error":"#N/A"},{"$f":"IF(AND(DL54=24,$DJ$4>=11,$DJ$4<=17),DL54&\"B\",0)","v":{"$error":"#N/A"}}]
[null,56,"9/9/10","PU",null,56,6679,"BU",null,null,null,null,null,null,null,null,null,null,null,null,null,null,null,null,null,null,null,null,"Top Hardware",0,0,0,null,"Top Stile Reinf.",{"$f":"IF(CMR!$L$79>26.75,TRUNC((CMR!$L$74-9.5)/2)*2,0)","v":0},0,0,null,null,null,{"$error":"#N/A"},0,{"$f":"IF(AND(AP55=16,$AN$4>=8,$AN$4<=10),AP55&\"B\",0)","v":{"$error":"#N/A"}},null,null,{"$error":"#N/A"},0,{"$f":"IF(AND(AU55=16,$AS$4>=8,$AS$4<=10),AU55&\"B\",0)","v":{"$error":"#N/A"}},null,null,null,null,null,null,null,null,null,null,null,null,null,null,null,null,null,null,null,null,null,null,null,null,null,null,null,null,null,null,null,null,null,null,null,null,null,null,null,null,null,null,null,null,null,null,null,null,null,null,null,null,null,null,null,null,null,null,null,null,null,{"$error":"#N/A"},{"$error":"#N/A"},{"$f":"IF(AND(DG55=24,$DE$4>=18,$DE$4<=22),DG55&\"C\",0)","v":{"$error":"#N/A"}},null,null,{"$error":"#N/A"},{"$error":"#N/A"},{"$f":"IF(AND(DL55=24,$DJ$4>=18,$DJ$4<=22),DL55&\"C\",0)","v":{"$error":"#N/A"}}]
[null,57,"9/9/10","PU",null,57,6779,"LG",null,null,null,null,null,null,null,null,null,null,null,null,null,null,null,null,null,null,null,null,"Top Bead",0,0,0,null,"Keeper Bead",{"$f":"(INT((Data!$D$842-1.197)*32+0.5)/32)/12","v":-9.8958333333333329E-2},9.7000000000000003E-2,-9.5989583333333326E-3,null,null,null,{"$error":"#N/A"},0,{"$f":"IF(AND(AP56=16,$AN$4>=11,$AN$4<=16),AP56&\"C\",0)","v":{"$error":"#N/A"}},null,null,{"$error":"#N/A"},0,{"$f":"IF(AND(AU56=16,$AS$4>=11,$AS$4<=16),AU56&\"C\",0)","v":{"$error":"#N/A"}},null,null,null,null,null,null,null,null,null,null,null,null,null,null,null,null,null,null,null,null,null,null,null,null,null,null,null,null,null,null,null,null,null,null,null,null,null,null,null,null,null,null,null,null,null,null,null,null,null,null,null,null,null,null,null,null,null,null,null,null,null,{"$error":"#N/A"},{"$error":"#N/A"},{"$f":"IF(AND(DG56=24,$DE$4>=23,$DE$4<=25),DG56&\"D\",0)","v":{"$error":"#N/A"}},null,null,{"$error":"#N/A"},{"$error":"#N/A"},{"$f":"IF(AND(DL56=24,$DJ$4>=23,$DJ$4<=25),DL56&\"D\",0)","v":{"$error":"#N/A"}}]
[null,58,"10/10/10","PK",null,58,6779,"LG",null,null,null,null,null,null,null,null,null,null,null,null,null,null,null,null,null,null,null,null,"Bottom Top Rail",{"$f":"(Frame_Width-2.25)/12","v":-0.1875},0.24099999999999999,{"$f":"AD57*AE57","v":-4.5187499999999999E-2},null,"Top Glass",{"$f":"(CMR!$L$77*CMR!$L$79)/144","v":0.1357693142361111},{"$f":"$L$12","v":3.2},0.43446180555555558,null,null,null,{"$error":"#N/A"},0,{"$f":"IF(AND(AP57=16,$AN$4>=17,$AN$4<=19),AP57&\"D\",0)","v":{"$error":"#N/A"}},null,null,{"$error":"#N/A"},0,{"$f":"IF(AND(AU57=16,$AS$4>=17,$AS$4<=19),AU57&\"D\",0)","v":{"$error":"#N/A"}},null,null,null,null,null,null,null,null,null,null,null,null,null,null,null,null,null,null,null,null,null,null,null,null,null,null,null,null,null,null,null,null,null,null,null,null,null,null,null,null,null,null,null,null,null,null,null,null,null,null,null,null,null,null,null,null,null,null,null,null,null,{"$error":"#N/A"},{"$error":"#N/A"},{"$f":"IF(AND(DG57=24,$DE$4>=26,$DE$4<=28),DG57&\"E\",0)","v":{"$error":"#N/A"}},null,null,{"$error":"#N/A"},{"$error":"#N/A"},{"$f":"IF(AND(DL57=24,$DJ$4>=26,$DJ$4<=28),DL57&\"E\",0)","v":{"$error":"#N/A"}}]
[null,59,"10/10/10","PK",null,59,7779,"WT",null,null,null,null,null,null,null,null,null,null,null,null,null,null,null,null,null,null,null,null,"Bottom Bottom Rail",{"$f":"(Frame_Width-2.25)/12","v":-0.1875},0.25,-4.6875E-2,null,"Top Spacer",{"$f":"((CMR!$L$77*2)+(CMR!$L$79*2))/12","v":-1.5208333333333333},3.4000000000000002E-2,-5.1708333333333335E-2,null,null,null,{"$error":"#N/A"},0,{"$f":"IF(AND(AP58=16,$AN$4>=20,$AN$4<=22),AP58&\"E\",0)","v":{"$error":"#N/A"}},null,null,{"$error":"#N/A"},0,{"$f":"IF(AND(AU58=16,$AS$4>=20,$AS$4<=22),AU58&\"E\",0)","v":{"$error":"#N/A"}},null,null,null,null,null,null,null,null,null,null,null,null,null,null,null,null,null,null,null,null,null,null,null,null,null,null,null,null,null,null,null,null,null,null,null,null,null,null,null,null,null,null,null,null,null,null,null,null,null,null,null,null,null,null,null,null,null,null,null,null,null,{"$error":"#N/A"},{"$error":"#N/A"},{"$f":"IF(AND(DG58=24,$DE$4>=29,$DE$4<=30),DG58&\"F\",0)","v":{"$error":"#N/A"}},null,null,{"$error":"#N/A"},{"$error":"#N/A"},{"$f":"IF(AND(DL58=24,$DJ$4>=29,$DJ$4<=30),DL58&\"F\",0)","v":{"$error":"#N/A"}}]
[null,60,"10/10/10","PK",null,60,7779,"WT",null,null,null,null,null,null,null,null,null,null,null,null,null,null,null,null,null,null,null,null,"Bottom Stile",{"$f":"((CMR!L27-0.75)*2)/12","v":-0.125},0.23,-2.8750000000000001E-2,null,"Top Hardware",1,0.2,0.2,null,null,null,{"$error":"#N/A"},0,{"$f":"IF(AND(AP59=16,$AN$4>=23,$AN$4<=24),AP59&\"F\",0)","v":{"$error":"#N/A"}},null,null,{"$error":"#N/A"},0,{"$f":"IF(AND(AU59=16,$AS$4>=23,$AS$4<=24),AU59&\"F\",0)","v":{"$error":"#N/A"}},null,null,null,null,null,null,null,null,null,null,null,null,null,null,null,null,null,null,null,null,null,null,null,null,null,null,null,null,null,null,null,null,null,null,null,null,null,null,null,null,null,null,null,null,null,null,null,null,null,null,null,null,null,null,null,null,null,null,null,null,null,{"$error":"#N/A"},{"$error":"#N/A"},{"$f":"IF(AND(DG59=24,$DE$4>=31,$DE$4<=34),DG59&\"G\",0)","v":{"$error":"#N/A"}},null,null,{"$error":"#N/A"},{"$error":"#N/A"},{"$f":"IF(AND(DL59=24,$DJ$4>=31,$DJ$4<=34),DL59&\"G\",0)","v":{"$error":"#N/A"}}]
[null,61,"10/10/10","PK",null,61,6799,"OR",null,null,null,null,null,null,null,null,null,null,null,null,null,null,null,null,null,null,null,null,"Bottom Rail Reinf.",{"$f":"(TRUNC(((AD57*12)-6)/2)*2)/12","v":-0.66666666666666663},0.32800000000000001,-0.21866666666666668,null,"Top Handle Bead",{"$f":"AI56","v":-9.8958333333333329E-2},9.7000000000000003E-2,-9.5989583333333326E-3,null,null,null,{"$error":"#N/A"},0,{"$f":"IF(AND(AP60=16,$AN$4>=25,$AN$4<=28),AP60&\"G\",0)","v":{"$error":"#N/A"}},null,null,{"$error":"#N/A"},0,{"$f":"IF(AND(AU60=16,$AS$4>=25,$AS$4<=28),AU60&\"G\",0)","v":{"$error":"#N/A"}},null,null,null,null,null,null,null,null,null,null,null,null,null,null,null,null,null,null,null,null,null,null,null,null,null,null,null,null,null,null,null,null,null,null,null,null,null,null,null,null,null,null,null,null,null,null,null,null,null,null,null,null,null,null,null,null,null,null,null,null,null,{"$error":"#N/A"},{"$error":"#N/A"},{"$f":"IF(AND(DG60=24,$DE$4>=35,$DE$4<=37),DG60&\"H\",0)","v":{"$error":"#N/A"}},null,null,{"$error":"#N/A"},{"$error":"#N/A"},{"$f":"IF(AND(DL60=24,$DJ$4>=35,$DJ$4<=37),DL60&\"H\",0)","v":{"$error":"#N/A"}}]
[null,62,"8/8/8/8","BN",null,62,6799,"OR",null,null,null,null,null,null,null,null,null,null,null,null,null,null,null,null,null,null,null,null,"Bottom Stile Reinf.",{"$f":"IF(CMR!$L$32>=27.5,(((CMR!$L$32-4.5)/2)*2)/12,0)","v":0},0.23799999999999999,0,null,"Top Vert. Bead",{"$f":"(2*(INT((Data!$D$843-1.197)*32+0.5)/32))/12","v":-0.19791666666666666},9.7000000000000003E-2,-1.9197916666666665E-2,null,null,null,{"$error":"#N/A"},0,{"$f":"IF(AND(AP61=16,$AN$4>=29,$AN$4<=31),AP61&\"H\",0)","v":{"$error":"#N/A"}},null,null,{"$error":"#N/A"},0,{"$f":"IF(AND(AU61=16,$AS$4>=29,$AS$4<=31),AU61&\"H\",0)","v":{"$error":"#N/A"}},null,null,null,null,null,null,null,null,null,null,null,null,null,null,null,null,null,null,null,null,null,null,null,null,null,null,null,null,null,null,null,null,null,null,null,null,null,null,null,null,null,null,null,null,null,null,null,null,null,null,null,null,null,null,null,null,null,null,null,null,null,{"$error":"#N/A"},{"$f":"IF(AND($DF$4<=26,$DF$4>24),26,0)","v":{"$error":"#N/A"}},{"$f":"IF(AND(DG61=26,$DE$4>=6,$DE$4<=11),DG61&\"A\",0)","v":{"$error":"#N/A"}},null,null,{"$error":"#N/A"},{"$f":"IF(AND($DK$4<=26,$DK$4>24),26,0)","v":{"$error":"#N/A"}},{"$f":"IF(AND(DL61=26,$DJ$4>=6,$DJ$4<=11),DL61&\"A\",0)","v":{"$error":"#N/A"}}]
[null,63,"8/8/8/8","BN",null,63,7799,"BN",null,null,null,null,null,null,null,null,null,null,null,null,null,null,null,null,null,null,null,null,"Bottom Glass",{"$f":"(CMR!$L$30*CMR!$L$32)/144","v":6.3910590277777776E-2},{"$f":"$L$12","v":3.2},0.20451388888888888,null,"Bottom Top Rail",{"$f":"(Data!$D$844)/12","v":0},0.42799999999999999,0,null,null,null,{"$error":"#N/A"},0,{"$f":"IF(AND(AP62=16,$AN$4>=32,$AN$4<=34),AP62&\"I\",0)","v":{"$error":"#N/A"}},null,null,{"$error":"#N/A"},0,{"$f":"IF(AND(AU62=16,$AS$4>=32,$AS$4<=34),AU62&\"I\",0)","v":{"$error":"#N/A"}},null,null,null,null,null,null,null,null,null,null,null,null,null,null,null,null,null,null,null,null,null,null,null,null,null,null,null,null,null,null,null,null,null,null,null,null,null,null,null,null,null,null,null,null,null,null,null,null,null,null,null,null,null,null,null,null,null,null,null,null,null,{"$error":"#N/A"},{"$error":"#N/A"},{"$f":"IF(AND(DG62=26,$DE$4>=12,$DE$4<=17),DG62&\"B\",0)","v":{"$error":"#N/A"}},null,null,{"$error":"#N/A"},{"$error":"#N/A"},{"$f":"IF(AND(DL62=26,$DJ$4>=12,$DJ$4<=17),DL62&\"B\",0)","v":{"$error":"#N/A"}}]
[null,64,"8/8/8/8","BN",null,64,7799,"BN",null,null,null,null,null,null,null,null,null,null,null,null,null,null,null,null,null,null,null,null,"Bottom Spacer",{"$f":"((CMR!$L$30*2)+(CMR!$L$32*2))/12","v":-1.0416666666666667},5.3600000000000002E-2,-5.5833333333333339E-2,null,"Bottom Bottom Rail",{"$f":"(Data!$D$844)/12","v":0},0.443,0,null,null,null,{"$error":"#N/A"},0,{"$f":"IF(AND(AP63=16,$AN$4>=35,$AN$4<=36),\"Dbl.\"&AP63&\"D\",0)","v":{"$error":"#N/A"}},null,null,{"$error":"#N/A"},0,{"$f":"IF(AND(AU63=16,$AS$4>=35,$AS$4<=36),\"Dbl.\"&AU63&\"D\",0)","v":{"$error":"#N/A"}},null,null,null,null,null,null,null,null,null,null,null,null,null,null,null,null,null,null,null,null,null,null,null,null,null,null,null,null,null,null,null,null,null,null,null,null,null,null,null,null,null,null,null,null,null,null,null,null,null,null,null,null,null,null,null,null,null,null,null,null,null,{"$error":"#N/A"},{"$error":"#N/A"},{"$f":"IF(AND(DG63=26,$DE$4>=18,$DE$4<=22),DG63&\"C\",0)","v":{"$error":"#N/A"}},null,null,{"$error":"#N/A"},{"$error":"#N/A"},{"$f":"IF(AND(DL63=26,$DJ$4>=18,$DJ$4<=22),DL63&\"C\",0)","v":{"$error":"#N/A"}}]
[null,65,"8/8/8/8","BN",null,65,7899,"GN",null,null,null,null,null,null,null,null,null,null,null,null,null,null,null,null,null,null,null,null,"Bottom Hardware",1,0.36,0.36,null,"Bottom Stile",{"$f":"(2*(Data!$D$845))/12","v":0},0.378,0,null,null,null,{"$error":"#N/A"},0,{"$f":"IF(AND(AP64=16,$AN$4>=37,$AN$4<=44),\"Dbl.\"&AP64&\"E\",0)","v":{"$error":"#N/A"}},null,null,{"$error":"#N/A"},0,{"$f":"IF(AND(AU64=16,$AS$4>=37,$AS$4<=44),\"Dbl.\"&AU64&\"E\",0)","v":{"$error":"#N/A"}},null,null,null,null,null,null,null,null,null,null,null,null,null,null,null,null,null,null,null,null,null,null,null,null,null,null,null,null,null,null,null,null,null,null,null,null,null,null,null,null,null,null,null,null,null,null,null,null,null,null,null,null,null,null,null,null,null,null,null,null,null,{"$error":"#N/A"},{"$error":"#N/A"},{"$f":"IF(AND(DG64=26,$DE$4>=23,$DE$4<=26),DG64&\"D\",0)","v":{"$error":"#N/A"}},null,null,{"$error":"#N/A"},{"$error":"#N/A"},{"$f":"IF(AND(DL64=26,$DJ$4>=23,$DJ$4<=26),DL64&\"D\",0)","v":{"$error":"#N/A"}}]
[null,66,"8/8/9/9","RD",null,66,7899,"GN",null,null,null,null,null,null,null,null,null,null,null,null,null,null,null,null,null,null,null,null,"Bottom Bead",{"$f":"(((Frame_Width-3.3125)*2)+((CMR!$L$27-1.8125)*2))/12","v":-0.85416666666666663},2.8000000000000001E-2,-2.3916666666666666E-2,null,"Lock Rail Reinf.",{"$f":"(INT((Data!$D$844-6)/2)*2)/12","v":-0.5},0.31840000000000002,-0.15920000000000001,null,null,null,{"$error":"#N/A"},0,{"$f":"IF(AND(AP65=16,$AN$4>=45,$AN$4<=48),\"Dbl.\"&AP65&\"F\",0)","v":{"$error":"#N/A"}},null,null,{"$error":"#N/A"},0,{"$f":"IF(AND(AU65=16,$AS$4>=45,$AS$4<=48),\"Dbl.\"&AU65&\"F\",0)","v":{"$error":"#N/A"}},null,null,null,null,null,null,null,null,null,null,null,null,null,null,null,null,null,null,null,null,null,null,null,null,null,null,null,null,null,null,null,null,null,null,null,null,null,null,null,null,null,null,null,null,null,null,null,null,null,null,null,null,null,null,null,null,null,null,null,null,null,{"$error":"#N/A"},{"$error":"#N/A"},{"$f":"IF(AND(DG65=26,$DE$4>=27,$DE$4<=30),DG65&\"E\",0)","v":{"$error":"#N/A"}},null,null,{"$error":"#N/A"},{"$error":"#N/A"},{"$f":"IF(AND(DL65=26,$DJ$4>=27,$DJ$4<=30),DL65&\"E\",0)","v":{"$error":"#N/A"}}]
[null,67,"8/8/9/9","RD",null,67,8899,"RD",null,null,null,null,null,null,null,null,null,null,null,null,null,null,null,null,null,null,null,null,null,null,"Top Sash",{"$f":"IF(ModelNo=\"02A0\",ROUND((SUM(AF48:AF56)),0),0)","v":0},null,"Bottom Stile Reinf.",{"$f":"IF(CMR!$L$80>27.75,TRUNC((CMR!$L$75-4.5)/2)*2,0)","v":0},0,0,null,null,null,{"$error":"#N/A"},0,{"$f":"IF(AND(AP66=16,$AN$4>=49,$AN$4<=56),\"Dbl.\"&AP66&\"G\",0)","v":{"$error":"#N/A"}},null,null,{"$error":"#N/A"},0,{"$f":"IF(AND(AU66=16,$AS$4>=49,$AS$4<=56),\"Dbl.\"&AU66&\"G\",0)","v":{"$error":"#N/A"}},null,null,null,null,null,null,null,null,null,null,null,null,null,null,null,null,null,null,null,null,null,null,null,null,null,null,null,null,null,null,null,null,null,null,null,null,null,null,null,null,null,null,null,null,null,null,null,null,null,null,null,null,null,null,null,null,null,null,null,null,null,{"$error":"#N/A"},{"$error":"#N/A"},{"$f":"IF(AND(DG66=26,$DE$4>=31,$DE$4<=34),DG66&\"F\",0)","v":{"$error":"#N/A"}},null,null,{"$error":"#N/A"},{"$error":"#N/A"},{"$f":"IF(AND(DL66=26,$DJ$4>=31,$DJ$4<=34),DL66&\"F\",0)","v":{"$error":"#N/A"}}]
[null,68,"8/8/9/9","RD",null,68,8899,"RD",null,null,null,null,null,null,null,null,null,null,null,null,null,null,null,null,null,null,null,null,null,null,"Bottom Sash",{"$f":"IF(OR(ModelNo=\"02A0\",ModelNo=\"S140\",ModelNo=\"S144\",ModelNo=\"S146\",ModelNo=\"S140 (HP)\",ModelNo=\"S144 (HP)\",ModelNo=\"S146 (HP)\"),TRUNC((SUM(AF57:AF65))),0)","v":0},null,"Bottom Glass",{"$f":"(CMR!$L$78*CMR!$L$80)/144","v":0.1357693142361111},{"$f":"$L$12","v":3.2},0.43446180555555558,null,null,null,{"$error":"#N/A"},0,{"$f":"IF(AND(AP67=16,$AN$4>=57,$AN$4<=62),\"Dbl.\"&AP67&\"H\",0)","v":{"$error":"#N/A"}},null,null,{"$error":"#N/A"},0,{"$f":"IF(AND(AU67=16,$AS$4>=57,$AS$4<=62),\"Dbl.\"&AU67&\"H\",0)","v":{"$error":"#N/A"}},null,null,null,null,null,null,null,null,null,null,null,null,null,null,null,null,null,null,null,null,null,null,null,null,null,null,null,null,null,null,null,null,null,null,null,null,null,null,null,null,null,null,null,null,null,null,null,null,null,null,null,null,null,null,null,null,null,null,null,null,null,{"$error":"#N/A"},{"$error":"#N/A"},{"$f":"IF(AND(DG67=26,$DE$4>=35,$DE$4<=38),DG67&\"G\",0)","v":{"$error":"#N/A"}},null,null,{"$error":"#N/A"},{"$error":"#N/A"},{"$f":"IF(AND(DL67=26,$DJ$4>=35,$DJ$4<=38),DL67&\"G\",0)","v":{"$error":"#N/A"}}]
[null,69,"8/8/9/9","RD",null,69,8999,"YW",null,null,null,null,null,null,null,null,null,null,null,null,null,null,null,null,null,null,null,null,null,null,null,null,null,"Bottom Spacer",{"$f":"((CMR!$L$78*2)+(CMR!$L$80*2))/12","v":-1.5208333333333333},3.4000000000000002E-2,-5.1708333333333335E-2,null,null,null,{"$error":"#N/A"},0,{"$f":"IF(AND(AP68=16,$AN$4>=63,$AN$4<=68),\"Dbl.\"&AP68&\"I\",0)","v":{"$error":"#N/A"}},null,null,{"$error":"#N/A"},0,{"$f":"IF(AND(AU68=16,$AS$4>=63,$AS$4<=68),\"Dbl.\"&AU68&\"I\",0)","v":{"$error":"#N/A"}},null,null,null,null,null,null,null,null,null,null,null,null,null,null,null,null,null,null,null,null,null,null,null,null,null,null,null,null,null,null,null,null,null,null,null,null,null,null,null,null,null,null,null,null,null,null,null,null,null,null,null,null,null,null,null,null,null,null,null,null,null,{"$error":"#N/A"},{"$error":"#N/A"},{"$f":"IF(AND(DG68=26,$DE$4>=39,$DE$4<=42),DG68&\"H\",0)","v":{"$error":"#N/A"}},null,null,{"$error":"#N/A"},{"$error":"#N/A"},{"$f":"IF(AND(DL68=26,$DJ$4>=39,$DJ$4<=42),DL68&\"H\",0)","v":{"$error":"#N/A"}}]
[null,70,"9/9/9/9","PU",null,70,8999,"YW",null,null,null,null,null,null,null,null,null,null,null,null,null,null,null,null,null,null,null,null,"0301","Length","Weight/ft","Weight",null,"Bottom Hardware",1,0.36,0.36,null,null,null,{"$f":"IF(AND(AP69>0,AQ69>0),AP69,0)","v":{"$error":"#N/A"}},{"$f":"IF(AND($AO$4<=18,$AO$4>16),18,0)","v":0},{"$f":"IF(AND(AP69=18,$AN$4>=4,$AN$4<=9),AP69&\"A\",0)","v":{"$error":"#N/A"}},null,null,{"$f":"IF(AND(AU69>0,AV69>0),AU69,0)","v":{"$error":"#N/A"}},{"$f":"IF(AND($AT$4<=18,$AT$4>16),18,0)","v":0},{"$f":"IF(AND(AU69=18,$AS$4>=4,$AS$4<=9),AU69&\"A\",0)","v":{"$error":"#N/A"}},null,null,null,null,null,null,null,null,null,null,null,null,null,null,null,null,null,null,null,null,null,null,null,null,null,null,null,null,null,null,null,null,null,null,null,null,null,null,null,null,null,null,null,null,null,null,null,null,null,null,null,null,null,null,null,null,null,null,null,null,null,{"$f":"IF(AND(DG69>0,DH69>0),DG69,0)","v":{"$error":"#N/A"}},{"$f":"IF(AND($DF$4<=28,$DF$4>26),28,0)","v":{"$error":"#N/A"}},{"$f":"IF(AND(DG69=28,$DE$4>=7,$DE$4<=12),DG69&\"A\",0)","v":{"$error":"#N/A"}},null,null,{"$f":"IF(AND(DL69>0,DM69>0),DL69,0)","v":{"$error":"#N/A"}},{"$f":"IF(AND($DK$4<=28,$DK$4>26),28,0)","v":{"$error":"#N/A"}},{"$f":"IF(AND(DL69=28,$DJ$4>=7,$DJ$4<=12),DL69&\"A\",0)","v":{"$error":"#N/A"}}]
[null,71,"9/9/9/9","PU",null,71,9999,"PU",null,null,null,null,null,null,null,null,null,null,null,null,null,null,null,null,null,null,null,null,"Top Top Rail",{"$f":"(Frame_Width-3.25)/12","v":-0.27083333333333331},0.25700000000000001,{"$f":"AD70*AE70","v":-6.9604166666666661E-2},null,"Bott. Hor. Bead",{"$f":"(2*(INT((Data!$D$844-2.197)*32+0.5)/32))/12","v":-0.36458333333333331},9.7000000000000003E-2,-3.5364583333333331E-2,null,null,null,{"$error":"#N/A"},0,{"$f":"IF(AND(AP70=18,$AN$4>=10,$AN$4<=13),AP70&\"B\",0)","v":{"$error":"#N/A"}},null,null,{"$error":"#N/A"},0,{"$f":"IF(AND(AU70=18,$AS$4>=10,$AS$4<=13),AU70&\"B\",0)","v":{"$error":"#N/A"}},null,null,null,null,null,null,null,null,null,null,null,null,null,null,null,null,null,null,null,null,null,null,null,null,null,null,null,null,null,null,null,null,null,null,null,null,null,null,null,null,null,null,null,null,null,null,null,null,null,null,null,null,null,null,null,null,null,null,null,null,null,{"$error":"#N/A"},{"$error":"#N/A"},{"$f":"IF(AND(DG70=28,$DE$4>=13,$DE$4<=18),DG70&\"B\",0)","v":{"$error":"#N/A"}},null,null,{"$error":"#N/A"},{"$error":"#N/A"},{"$f":"IF(AND(DL70=28,$DJ$4>=13,$DJ$4<=18),DL70&\"B\",0)","v":{"$error":"#N/A"}}]
[null,72,"9/9/9/9","PU",null,72,9999,"PU",null,null,null,null,null,null,null,null,null,null,null,null,null,null,null,null,null,null,null,null,"Top Bottom Rail",{"$f":"(Frame_Width-3.25)/12","v":-0.27083333333333331},0.27300000000000002,-7.3937500000000003E-2,null,"Bottom Vert. Bead",{"$f":"(2*(INT((Data!$D$845-2.197)*32+0.5)/32))/12","v":-0.36458333333333331},9.7000000000000003E-2,-3.5364583333333331E-2,null,null,null,{"$error":"#N/A"},0,{"$f":"IF(AND(AP71=18,$AN$4>=14,$AN$4<=18),AP71&\"C\",0)","v":{"$error":"#N/A"}},null,null,{"$error":"#N/A"},0,{"$f":"IF(AND(AU71=18,$AS$4>=14,$AS$4<=18),AU71&\"C\",0)","v":{"$error":"#N/A"}},null,null,null,null,null,null,null,null,null,null,null,null,null,null,null,null,null,null,null,null,null,null,null,null,null,null,null,null,null,null,null,null,null,null,null,null,null,null,null,null,null,null,null,null,null,null,null,null,null,null,null,null,null,null,null,null,null,null,null,null,null,{"$error":"#N/A"},{"$error":"#N/A"},{"$f":"IF(AND(DG71=28,$DE$4>=19,$DE$4<=23),DG71&\"C\",0)","v":{"$error":"#N/A"}},null,null,{"$error":"#N/A"},{"$error":"#N/A"},{"$f":"IF(AND(DL71=28,$DJ$4>=19,$DJ$4<=23),DL71&\"C\",0)","v":{"$error":"#N/A"}}]
[null,73,"9/9/9/9","PU",null,null,null,null,null,null,null,null,null,null,null,null,null,null,null,null,null,null,null,null,null,null,null,null,"Top Stile",{"$f":"(2*(CMR!$E$42-1.625))/12","v":-0.27083333333333331},0.23300000000000001,-6.310416666666667E-2,null,null,null,"Top Sash",{"$f":"IF(OR(ModelNo=\"8001\",ModelNo=\"R601\"),(TRUNC((SUM(AK52:AK61))))+6.5,0)","v":0},null,null,null,{"$error":"#N/A"},0,{"$f":"IF(AND(AP72=18,$AN$4>=19,$AN$4<=21),AP72&\"D\",0)","v":{"$error":"#N/A"}},null,null,{"$error":"#N/A"},0,{"$f":"IF(AND(AU72=18,$AS$4>=19,$AS$4<=21),AU72&\"D\",0)","v":{"$error":"#N/A"}},null,null,null,null,null,null,null,null,null,null,null,null,null,null,null,null,null,null,null,null,null,null,null,null,null,null,null,null,null,null,null,null,null,null,null,null,null,null,null,null,null,null,null,null,null,null,null,null,null,null,null,null,null,null,null,null,null,null,null,null,null,{"$error":"#N/A"},{"$error":"#N/A"},{"$f":"IF(AND(DG72=28,$DE$4>=24,$DE$4<=28),DG72&\"D\",0)","v":{"$error":"#N/A"}},null,null,{"$error":"#N/A"},{"$error":"#N/A"},{"$f":"IF(AND(DL72=28,$DJ$4>=24,$DJ$4<=28),DL72&\"D\",0)","v":{"$error":"#N/A"}}]
[null,74,"9/9/9/9","PU",null,null,null,null,null,null,null,null,null,null,null,null,null,null,null,null,null,null,null,null,null,null,null,null,"Top Rail Reinf.",{"$f":"(TRUNC(((Frame_Width-3.25)-6)/2)*2)/12","v":-0.66666666666666663},0.29899999999999999,-0.19933333333333331,null,null,null,"Bottom Sash",{"$f":"IF(OR(ModelNo=\"8001\",ModelNo=\"R601\"),TRUNC((SUM(AK62:AK71))),0)","v":0},null,null,null,{"$error":"#N/A"},0,{"$f":"IF(AND(AP73=18,$AN$4>=22,$AN$4<=24),AP73&\"E\",0)","v":{"$error":"#N/A"}},null,null,{"$error":"#N/A"},0,{"$f":"IF(AND(AU73=18,$AS$4>=22,$AS$4<=24),AU73&\"E\",0)","v":{"$error":"#N/A"}},null,null,null,null,null,null,null,null,null,null,null,null,null,null,null,null,null,null,null,null,null,null,null,null,null,null,null,null,null,null,null,null,null,null,null,null,null,null,null,null,null,null,null,null,null,null,null,null,null,null,null,null,null,null,null,null,null,null,null,null,null,{"$error":"#N/A"},{"$error":"#N/A"},{"$f":"IF(AND(DG73=28,$DE$4>=29,$DE$4<=32),DG73&\"E\",0)","v":{"$error":"#N/A"}},null,null,{"$error":"#N/A"},{"$error":"#N/A"},{"$f":"IF(AND(DL73=28,$DJ$4>=29,$DJ$4<=32),DL73&\"E\",0)","v":{"$error":"#N/A"}}]
[null,null,null,null,null,4,3,1,null,null,null,null,null,null,null,null,null,null,null,null,null,null,null,null,null,null,null,null,"Top Stile Reinf",{"$f":"IF(CMR!$E$47>26.6875,((TRUNC((CMR!$E$42-9.5)/2)*2)/12)*2,0)","v":0},0.29899999999999999,0,null,null,null,null,null,null,null,null,{"$error":"#N/A"},0,{"$f":"IF(AND(AP74=18,$AN$4>=25,$AN$4<=26),AP74&\"F\",0)","v":{"$error":"#N/A"}},null,null,{"$error":"#N/A"},0,{"$f":"IF(AND(AU74=18,$AS$4>=25,$AS$4<=26),AU74&\"F\",0)","v":{"$error":"#N/A"}},null,null,null,null,null,null,null,null,null,null,null,null,null,null,null,null,null,null,null,null,null,null,null,null,null,null,null,null,null,null,null,null,null,null,null,null,null,null,null,null,null,null,null,null,null,null,null,null,null,null,null,null,null,null,null,null,null,null,null,null,null,{"$error":"#N/A"},{"$error":"#N/A"},{"$f":"IF(AND(DG74=28,$DE$4>=33,$DE$4<=36),DG74&\"F\",0)","v":{"$error":"#N/A"}},null,null,{"$error":"#N/A"},{"$error":"#N/A"},{"$f":"IF(AND(DL74=28,$DJ$4>=33,$DJ$4<=36),DL74&\"F\",0)","v":{"$error":"#N/A"}}]
[null,null,null,null,null,{"$f":"F74+1","v":5},3,1,null,null,null,null,null,null,null,null,null,null,null,null,null,null,null,null,null,null,null,null,"Top Glass",{"$f":"(CMR!$E$45*CMR!$E$47)/144","v":5.126953125E-2},{"$f":"$L$12","v":3.2},0.1640625,null,"9001","Length","Weight/ft","Weight",null,null,null,{"$error":"#N/A"},0,{"$f":"IF(AND(AP75=18,$AN$4>=27,$AN$4<=29),AP75&\"G\",0)","v":{"$error":"#N/A"}},null,null,{"$error":"#N/A"},0,{"$f":"IF(AND(AU75=18,$AS$4>=27,$AS$4<=29),AU75&\"G\",0)","v":{"$error":"#N/A"}},null,null,null,null,null,null,null,null,null,null,null,null,null,null,null,null,null,null,null,null,null,null,null,null,null,null,null,null,null,null,null,null,null,null,null,null,null,null,null,null,null,null,null,null,null,null,null,null,null,null,null,null,null,null,null,null,null,null,null,null,null,{"$error":"#N/A"},{"$error":"#N/A"},{"$f":"IF(AND(DG75=28,$DE$4>=37,$DE$4<=40),DG75&\"G\",0)","v":{"$error":"#N/A"}},null,null,{"$error":"#N/A"},{"$error":"#N/A"},{"$f":"IF(AND(DL75=28,$DJ$4>=37,$DJ$4<=40),DL75&\"G\",0)","v":{"$error":"#N/A"}}]
[null,4,3,1,null,6,3,1,null,null,null,null,null,null,null,null,null,null,null,null,null,null,null,null,null,null,null,null,"Top Spacer",{"$f":"((CMR!$E$45*2)+(CMR!$E$47*2))/12","v":-0.90625},5.3600000000000002E-2,-4.8575E-2,null,"Top Top Rail",{"$f":"(Frame_Width-4.9375)/12","v":-0.41145833333333331},0.36899999999999999,{"$f":"AI76*AJ76","v":-0.15182812499999998},null,null,null,{"$error":"#N/A"},0,{"$f":"IF(AND(AP76=18,$AN$4>=30,$AN$4<=32),AP76&\"H\",0)","v":{"$error":"#N/A"}},null,null,{"$error":"#N/A"},0,{"$f":"IF(AND(AU76=18,$AS$4>=30,$AS$4<=32),AU76&\"H\",0)","v":{"$error":"#N/A"}},null,null,null,null,null,null,null,null,null,null,null,null,null,null,null,null,null,null,null,null,null,null,null,null,null,null,null,null,null,null,null,null,null,null,null,null,null,null,null,null,null,null,null,null,null,null,null,null,null,null,null,null,null,null,null,null,null,null,null,null,null,{"$error":"#N/A"},{"$error":"#N/A"},{"$f":"IF(AND(DG76=28,$DE$4>=41,$DE$4<=43),DG76&\"H\",0)","v":{"$error":"#N/A"}},null,null,{"$error":"#N/A"},{"$error":"#N/A"},{"$f":"IF(AND(DL76=28,$DJ$4>=41,$DJ$4<=43),DL76&\"H\",0)","v":{"$error":"#N/A"}}]
[null,{"$f":"B76+1","v":5},3,1,null,7,4,1,null,null,null,null,null,null,null,null,null,null,null,null,null,null,null,null,null,null,null,null,"Top Hardware",1,0.2,0.2,null,"Top Bottom Rail",{"$f":"(Frame_Width-4.9375)/12","v":-0.41145833333333331},0.36899999999999999,-0.15182812499999998,null,null,null,{"$error":"#N/A"},0,{"$f":"IF(AND(AP77=18,$AN$4>=33,$AN$4<=34),AP77&\"I\",0)","v":{"$error":"#N/A"}},null,null,{"$error":"#N/A"},0,{"$f":"IF(AND(AU77=18,$AS$4>=33,$AS$4<=34),AU77&\"I\",0)","v":{"$error":"#N/A"}},null,null,null,null,null,null,null,null,null,null,null,null,null,null,null,null,null,null,null,null,null,null,null,null,null,null,null,null,null,null,null,null,null,null,null,null,null,null,null,null,null,null,null,null,null,null,null,null,null,null,null,null,null,null,null,null,null,null,null,null,null,{"$error":"#N/A"},{"$error":"#N/A"},{"$f":"IF(AND(DG77=28,$DE$4>=44,$DE$4<=45),DG77&\"I\",0)","v":{"$error":"#N/A"}},null,null,{"$error":"#N/A"},{"$error":"#N/A"},{"$f":"IF(AND(DL77=28,$DJ$4>=44,$DJ$4<=45),DL77&\"I\",0)","v":{"$error":"#N/A"}}]
[null,6,3,1,null,8,4,1,null,null,null,null,null,null,null,null,null,null,null,null,null,null,null,null,null,null,null,null,"Top Bead",{"$f":"(((Frame_Width-4.3125)*2)+((CMR!$E$42-2.6875)*2))/12","v":-1.1666666666666667},2.8000000000000001E-2,-3.266666666666667E-2,null,"Top Stile",{"$f":"(2*(CMR!$L$90-2.0625))/12","v":-0.34375},0.36899999999999999,-0.12684375000000001,null,null,null,{"$error":"#N/A"},0,{"$f":"IF(AND(AP78=18,$AN$4>=35,$AN$4<=36),\"Dbl.\"&AP78&\"C\",0)","v":{"$error":"#N/A"}},null,null,{"$error":"#N/A"},0,{"$f":"IF(AND(AU78=18,$AS$4>=35,$AS$4<=36),\"Dbl.\"&AU78&\"C\",0)","v":{"$error":"#N/A"}},null,null,null,null,null,null,null,null,null,null,null,null,null,null,null,null,null,null,null,null,null,null,null,null,null,null,null,null,null,null,null,null,null,null,null,null,null,null,null,null,null,null,null,null,null,null,null,null,null,null,null,null,null,null,null,null,null,null,null,null,null,{"$error":"#N/A"},{"$f":"IF(AND($DF$4<=30,$DF$4>28),30,0)","v":{"$error":"#N/A"}},{"$f":"IF(AND(DG78=30,$DE$4>=8,$DE$4<=13),DG78&\"A\",0)","v":{"$error":"#N/A"}},null,null,{"$error":"#N/A"},{"$f":"IF(AND($DK$4<=30,$DK$4>28),30,0)","v":{"$error":"#N/A"}},{"$f":"IF(AND(DL78=30,$DJ$4>=8,$DJ$4<=13),DL78&\"A\",0)","v":{"$error":"#N/A"}}]
[null,7,3,1,null,9,5,1,null,null,null,null,null,null,null,null,null,null,null,null,null,null,null,null,null,null,null,null,"Bottom Top Rail",{"$f":"(Frame_Width-2.25)/12","v":-0.1875},0.246,-4.6124999999999999E-2,null,"Top Rail Reinf.",{"$f":"IF((INT((Frame_Width-9.9375)/2)*2)>12,(INT((Frame_Width-9.9375)/2)*2)/12,0)","v":0},0.16500000000000001,0,null,null,null,{"$error":"#N/A"},0,{"$f":"IF(AND(AP79=18,$AN$4>=37,$AN$4<=42),\"Dbl.\"&AP79&\"D\",0)","v":{"$error":"#N/A"}},null,null,{"$error":"#N/A"},0,{"$f":"IF(AND(AU79=18,$AS$4>=37,$AS$4<=42),\"Dbl.\"&AU79&\"D\",0)","v":{"$error":"#N/A"}},null,null,null,null,null,null,null,null,null,null,null,null,null,null,null,null,null,null,null,null,null,null,null,null,null,null,null,null,null,null,null,null,null,null,null,null,null,null,null,null,null,null,null,null,null,null,null,null,null,null,null,null,null,null,null,null,null,null,null,null,null,{"$error":"#N/A"},{"$error":"#N/A"},{"$f":"IF(AND(DG79=30,$DE$4>=14,$DE$4<=19),DG79&\"B\",0)","v":{"$error":"#N/A"}},null,null,{"$error":"#N/A"},{"$error":"#N/A"},{"$f":"IF(AND(DL79=30,$DJ$4>=14,$DJ$4<=19),DL79&\"B\",0)","v":{"$error":"#N/A"}}]
[null,8,4,1,null,10,5,1,null,null,null,null,null,null,null,false,"AC SASH CALCULATOR",null,null,null,null,null,null,null,null,null,null,null,"Bottom Bottom Rail",{"$f":"(Frame_Width-2.25)/12","v":-0.1875},0.25700000000000001,-4.8187500000000001E-2,null,"Keeper Bead",{"$f":"(Frame_Width-4.59375)/12","v":-0.3828125},9.6000000000000002E-2,-3.6749999999999998E-2,null,null,null,{"$error":"#N/A"},0,{"$f":"IF(AND(AP80=18,$AN$4>=43,$AN$4<=48),\"Dbl.\"&AP80&\"E\",0)","v":{"$error":"#N/A"}},null,null,{"$error":"#N/A"},0,{"$f":"IF(AND(AU80=18,$AS$4>=43,$AS$4<=48),\"Dbl.\"&AU80&\"E\",0)","v":{"$error":"#N/A"}},null,null,null,null,null,null,null,null,null,null,null,null,null,null,null,null,null,null,null,null,null,null,null,null,null,null,null,null,null,null,null,null,null,null,null,null,null,null,null,null,null,null,null,null,null,null,null,null,null,null,null,null,null,null,null,null,null,null,null,null,null,{"$error":"#N/A"},{"$error":"#N/A"},{"$f":"IF(AND(DG80=30,$DE$4>=20,$DE$4<=24),DG80&\"C\",0)","v":{"$error":"#N/A"}},null,null,{"$error":"#N/A"},{"$error":"#N/A"},{"$f":"IF(AND(DL80=30,$DJ$4>=20,$DJ$4<=24),DL80&\"C\",0)","v":{"$error":"#N/A"}}]
[null,9,5,1,null,11,6,1,null,null,null,null,null,null,null,"Model","Head+4","Sill","Center of Astragal","Top Sash Width","Sash Height","CMR",null,null,null,null,null,null,"Bottom Stile",{"$f":"(2*(CMR!$E$43-0.625))/12","v":-0.10416666666666667},0.23300000000000001,-2.4270833333333335E-2,null,"Top Glass",{"$f":"(CMR!$L$93*CMR!$L$95)/144","v":0.1357693142361111},{"$f":"$L$12","v":3.2},0.43446180555555558,null,null,null,{"$error":"#N/A"},0,{"$f":"IF(AND(AP81=18,$AN$4>=49,$AN$4<=52),\"Dbl.\"&AP81&\"F\",0)","v":{"$error":"#N/A"}},null,null,{"$error":"#N/A"},0,{"$f":"IF(AND(AU81=18,$AS$4>=49,$AS$4<=52),\"Dbl.\"&AU81&\"F\",0)","v":{"$error":"#N/A"}},null,null,null,null,null,null,null,null,null,null,null,null,null,null,null,null,null,null,null,null,null,null,null,null,null,null,null,null,null,null,null,null,null,null,null,null,null,null,null,null,null,null,null,null,null,null,null,null,null,null,null,null,null,null,null,null,null,null,null,null,null,{"$error":"#N/A"},{"$error":"#N/A"},{"$f":"IF(AND(DG81=30,$DE$4>=25,$DE$4<=29),DG81&\"D\",0)","v":{"$error":"#N/A"}},null,null,{"$error":"#N/A"},{"$error":"#N/A"},{"$f":"IF(AND(DL81=30,$DJ$4>=25,$DJ$4<=29),DL81&\"D\",0)","v":{"$error":"#N/A"}}]
[null,10,5,1,null,12,6,1,null,null,null,null,null,null,null,{"$f":"ModelNo","v":"Select Model"},{"$f":"IF(ISERROR(VLOOKUP(ModelNo,ACTABLE,2,FALSE)),\"\",VLOOKUP(ModelNo,ACTABLE,2,FALSE))","v":""},{"$f":"IF(ISERROR(VLOOKUP(ModelNo,ACTABLE,3,FALSE)),\"\",VLOOKUP(ModelNo,ACTABLE,3,FALSE))","v":""},{"$f":"IF(ISERROR(VLOOKUP(ModelNo,ACTABLE,4,FALSE)),\"\",VLOOKUP(ModelNo,ACTABLE,4,FALSE))","v":""},{"$f":"IF(ISERROR(VLOOKUP(ModelNo,ACTABLE,5,FALSE)),\"\",VLOOKUP(ModelNo,ACTABLE,5,FALSE))","v":""},{"$f":"IF(ISERROR(VLOOKUP(ModelNo,ACTABLE,6,FALSE)),\"\",VLOOKUP(ModelNo,ACTABLE,6,FALSE))","v":""},{"$f":"IF(ISERROR(VLOOKUP(ModelNo,ACTABLE,7,FALSE)),\"\",VLOOKUP(ModelNo,ACTABLE,7,FALSE))","v":""},null,null,null,null,null,null,"Bottom Rail Reinf.",{"$f":"(TRUNC(((Frame_Width-2.25)-6)/2)*2)/12","v":-0.66666666666666663},0.37,-0.24666666666666665,null,"Top Spacer",{"$f":"((CMR!$L$93*2)+(CMR!$L$95*2))/12","v":-1.5208333333333333},5.3600000000000002E-2,-8.1516666666666668E-2,null,null,null,{"$error":"#N/A"},0,{"$f":"IF(AND(AP82=18,$AN$4>=53,$AN$4<=58),\"Dbl.\"&AP82&\"G\",0)","v":{"$error":"#N/A"}},null,null,{"$error":"#N/A"},0,{"$f":"IF(AND(AU82=18,$AS$4>=53,$AS$4<=58),\"Dbl.\"&AU82&\"G\",0)","v":{"$error":"#N/A"}},null,null,null,null,null,null,null,null,null,null,null,null,null,null,null,null,null,null,null,null,null,null,null,null,null,null,null,null,null,null,null,null,null,null,null,null,null,null,null,null,null,null,null,null,null,null,null,null,null,null,null,null,null,null,null,null,null,null,null,null,null,{"$error":"#N/A"},{"$error":"#N/A"},{"$f":"IF(AND(DG82=30,$DE$4>=30,$DE$4<=33),DG82&\"E\",0)","v":{"$error":"#N/A"}},null,null,{"$error":"#N/A"},{"$error":"#N/A"},{"$f":"IF(AND(DL82=30,$DJ$4>=30,$DJ$4<=33),DL82&\"E\",0)","v":{"$error":"#N/A"}}]
[null,11,6,1,null,13,7,1,null,null,null,null,null,null,null,"3S40A",5.25,2.222,1.0625,null,null,{"$f":"INT((Frame_Height-(R83+0.5+ACHEIGHT+S83))*16+0.5)/16","v":-3.8125},null,null,null,null,null,null,"Bottom Stile Reinf.",{"$f":"IF(CMR!$E$48>27.6875,((TRUNC((CMR!$E$43-4.5)/2)*2)/12)*2,0)","v":0},0.29899999999999999,0,null,"Top Hardware",1,0.2,0.2,null,null,null,{"$error":"#N/A"},0,{"$f":"IF(AND(AP83=18,$AN$4>=59,$AN$4<=64),\"Dbl.\"&AP83&\"H\",0)","v":{"$error":"#N/A"}},null,null,{"$error":"#N/A"},0,{"$f":"IF(AND(AU83=18,$AS$4>=59,$AS$4<=64),\"Dbl.\"&AU83&\"H\",0)","v":{"$error":"#N/A"}},null,null,null,null,null,null,null,null,null,null,null,null,null,null,null,null,null,null,null,null,null,null,null,null,null,null,null,null,null,null,null,null,null,null,null,null,null,null,null,null,null,null,null,null,null,null,null,null,null,null,null,null,null,null,null,null,null,null,null,null,null,{"$error":"#N/A"},{"$error":"#N/A"},{"$f":"IF(AND(DG83=30,$DE$4>=34,$DE$4<=37),DG83&\"F\",0)","v":{"$error":"#N/A"}},null,null,{"$error":"#N/A"},{"$error":"#N/A"},{"$f":"IF(AND(DL83=30,$DJ$4>=34,$DJ$4<=37),DL83&\"F\",0)","v":{"$error":"#N/A"}}]
[null,12,6,1,null,14,7,1,null,null,null,null,null,null,null,"8E40A",5.375,2.294,1.1875,{"$f":"TGW8R40A+1.875","v":-3.8125},{"$f":"INT((Frame_Height-(Q84+R84+0.5+ACHEIGHT))*16+0.5)/16","v":-8.1875},null,null,null,null,null,null,null,"Bottom Glass",{"$f":"(CMR!$E$46*CMR!$E$48)/144","v":9.8985460069444448E-2},{"$f":"$L$12","v":3.2},0.31675347222222228,null,"Top Handle Bead",{"$f":"(Frame_Width-6.59375)/12","v":-0.54947916666666663},8.8999999999999996E-2,-4.8903645833333328E-2,null,null,null,{"$error":"#N/A"},0,{"$f":"IF(AND(AP84=18,$AN$4>=65,$AN$4<=68),\"Dbl.\"&AP84&\"I\",0)","v":{"$error":"#N/A"}},null,null,{"$error":"#N/A"},0,{"$f":"IF(AND(AU84=18,$AS$4>=65,$AS$4<=68),\"Dbl.\"&AU84&\"I\",0)","v":{"$error":"#N/A"}},null,null,null,null,null,null,null,null,null,null,null,null,null,null,null,null,null,null,null,null,null,null,null,null,null,null,null,null,null,null,null,null,null,null,null,null,null,null,null,null,null,null,null,null,null,null,null,null,null,null,null,null,null,null,null,null,null,null,null,null,null,{"$error":"#N/A"},{"$error":"#N/A"},{"$f":"IF(AND(DG84=30,$DE$4>=38,$DE$4<=40),DG84&\"G\",0)","v":{"$error":"#N/A"}},null,null,{"$error":"#N/A"},{"$error":"#N/A"},{"$f":"IF(AND(DL84=30,$DJ$4>=38,$DJ$4<=40),DL84&\"G\",0)","v":{"$error":"#N/A"}}]
[null,13,7,1,null,15,8,1,null,null,null,null,null,null,null,"L201",5.569,1.75,null,{"$f":"Frame_Width-3.25","v":-3.25},{"$f":"INT((Frame_Height-(Q85+R85+0.5+ACHEIGHT))*16+0.5)/16","v":-7.8125},null,null,null,null,null,null,null,"Bottom Spacer",{"$f":"((CMR!$E$46*2)+(CMR!$E$48*2))/12","v":-1.3541666666666667},5.3600000000000002E-2,-7.2583333333333333E-2,null,"Top Bead",{"$f":"((CMR!$L$90-4.25)*2)/12","v":-0.70833333333333337},6.4000000000000001E-2,-4.5333333333333337E-2,null,null,null,{"$error":"#N/A"},{"$f":"IF(AND($AO$4<=20,$AO$4>18),20,0)","v":0},{"$f":"IF(AND(AP85=20,$AN$4>=5,$AN$4<=10),AP85&\"A\",0)","v":{"$error":"#N/A"}},null,null,{"$error":"#N/A"},{"$f":"IF(AND($AT$4<=20,$AT$4>18),20,0)","v":0},{"$f":"IF(AND(AU85=20,$AS$4>=5,$AS$4<=10),AU85&\"A\",0)","v":{"$error":"#N/A"}},null,null,null,null,null,null,null,null,null,null,null,null,null,null,null,null,null,null,null,null,null,null,null,null,null,null,null,null,null,null,null,null,null,null,null,null,null,null,null,null,null,null,null,null,null,null,null,null,null,null,null,null,null,null,null,null,null,null,null,null,null,{"$error":"#N/A"},{"$error":"#N/A"},{"$f":"IF(AND(DG85=30,$DE$4>=41,$DE$4<=43),DG85&\"H\",0)","v":{"$error":"#N/A"}},null,null,{"$error":"#N/A"},{"$error":"#N/A"},{"$f":"IF(AND(DL85=30,$DJ$4>=41,$DJ$4<=43),DL85&\"H\",0)","v":{"$error":"#N/A"}}]
[null,14,7,1,null,16,8,1,null,null,null,null,null,null,null,"03A0",null,1.875,0.625,{"$f":"Frame_Width-3.125","v":-3.125},null,{"$f":"INT((Frame_Height-(R86+0.5+ACHEIGHT+S86))*16+0.5)/16","v":-3},null,null,null,null,null,null,"Bottom Hardware",1,0.36,0.36,null,"Bottom Top Rail",{"$f":"(Frame_Width-3.9375)/12","v":-0.328125},0.47299999999999998,-0.155203125,null,null,null,{"$error":"#N/A"},0,{"$f":"IF(AND(AP86=20,$AN$4>=11,$AN$4<=14),AP86&\"B\",0)","v":{"$error":"#N/A"}},null,null,{"$error":"#N/A"},0,{"$f":"IF(AND(AU86=20,$AS$4>=11,$AS$4<=14),AU86&\"B\",0)","v":{"$error":"#N/A"}},null,null,null,null,null,null,null,null,null,null,null,null,null,null,null,null,null,null,null,null,null,null,null,null,null,null,null,null,null,null,null,null,null,null,null,null,null,null,null,null,null,null,null,null,null,null,null,null,null,null,null,null,null,null,null,null,null,null,null,null,null,{"$error":"#N/A"},{"$error":"#N/A"},{"$f":"IF(AND(DG86=30,$DE$4>=44,$DE$4<=45),DG86&\"I\",0)","v":{"$error":"#N/A"}},null,null,{"$error":"#N/A"},{"$error":"#N/A"},{"$f":"IF(AND(DL86=30,$DJ$4>=44,$DJ$4<=45),DL86&\"I\",0)","v":{"$error":"#N/A"}}]
[null,15,8,1,null,17,9,1,null,null,null,null,null,null,null,"02A0",null,1.75,0.625,{"$f":"Frame_Width-2.25","v":-2.25},null,{"$f":"INT((Frame_Height-(R87+0.5+ACHEIGHT+S87))*16+0.5)/16","v":-2.875},null,null,null,null,null,null,"Bottom Bead",{"$f":"(((Frame_Width-3.3125)*2)+((CMR!$E$43-1.6875)*2))/12","v":-0.83333333333333337},2.8000000000000001E-2,-2.3333333333333334E-2,null,"Bottom Bottom Rail",{"$f":"(Frame_Width-3.9375)/12","v":-0.328125},0.437,-0.14339062499999999,null,null,null,{"$error":"#N/A"},0,{"$f":"IF(AND(AP87=20,$AN$4>=15,$AN$4<=18),AP87&\"C\",0)","v":{"$error":"#N/A"}},null,null,{"$error":"#N/A"},0,{"$f":"IF(AND(AU87=20,$AS$4>=15,$AS$4<=18),AU87&\"C\",0)","v":{"$error":"#N/A"}},null,null,null,null,null,null,null,null,null,null,null,null,null,null,null,null,null,null,null,null,null,null,null,null,null,null,null,null,null,null,null,null,null,null,null,null,null,null,null,null,null,null,null,null,null,null,null,null,null,null,null,null,null,null,null,null,null,null,null,null,null,{"$error":"#N/A"},{"$f":"IF(AND($DF$4<=32,$DF$4>30),32,0)","v":{"$error":"#N/A"}},{"$f":"IF(AND(DG87=32,$DE$4>=8,$DE$4<=14),DG87&\"A\",0)","v":{"$error":"#N/A"}},null,null,{"$error":"#N/A"},{"$f":"IF(AND($DK$4<=32,$DK$4>30),32,0)","v":{"$error":"#N/A"}},{"$f":"IF(AND(DL87=32,$DJ$4>=8,$DJ$4<=14),DL87&\"A\",0)","v":{"$error":"#N/A"}}]
[null,16,8,1,null,18,9,1,null,null,null,null,null,null,null,"0201",5.569,1.75,null,{"$f":"Frame_Width-3.25","v":-3.25},{"$f":"INT((Frame_Height-(Q88+R88+0.5+ACHEIGHT))*16+0.5)/16","v":-7.8125},null,null,null,null,null,null,null,null,null,"Top Sash",{"$f":"IF(OR(ModelNo=\"0301\",ModelNo=\"E301(3250)\",ModelNo=\"E301(3052)\",ModelNo=\"E301(2862)\"),(TRUNC((SUM(AF70:AF78))))+5,0)","v":0},null,"Bottom Stile",{"$f":"(2*(CMR!$L$91-1.0625))/12","v":-0.17708333333333334},0.437,-7.7385416666666665E-2,null,null,null,{"$error":"#N/A"},0,{"$f":"IF(AND(AP88=20,$AN$4>=19,$AN$4<=22),AP88&\"D\",0)","v":{"$error":"#N/A"}},null,null,{"$error":"#N/A"},0,{"$f":"IF(AND(AU88=20,$AS$4>=19,$AS$4<=22),AU88&\"D\",0)","v":{"$error":"#N/A"}},null,null,null,null,null,null,null,null,null,null,null,null,null,null,null,null,null,null,null,null,null,null,null,null,null,null,null,null,null,null,null,null,null,null,null,null,null,null,null,null,null,null,null,null,null,null,null,null,null,null,null,null,null,null,null,null,null,null,null,null,null,{"$error":"#N/A"},{"$error":"#N/A"},{"$f":"IF(AND(DG88=32,$DE$4>=15,$DE$4<=20),DG88&\"B\",0)","v":{"$error":"#N/A"}},null,null,{"$error":"#N/A"},{"$error":"#N/A"},{"$f":"IF(AND(DL88=32,$DJ$4>=15,$DJ$4<=20),DL88&\"B\",0)","v":{"$error":"#N/A"}}]
[null,17,9,1,null,19,10,1,null,null,null,null,null,null,null,"0301",5.5590000000000002,2.0590000000000002,null,{"$f":"Frame_Width-3.25","v":-3.25},{"$f":"INT((Frame_Height-(Q89+R89+0.5+ACHEIGHT))*16+0.5)/16","v":-8.125},null,null,null,null,null,null,null,null,null,"Bottom Sash",{"$f":"IF(OR(ModelNo=\"0301\",ModelNo=\"E301(3250)\",ModelNo=\"E301(3052)\",ModelNo=\"E301(2862)\"),TRUNC((SUM(AF79:AF87))),0)","v":0},null,"Bottom Rail Reinf.",{"$f":"IF((INT((Frame_Width-8.9375)/2)*2)>12,(INT((Frame_Width-8.9375)/2)*2)/12,0)","v":0},0.17899999999999999,0,null,null,null,{"$error":"#N/A"},0,{"$f":"IF(AND(AP89=20,$AN$4>=23,$AN$4<=26),AP89&\"E\",0)","v":{"$error":"#N/A"}},null,null,{"$error":"#N/A"},0,{"$f":"IF(AND(AU89=20,$AS$4>=23,$AS$4<=26),AU89&\"E\",0)","v":{"$error":"#N/A"}},null,null,null,null,null,null,null,null,null,null,null,null,null,null,null,null,null,null,null,null,null,null,null,null,null,null,null,null,null,null,null,null,null,null,null,null,null,null,null,null,null,null,null,null,null,null,null,null,null,null,null,null,null,null,null,null,null,null,null,null,null,{"$error":"#N/A"},{"$error":"#N/A"},{"$f":"IF(AND(DG89=32,$DE$4>=21,$DE$4<=25),DG89&\"C\",0)","v":{"$error":"#N/A"}},null,null,{"$error":"#N/A"},{"$error":"#N/A"},{"$f":"IF(AND(DL89=32,$DJ$4>=21,$DJ$4<=25),DL89&\"C\",0)","v":{"$error":"#N/A"}}]
[null,18,9,1,null,20,10,1,null,null,null,null,null,null,null,"0401",5.5,2.008,null,{"$f":"Frame_Width-3.25","v":-3.25},{"$f":"INT((Frame_Height-(Q90+R90+0.5+ACHEIGHT))*16+0.5)/16","v":-8},null,null,null,null,null,null,null,null,null,null,null,null,"Bottom Stile Reinf.",0,0,0,null,null,null,{"$error":"#N/A"},0,{"$f":"IF(AND(AP90=20,$AN$4>=27,$AN$4<=30),AP90&\"F\",0)","v":{"$error":"#N/A"}},null,null,{"$error":"#N/A"},0,{"$f":"IF(AND(AU90=20,$AS$4>=27,$AS$4<=30),AU90&\"F\",0)","v":{"$error":"#N/A"}},null,null,null,null,null,null,null,null,null,null,null,null,null,null,null,null,null,null,null,null,null,null,null,null,null,null,null,null,null,null,null,null,null,null,null,null,null,null,null,null,null,null,null,null,null,null,null,null,null,null,null,null,null,null,null,null,null,null,null,null,null,{"$error":"#N/A"},{"$error":"#N/A"},{"$f":"IF(AND(DG90=32,$DE$4>=26,$DE$4<=30),DG90&\"D\",0)","v":{"$error":"#N/A"}},null,null,{"$error":"#N/A"},{"$error":"#N/A"},{"$f":"IF(AND(DL90=32,$DJ$4>=26,$DJ$4<=30),DL90&\"D\",0)","v":{"$error":"#N/A"}}]
[null,19,10,1,null,21,56,2,null,null,null,null,null,null,null,{"$f":"IF(ModelNo=\"0501\",\"0501\",IF(ModelNo=\"B501\",\"B501\",IF(ModelNo=\"U501\",\"U501\",\"0501\")))","v":"0501"},6.0590000000000002,2.9550000000000001,null,{"$f":"Frame_Width-4.25","v":-4.25},{"$f":"INT((Frame_Height-(Q91+R91+0.5+ACHEIGHT))*16+0.5)/16","v":-9.5},null,null,null,null,null,null,null,"0401","Length","Weight/ft","Weight",null,"Bottom Glass",{"$f":"(CMR!$L$94*CMR!$L$96)/144","v":0.1357693142361111},{"$f":"$L$12","v":3.2},0.43446180555555558,null,null,null,{"$error":"#N/A"},0,{"$f":"IF(AND(AP91=20,$AN$4>=31,$AN$4<=34),AP91&\"G\",0)","v":{"$error":"#N/A"}},null,null,{"$error":"#N/A"},0,{"$f":"IF(AND(AU91=20,$AS$4>=31,$AS$4<=34),AU91&\"G\",0)","v":{"$error":"#N/A"}},null,null,null,null,null,null,null,null,null,null,null,null,null,null,null,null,null,null,null,null,null,null,null,null,null,null,null,null,null,null,null,null,null,null,null,null,null,null,null,null,null,null,null,null,null,null,null,null,null,null,null,null,null,null,null,null,null,null,null,null,null,{"$error":"#N/A"},{"$error":"#N/A"},{"$f":"IF(AND(DG91=32,$DE$4>=31,$DE$4<=34),DG91&\"E\",0)","v":{"$error":"#N/A"}},null,null,{"$error":"#N/A"},{"$error":"#N/A"},{"$f":"IF(AND(DL91=32,$DJ$4>=31,$DJ$4<=34),DL91&\"E\",0)","v":{"$error":"#N/A"}}]
[null,20,10,1,null,22,56,2,null,null,null,null,null,null,null,{"$f":"IF(ModelNo=\"0601\",\"0601\",IF(ModelNo=\"B601\",\"B601\",IF(ModelNo=\"U601\",\"U601\",\"0601\")))","v":"0601"},6.0590000000000002,2.6890000000000001,null,{"$f":"Frame_Width-4.25","v":-4.25},{"$f":"INT((Frame_Height-(Q92+R92+0.5+ACHEIGHT))*16+0.5)/16","v":-9.25},null,null,null,null,null,null,null,"Top Top Rail",{"$f":"(Frame_Width-3.25)/12","v":-0.27083333333333331},0.33400000000000002,{"$f":"AD92*AE92","v":-9.0458333333333335E-2},null,"Bottom Spacer",{"$f":"((CMR!$L$94*2)+(CMR!$L$96*2))/12","v":-1.5208333333333333},5.3600000000000002E-2,-8.1516666666666668E-2,null,null,null,{"$error":"#N/A"},0,{"$f":"IF(AND(AP92=20,$AN$4>=35,$AN$4<=37),AP92&\"H\",0)","v":{"$error":"#N/A"}},null,null,{"$error":"#N/A"},0,{"$f":"IF(AND(AU92=20,$AS$4>=35,$AS$4<=37),AU92&\"H\",0)","v":{"$error":"#N/A"}},null,null,null,null,null,null,null,null,null,null,null,null,null,null,null,null,null,null,null,null,null,null,null,null,null,null,null,null,null,null,null,null,null,null,null,null,null,null,null,null,null,null,null,null,null,null,null,null,null,null,null,null,null,null,null,null,null,null,null,null,null,{"$error":"#N/A"},{"$error":"#N/A"},{"$f":"IF(AND(DG92=32,$DE$4>=35,$DE$4<=37),DG92&\"F\",0)","v":{"$error":"#N/A"}},null,null,{"$error":"#N/A"},{"$error":"#N/A"},{"$f":"IF(AND(DL92=32,$DJ$4>=35,$DJ$4<=37),DL92&\"F\",0)","v":{"$error":"#N/A"}}]
[null,21,10,1,null,23,66,2,null,null,null,null,null,null,null,"0700",null,1.5369999999999999,1.0625,{"$f":"Frame_Width-2.3125","v":-2.3125},null,{"$f":"INT((Frame_Height-(R93+0.5+ACHEIGHT+S93))*16+0.5)/16","v":-3.125},null,null,null,null,null,null,"Top Bottom Rail",{"$f":"(Frame_Width-3.25)/12","v":-0.27083333333333331},0.29499999999999998,-7.9895833333333319E-2,null,"Bottom Hardware",1,0.36,0.36,null,null,null,{"$error":"#N/A"},0,{"$f":"IF(AND(AP93=20,$AN$4>=38,$AN$4<=40),AP93&\"I\",0)","v":{"$error":"#N/A"}},null,null,{"$error":"#N/A"},0,{"$f":"IF(AND(AU93=20,$AS$4>=38,$AS$4<=40),AU93&\"I\",0)","v":{"$error":"#N/A"}},null,null,null,null,null,null,null,null,null,null,null,null,null,null,null,null,null,null,null,null,null,null,null,null,null,null,null,null,null,null,null,null,null,null,null,null,null,null,null,null,null,null,null,null,null,null,null,null,null,null,null,null,null,null,null,null,null,null,null,null,null,{"$error":"#N/A"},{"$error":"#N/A"},{"$f":"IF(AND(DG93=32,$DE$4>=38,$DE$4<=40),DG93&\"G\",0)","v":{"$error":"#N/A"}},null,null,{"$error":"#N/A"},{"$error":"#N/A"},{"$f":"IF(AND(DL93=32,$DJ$4>=38,$DJ$4<=40),DL93&\"G\",0)","v":{"$error":"#N/A"}}]
[null,22,"8/4",2,null,24,66,2,null,null,null,null,null,null,null,"07HP",null,1.5369999999999999,1.1875,{"$f":"Frame_Width-2.3125","v":-2.3125},null,{"$f":"INT((Frame_Height-(R94+0.5+ACHEIGHT+S94))*16+0.5)/16","v":-3.25},null,null,null,null,null,null,"Top Stile",{"$f":"(2*(CMR!$E$58-1))/12","v":7.2916666666666671E-2},0.27,1.9687500000000004E-2,null,"Bott. Handle Bead",{"$f":"(Frame_Width-6.59375)/12","v":-0.54947916666666663},8.8999999999999996E-2,-4.8903645833333328E-2,null,null,null,{"$error":"#N/A"},0,{"$f":"IF(AND(AP94=20,$AN$4>=41,$AN$4<=44),\"Dbl.\"&AP94&\"D\",0)","v":{"$error":"#N/A"}},null,null,{"$error":"#N/A"},0,{"$f":"IF(AND(AU94=20,$AS$4>=41,$AS$4<=44),\"Dbl.\"&AU94&\"D\",0)","v":{"$error":"#N/A"}},null,null,null,null,null,null,null,null,null,null,null,null,null,null,null,null,null,null,null,null,null,null,null,null,null,null,null,null,null,null,null,null,null,null,null,null,null,null,null,null,null,null,null,null,null,null,null,null,null,null,null,null,null,null,null,null,null,null,null,null,null,{"$error":"#N/A"},{"$error":"#N/A"},{"$f":"IF(AND(DG94=32,$DE$4>=41,$DE$4<=43),DG94&\"H\",0)","v":{"$error":"#N/A"}},null,null,{"$error":"#N/A"},{"$error":"#N/A"},{"$f":"IF(AND(DL94=32,$DJ$4>=41,$DJ$4<=43),DL94&\"H\",0)","v":{"$error":"#N/A"}}]
[null,23,"8/4",2,null,25,67,2,null,null,null,null,null,null,null,{"$f":"IF(ModelNo=\"0901\",\"0901\",IF(ModelNo=\"09A1\",\"09A1\",IF(ModelNo=\"09B1\",\"09B1\",\"0901\")))","v":"0901"},5.75,2.125,null,{"$f":"Frame_Width-3.4375","v":-3.4375},{"$f":"INT((Frame_Height-(Q95+R95+0.5+ACHEIGHT))*16+0.5)/16","v":-8.375},null,null,null,null,null,null,null,"Top Rail Reinf.",{"$f":"(TRUNC(((Frame_Width-3.25)-6)/2)*2)/12","v":-0.66666666666666663},0.27400000000000002,-0.18266666666666667,null,"Bottom Bead",{"$f":"((Frame_Width-6.59375)+((CMR!$L$91-3.71875)*2))/12","v":-1.1692708333333333},6.4000000000000001E-2,-7.4833333333333335E-2,null,null,null,{"$error":"#N/A"},0,{"$f":"IF(AND(AP95=20,$AN$4>=45,$AN$4<=52),\"Dbl.\"&AP95&\"E\",0)","v":{"$error":"#N/A"}},null,null,{"$error":"#N/A"},0,{"$f":"IF(AND(AU95=20,$AS$4>=45,$AS$4<=52),\"Dbl.\"&AU95&\"E\",0)","v":{"$error":"#N/A"}},null,null,null,null,null,null,null,null,null,null,null,null,null,null,null,null,null,null,null,null,null,null,null,null,null,null,null,null,null,null,null,null,null,null,null,null,null,null,null,null,null,null,null,null,null,null,null,null,null,null,null,null,null,null,null,null,null,null,null,null,null,{"$error":"#N/A"},{"$error":"#N/A"},{"$f":"IF(AND(DG95=32,$DE$4>=44,$DE$4<=45),DG95&\"I\",0)","v":{"$error":"#N/A"}},null,null,{"$error":"#N/A"},{"$error":"#N/A"},{"$f":"IF(AND(DL95=32,$DJ$4>=44,$DJ$4<=45),DL95&\"I\",0)","v":{"$error":"#N/A"}}]
[null,24,"8/4",2,null,26,67,2,null,null,null,null,null,null,null,"09L1",5.75,2.125,null,{"$f":"Frame_Width-3.4375","v":-3.4375},{"$f":"INT((Frame_Height-(Q96+R96+0.5+ACHEIGHT))*16+0.5)/16","v":-8.375},null,null,null,null,null,null,null,"Top Stile Reinf",{"$f":"IF(CMR!$E$63>27.25,((TRUNC((CMR!$E$58-8)/2)*2)/12)*2,0)","v":0},0.27400000000000002,0,null,null,null,"Top Sash",{"$f":"IF(OR(ModelNo=\"9001\",ModelNo=\"P601\"),(TRUNC((SUM(AK76:AK85))))+5,0)","v":0},null,null,null,{"$error":"#N/A"},0,{"$f":"IF(AND(AP96=20,$AN$4>=53,$AN$4<=60),\"Dbl.\"&AP96&\"F\",0)","v":{"$error":"#N/A"}},null,null,{"$error":"#N/A"},0,{"$f":"IF(AND(AU96=20,$AS$4>=53,$AS$4<=60),\"Dbl.\"&AU96&\"F\",0)","v":{"$error":"#N/A"}},null,null,null,null,null,null,null,null,null,null,null,null,null,null,null,null,null,null,null,null,null,null,null,null,null,null,null,null,null,null,null,null,null,null,null,null,null,null,null,null,null,null,null,null,null,null,null,null,null,null,null,null,null,null,null,null,null,null,null,null,null,{"$error":"#N/A"},{"$f":"IF(AND($DF$4<=34,$DF$4>32),34,0)","v":{"$error":"#N/A"}},{"$f":"IF(AND(DG96=34,$DE$4>=11,$DE$4<=16),DG96&\"A\",0)","v":{"$error":"#N/A"}},null,null,{"$error":"#N/A"},{"$f":"IF(AND($DK$4<=34,$DK$4>32),34,0)","v":{"$error":"#N/A"}},{"$f":"IF(AND(DL96=34,$DJ$4>=11,$DJ$4<=16),DL96&\"A\",0)","v":{"$error":"#N/A"}}]
[null,25,"8/4",2,null,27,77,2,null,null,null,null,null,null,null,"8001",6.375,2.5,null,{"$f":"Frame_Width-4.9375","v":-4.9375},{"$f":"INT((Frame_Height-(Q97+R97+0.5+ACHEIGHT))*16+0.5)/16","v":-9.375},null,null,null,null,null,null,null,"Top Glass",{"$f":"(CMR!$E$61*CMR!$E$63)/144","v":4.443359375E-2},{"$f":"$L$12","v":3.2},0.14218749999999999,null,null,null,"Bottom Sash",{"$f":"IF(OR(ModelNo=\"9001\",ModelNo=\"9601\"),TRUNC((SUM(AK86:AK95))),0)","v":0},null,null,null,{"$error":"#N/A"},0,{"$f":"IF(AND(AP97=20,$AN$4>=61,$AN$4<=68),\"Dbl.\"&AP97&\"G\",0)","v":{"$error":"#N/A"}},null,null,{"$error":"#N/A"},0,{"$f":"IF(AND(AU97=20,$AS$4>=61,$AS$4<=68),\"Dbl.\"&AU97&\"G\",0)","v":{"$error":"#N/A"}},null,null,null,null,null,null,null,null,null,null,null,null,null,null,null,null,null,null,null,null,null,null,null,null,null,null,null,null,null,null,null,null,null,null,null,null,null,null,null,null,null,null,null,null,null,null,null,null,null,null,null,null,null,null,null,null,null,null,null,null,null,{"$error":"#N/A"},{"$error":"#N/A"},{"$f":"IF(AND(DG97=34,$DE$4>=17,$DE$4<=22),DG97&\"B\",0)","v":{"$error":"#N/A"}},null,null,{"$error":"#N/A"},{"$error":"#N/A"},{"$f":"IF(AND(DL97=34,$DJ$4>=17,$DJ$4<=22),DL97&\"B\",0)","v":{"$error":"#N/A"}}]
[null,26,"8/6",2,null,28,77,2,null,null,null,null,null,null,null,"R601",6.375,2.5,null,{"$f":"Frame_Width-4.9375","v":-4.9375},{"$f":"INT((Frame_Height-(Q98+R98+0.5+ACHEIGHT))*16+0.5)/16","v":-9.375},null,null,null,null,null,null,null,"Top Spacer",{"$f":"((CMR!$E$61*2)+(CMR!$E$63*2))/12","v":-1.1354166666666667},5.3600000000000002E-2,-6.0858333333333341E-2,null,null,null,null,null,null,null,null,{"$error":"#N/A"},0,{"$f":"IF(AND(AP98=20,$AN$4>=69,$AN$4<=74),\"Dbl.\"&AP98&\"H\",0)","v":{"$error":"#N/A"}},null,null,{"$error":"#N/A"},0,{"$f":"IF(AND(AU98=20,$AS$4>=69,$AS$4<=74),\"Dbl.\"&AU98&\"H\",0)","v":{"$error":"#N/A"}},null,null,null,null,null,null,null,null,null,null,null,null,null,null,null,null,null,null,null,null,null,null,null,null,null,null,null,null,null,null,null,null,null,null,null,null,null,null,null,null,null,null,null,null,null,null,null,null,null,null,null,null,null,null,null,null,null,null,null,null,null,{"$error":"#N/A"},{"$error":"#N/A"},{"$f":"IF(AND(DG98=34,$DE$4>=23,$DE$4<=27),DG98&\"C\",0)","v":{"$error":"#N/A"}},null,null,{"$error":"#N/A"},{"$error":"#N/A"},{"$f":"IF(AND(DL98=34,$DJ$4>=23,$DJ$4<=27),DL98&\"C\",0)","v":{"$error":"#N/A"}}]
[null,27,"8/6",2,null,29,78,2,null,null,null,null,null,null,null,"S140",null,{"$f":"IF(EXTSELECT=2,1.75,1.537)","v":1.5369999999999999},1.0625,{"$f":"IF(EXTSELECT=2,Frame_Width-2.25,Frame_Width-2.3125)","v":-2.3125},null,{"$f":"IF(EXTSELECT=2,INT((Frame_Height-(R99+0.5+ACHEIGHT+S99))*16+0.5)/16,INT((Frame_Height-(R99+0.5+ACHEIGHT+S99))*16+0.5)/16)","v":-3.125},null,null,null,null,null,null,"Top Hardware",1,0.2,0.2,null,"3100","Length","Weight/ft","Weight",null,null,null,{"$error":"#N/A"},0,{"$f":"IF(AND(AP99=20,$AN$4>=75,$AN$4<=80),\"Dbl.\"&AP99&\"I\",0)","v":{"$error":"#N/A"}},null,null,{"$error":"#N/A"},0,{"$f":"IF(AND(AU99=20,$AS$4>=75,$AS$4<=80),\"Dbl.\"&AU99&\"I\",0)","v":{"$error":"#N/A"}},null,null,null,null,null,null,null,null,null,null,null,null,null,null,null,null,null,null,null,null,null,null,null,null,null,null,null,null,null,null,null,null,null,null,null,null,null,null,null,null,null,null,null,null,null,null,null,null,null,null,null,null,null,null,null,null,null,null,null,null,null,{"$error":"#N/A"},{"$error":"#N/A"},{"$f":"IF(AND(DG99=34,$DE$4>=28,$DE$4<=32),DG99&\"D\",0)","v":{"$error":"#N/A"}},null,null,{"$error":"#N/A"},{"$error":"#N/A"},{"$f":"IF(AND(DL99=34,$DJ$4>=28,$DJ$4<=32),DL99&\"D\",0)","v":{"$error":"#N/A"}}]
[null,28,"8/6",2,null,30,78,2,null,null,null,null,null,null,null,"S144",null,1.5369999999999999,1.0625,-2.3125,null,-3.125,null,null,null,null,null,null,"Top Bead",{"$f":"(((Frame_Width-4.344)*2)+((CMR!$E$58-3.656)*2))/12","v":-1.09375},0.06,-6.5625000000000003E-2,null,"Top Top Rail",0,0,{"$f":"AI100*AJ100","v":0},null,null,null,{"$error":"#N/A"},{"$f":"IF(AND($AO$4<=22,$AO$4>20),22,0)","v":0},{"$f":"IF(AND(AP100=22,$AN$4>=5,$AN$4<=10),AP100&\"A\",0)","v":{"$error":"#N/A"}},null,null,{"$error":"#N/A"},{"$f":"IF(AND($AT$4<=22,$AT$4>20),22,0)","v":0},{"$f":"IF(AND(AU100=22,$AS$4>=5,$AS$4<=10),AU100&\"A\",0)","v":{"$error":"#N/A"}},null,null,null,null,null,null,null,null,null,null,null,null,null,null,null,null,null,null,null,null,null,null,null,null,null,null,null,null,null,null,null,null,null,null,null,null,null,null,null,null,null,null,null,null,null,null,null,null,null,null,null,null,null,null,null,null,null,null,null,null,null,{"$error":"#N/A"},{"$error":"#N/A"},{"$f":"IF(AND(DG100=34,$DE$4>=33,$DE$4<=34),DG100&\"E\",0)","v":{"$error":"#N/A"}},null,null,{"$error":"#N/A"},{"$error":"#N/A"},{"$f":"IF(AND(DL100=34,$DJ$4>=33,$DJ$4<=34),DL100&\"E\",0)","v":{"$error":"#N/A"}}]
[null,29,"8/6",2,null,31,88,2,null,null,null,null,null,null,null,"S146",null,1.5369999999999999,1.0625,-2.3125,null,-3.125,null,null,null,null,null,null,"Bottom Top Rail",{"$f":"(Frame_Width-2.25)/12","v":-0.1875},0.35499999999999998,-6.6562499999999997E-2,null,"Top Bottom Rail",0,0,{"$f":"AI101*AJ101","v":0},null,null,null,{"$f":"IF(AND(AP101>0,AQ101>0),AP101,0)","v":{"$error":"#N/A"}},0,{"$f":"IF(AND(AP101=22,$AN$4>=11,$AN$4<=16),AP101&\"B\",0)","v":{"$error":"#N/A"}},null,null,{"$error":"#N/A"},0,{"$f":"IF(AND(AU101=22,$AS$4>=11,$AS$4<=16),AU101&\"B\",0)","v":{"$error":"#N/A"}},null,null,null,null,null,null,null,null,null,null,null,null,null,null,null,null,null,null,null,null,null,null,null,null,null,null,null,null,null,null,null,null,null,null,null,null,null,null,null,null,null,null,null,null,null,null,null,null,null,null,null,null,null,null,null,null,null,null,null,null,null,{"$error":"#N/A"},{"$error":"#N/A"},{"$f":"IF(AND(DG101=34,$DE$4>=35,$DE$4<=37),DG101&\"F\",0)","v":{"$error":"#N/A"}},null,null,{"$error":"#N/A"},{"$error":"#N/A"},{"$f":"IF(AND(DL101=34,$DJ$4>=35,$DJ$4<=37),DL101&\"F\",0)","v":{"$error":"#N/A"}}]
[null,30,"8/8",2,null,32,88,2,null,null,null,null,null,null,null,"S140 (HP)",null,1.5369999999999999,1.1875,-2.3125,null,-3.25,null,null,null,null,null,null,"Bottom Bottom Rail",{"$f":"(Frame_Width-2.25)/12","v":-0.1875},0.379,-7.1062500000000001E-2,null,"Top Stile",0,0,{"$f":"(AI102*AJ102)/12","v":0},null,null,null,{"$error":"#N/A"},0,{"$f":"IF(AND(AP102=22,$AN$4>=17,$AN$4<=21),AP102&\"C\",0)","v":{"$error":"#N/A"}},null,null,{"$error":"#N/A"},0,{"$f":"IF(AND(AU102=22,$AS$4>=17,$AS$4<=21),AU102&\"C\",0)","v":{"$error":"#N/A"}},null,null,null,null,null,null,null,null,null,null,null,null,null,null,null,null,null,null,null,null,null,null,null,null,null,null,null,null,null,null,null,null,null,null,null,null,null,null,null,null,null,null,null,null,null,null,null,null,null,null,null,null,null,null,null,null,null,null,null,null,null,{"$error":"#N/A"},{"$error":"#N/A"},{"$f":"IF(AND(DG102=34,$DE$4>=38,$DE$4<=40),DG102&\"G\",0)","v":{"$error":"#N/A"}},null,null,{"$error":"#N/A"},{"$error":"#N/A"},{"$f":"IF(AND(DL102=34,$DJ$4>=38,$DJ$4<=40),DL102&\"G\",0)","v":{"$error":"#N/A"}}]
[null,31,"8/8",2,null,33,89,2,null,null,null,null,null,null,null,"S144 (HP)",null,1.5369999999999999,1.1875,-2.3125,null,-3.25,null,null,null,null,null,null,"Bottom Stile",{"$f":"(2*(CMR!$E$59))/12","v":-0.47916666666666669},0.315,-0.1509375,null,"Top Rail Reinf.",0,0,0,null,null,null,{"$error":"#N/A"},0,{"$f":"IF(AND(AP103=22,$AN$4>=22,$AN$4<=24),AP103&\"D\",0)","v":{"$error":"#N/A"}},null,null,{"$error":"#N/A"},0,{"$f":"IF(AND(AU103=22,$AS$4>=22,$AS$4<=24),AU103&\"D\",0)","v":{"$error":"#N/A"}},null,null,null,null,null,null,null,null,null,null,null,null,null,null,null,null,null,null,null,null,null,null,null,null,null,null,null,null,null,null,null,null,null,null,null,null,null,null,null,null,null,null,null,null,null,null,null,null,null,null,null,null,null,null,null,null,null,null,null,null,null,{"$error":"#N/A"},{"$error":"#N/A"},{"$f":"IF(AND(DG103=34,$DE$4>=41,$DE$4<=43),DG103&\"H\",0)","v":{"$error":"#N/A"}},null,null,{"$error":"#N/A"},{"$error":"#N/A"},{"$f":"IF(AND(DL103=34,$DJ$4>=41,$DJ$4<=43),DL103&\"H\",0)","v":{"$error":"#N/A"}}]
[null,32,"8/8",2,null,34,89,2,null,null,null,null,null,null,null,"S146 (HP)",null,1.5369999999999999,1.1875,-2.3125,null,-3.25,null,null,null,null,null,null,"Bottom Rail Reinf.",{"$f":"(TRUNC(((Frame_Width-2.25)-6)/2)*2)/12","v":-0.66666666666666663},0.59599999999999997,-0.39733333333333332,null,"Top Stile Reinf",0,0,0,null,null,null,{"$error":"#N/A"},0,{"$f":"IF(AND(AP104=22,$AN$4>=25,$AN$4<=27),AP104&\"E\",0)","v":{"$error":"#N/A"}},null,null,{"$error":"#N/A"},0,{"$f":"IF(AND(AU104=22,$AS$4>=25,$AS$4<=27),AU104&\"E\",0)","v":{"$error":"#N/A"}},null,null,null,null,null,null,null,null,null,null,null,null,null,null,null,null,null,null,null,null,null,null,null,null,null,null,null,null,null,null,null,null,null,null,null,null,null,null,null,null,null,null,null,null,null,null,null,null,null,null,null,null,null,null,null,null,null,null,null,null,null,{"$error":"#N/A"},{"$error":"#N/A"},{"$f":"IF(AND(DG104=34,$DE$4>=44,$DE$4<=45),DG104&\"I\",0)","v":{"$error":"#N/A"}},null,null,{"$error":"#N/A"},{"$error":"#N/A"},{"$f":"IF(AND(DL104=34,$DJ$4>=44,$DJ$4<=45),DL104&\"I\",0)","v":{"$error":"#N/A"}}]
[null,33,"8/8",2,null,35,99,2,null,null,null,null,null,null,null,"3100",null,2.4300000000000002,0.1875,{"$f":"TRUNC((Frame_Width-2.14315)*32+0.5)/32","v":-2.125},null,{"$f":"INT((Frame_Height-(R105+0.5+ACHEIGHT+S105))*16+0.5)/16","v":-3.125},null,null,null,null,null,null,"Bottom Stile Reinf.",{"$f":"IF(CMR!$E$64>27.25,((TRUNC((CMR!$E$59-3.75)/2)*2)/12)*2,0)","v":0},0.27400000000000002,0,null,"Top Glass",0,0,0,null,null,null,{"$error":"#N/A"},0,{"$f":"IF(AND(AP105=22,$AN$4>=28,$AN$4<=30),AP105&\"F\",0)","v":{"$error":"#N/A"}},null,null,{"$error":"#N/A"},0,{"$f":"IF(AND(AU105=22,$AS$4>=28,$AS$4<=30),AU105&\"F\",0)","v":{"$error":"#N/A"}},null,null,null,null,null,null,null,null,null,null,null,null,null,null,null,null,null,null,null,null,null,null,null,null,null,null,null,null,null,null,null,null,null,null,null,null,null,null,null,null,null,null,null,null,null,null,null,null,null,null,null,null,null,null,null,null,null,null,null,null,null,{"$error":"#N/A"},{"$f":"IF(AND($DF$4<=36,$DF$4>34),36,0)","v":{"$error":"#N/A"}},{"$f":"IF(AND(DG105=36,$DE$4>=11,$DE$4<=16),DG105&\"A\",0)","v":{"$error":"#N/A"}},null,null,{"$error":"#N/A"},{"$f":"IF(AND($DK$4<=36,$DK$4>34),36,0)","v":{"$error":"#N/A"}},{"$f":"IF(AND(DL105=36,$DJ$4>=11,$DJ$4<=16),DL105&\"A\",0)","v":{"$error":"#N/A"}}]
[null,34,"9/9",2,null,36,99,2,null,null,null,null,null,null,null,9001,6.375,2.75,null,{"$f":"Frame_Width-4.9375","v":-4.9375},{"$f":"INT((Frame_Height-(Q106+R106+0.5+ACHEIGHT))*16+0.5)/16","v":-9.625},null,null,null,null,null,null,null,"Bottom Glass",{"$f":"(CMR!$E$62*CMR!$E$64)/144","v":0.10498046875},{"$f":"$L$12","v":3.2},0.3359375,null,"Top Spacer",0,0,0,null,null,null,{"$error":"#N/A"},0,{"$f":"IF(AND(AP106=22,$AN$4>=31,$AN$4<=34),AP106&\"G\",0)","v":{"$error":"#N/A"}},null,null,{"$error":"#N/A"},0,{"$f":"IF(AND(AU106=22,$AS$4>=31,$AS$4<=34),AU106&\"G\",0)","v":{"$error":"#N/A"}},null,null,null,null,null,null,null,null,null,null,null,null,null,null,null,null,null,null,null,null,null,null,null,null,null,null,null,null,null,null,null,null,null,null,null,null,null,null,null,null,null,null,null,null,null,null,null,null,null,null,null,null,null,null,null,null,null,null,null,null,null,{"$error":"#N/A"},{"$error":"#N/A"},{"$f":"IF(AND(DG106=36,$DE$4>=17,$DE$4<=22),DG106&\"B\",0)","v":{"$error":"#N/A"}},null,null,{"$error":"#N/A"},{"$error":"#N/A"},{"$f":"IF(AND(DL106=36,$DJ$4>=17,$DJ$4<=22),DL106&\"B\",0)","v":{"$error":"#N/A"}}]
[null,35,"9/9",2,null,37,766,3,null,null,null,null,null,null,null,"P601",6.375,2.75,null,{"$f":"Frame_Width-4.9375","v":-4.9375},{"$f":"INT((Frame_Height-(Q107+R107+0.5+ACHEIGHT))*16+0.5)/16","v":-9.625},null,null,null,null,null,null,null,"Bottom Spacer",{"$f":"((CMR!$E$62*2)+(CMR!$E$64*2))/12","v":-1.3645833333333333},5.3600000000000002E-2,-7.314166666666666E-2,null,"Top Hardware",0,0,0,null,null,null,{"$error":"#N/A"},0,{"$f":"IF(AND(AP107=22,$AN$4>=35,$AN$4<=37),AP107&\"H\",0)","v":{"$error":"#N/A"}},null,null,{"$error":"#N/A"},0,{"$f":"IF(AND(AU107=22,$AS$4>=35,$AS$4<=37),AU107&\"H\",0)","v":{"$error":"#N/A"}},null,null,null,null,null,null,null,null,null,null,null,null,null,null,null,null,null,null,null,null,null,null,null,null,null,null,null,null,null,null,null,null,null,null,null,null,null,null,null,null,null,null,null,null,null,null,null,null,null,null,null,null,null,null,null,null,null,null,null,null,null,{"$error":"#N/A"},{"$error":"#N/A"},{"$f":"IF(AND(DG107=36,$DE$4>=23,$DE$4<=27),DG107&\"C\",0)","v":{"$error":"#N/A"}},null,null,{"$error":"#N/A"},{"$error":"#N/A"},{"$f":"IF(AND(DL107=36,$DJ$4>=23,$DJ$4<=27),DL107&\"C\",0)","v":{"$error":"#N/A"}}]
[null,36,"9/9",2,null,38,766,3,null,null,null,null,null,null,null,"V100",null,2.0059999999999998,1,{"$f":"TRUNC((Frame_Width-2.188)*32+0.5)/32","v":-2.15625},null,{"$f":"INT((Frame_Height-(R108+0.5+ACHEIGHT+S108))*16+0.5)/16","v":-3.5},null,null,null,null,null,null,"Bottom Hardware",1,0.36,0.36,null,"Top Bead",0,0,0,null,null,null,{"$error":"#N/A"},0,{"$f":"IF(AND(AP108=22,$AN$4>=38,$AN$4<=40),AP108&\"I\",0)","v":{"$error":"#N/A"}},null,null,{"$error":"#N/A"},0,{"$f":"IF(AND(AU108=22,$AS$4>=38,$AS$4<=40),AU108&\"I\",0)","v":{"$error":"#N/A"}},null,null,null,null,null,null,null,null,null,null,null,null,null,null,null,null,null,null,null,null,null,null,null,null,null,null,null,null,null,null,null,null,null,null,null,null,null,null,null,null,null,null,null,null,null,null,null,null,null,null,null,null,null,null,null,null,null,null,null,null,null,{"$error":"#N/A"},{"$error":"#N/A"},{"$f":"IF(AND(DG108=36,$DE$4>=28,$DE$4<=32),DG108&\"D\",0)","v":{"$error":"#N/A"}},null,null,{"$error":"#N/A"},{"$error":"#N/A"},{"$f":"IF(AND(DL108=36,$DJ$4>=28,$DJ$4<=32),DL108&\"D\",0)","v":{"$error":"#N/A"}}]
[null,37,"9/9",2,null,39,866,3,null,null,null,null,null,null,null,"V101",1,2.0059999999999998,null,{"$f":"Frame_Width-3.4375","v":-3.4375},{"$f":"INT((Frame_Height-(Q109+R109+0.5+ACHEIGHT))*16+0.5)/16","v":-3.5},null,null,null,null,null,null,null,"Bottom Bead",{"$f":"(((Frame_Width-4.344)*2)+((CMR!$E$59-3.656)*2))/12","v":-1.8125},0.06,-0.10875,null,"Bottom Top Rail",{"$f":"(TRUNC((Frame_Width-2.14315)*32+0.5)/32)/12","v":-0.17708333333333334},0.33100000000000002,{"$f":"AI109*AJ109","v":-5.8614583333333338E-2},null,null,null,{"$error":"#N/A"},0,{"$f":"IF(AND(AP109=22,$AN$4>=41,$AN$4<=42),\"Dbl.\"&AP109&\"C\",0)","v":{"$error":"#N/A"}},null,null,{"$error":"#N/A"},0,{"$f":"IF(AND(AU109=22,$AS$4>=41,$AS$4<=42),\"Dbl.\"&AU109&\"C\",0)","v":{"$error":"#N/A"}},null,null,null,null,null,null,null,null,null,null,null,null,null,null,null,null,null,null,null,null,null,null,null,null,null,null,null,null,null,null,null,null,null,null,null,null,null,null,null,null,null,null,null,null,null,null,null,null,null,null,null,null,null,null,null,null,null,null,null,null,null,{"$error":"#N/A"},{"$error":"#N/A"},{"$f":"IF(AND(DG109=36,$DE$4>=33,$DE$4<=34),DG109&\"E\",0)","v":{"$error":"#N/A"}},null,null,{"$error":"#N/A"},{"$error":"#N/A"},{"$f":"IF(AND(DL109=36,$DJ$4>=33,$DJ$4<=34),DL109&\"E\",0)","v":{"$error":"#N/A"}}]
[null,38,"10/10",2,null,40,866,3,null,null,null,null,null,null,null,"V200",null,2.0059999999999998,0.4375,{"$f":"TRUNC((Frame_Width-2.188)*32+0.5)/32","v":-2.15625},null,{"$f":"INT((Frame_Height-(R110+0.5+ACHEIGHT+S110))*16+0.5)/16","v":-2.9375},null,null,null,null,null,null,null,null,"Top Sash",{"$f":"IF(ModelNo=\"0401\",(TRUNC((SUM(AF92:AF100))))+5,0)","v":0},null,"Bottom Bottom Rail",{"$f":"(TRUNC((Frame_Width-2.14315)*32+0.5)/32)/12","v":-0.17708333333333334},0.316,{"$f":"AI110*AJ110","v":-5.5958333333333339E-2},null,null,null,{"$error":"#N/A"},0,{"$f":"IF(AND(AP110=22,$AN$4>=43,$AN$4<=48),\"Dbl.\"&AP110&\"D\",0)","v":{"$error":"#N/A"}},null,null,{"$error":"#N/A"},0,{"$f":"IF(AND(AU110=22,$AS$4>=43,$AS$4<=48),\"Dbl.\"&AU110&\"D\",0)","v":{"$error":"#N/A"}},null,null,null,null,null,null,null,null,null,null,null,null,null,null,null,null,null,null,null,null,null,null,null,null,null,null,null,null,null,null,null,null,null,null,null,null,null,null,null,null,null,null,null,null,null,null,null,null,null,null,null,null,null,null,null,null,null,null,null,null,null,{"$error":"#N/A"},{"$error":"#N/A"},{"$f":"IF(AND(DG110=36,$DE$4>=35,$DE$4<=37),DG110&\"F\",0)","v":{"$error":"#N/A"}},null,null,{"$error":"#N/A"},{"$error":"#N/A"},{"$f":"IF(AND(DL110=36,$DJ$4>=35,$DJ$4<=37),DL110&\"F\",0)","v":{"$error":"#N/A"}}]
[null,39,"10/10",2,null,41,777,3,null,null,null,null,null,null,null,"3001","6",1.875,null,{"$f":"Frame_Width-4.125","v":-4.125},{"$f":"INT((Frame_Height-(Q111+R111+0.5+ACHEIGHT))*16+0.5)/16","v":-8.375},null,null,null,null,null,null,null,null,null,"Bottom Sash",{"$f":"IF(ModelNo=\"0401\",TRUNC((SUM(AF101:AF109))),0)","v":0},null,"Bottom Stile",{"$f":"((CMR!$E$91-2.09375)*2)/12","v":-0.34895833333333331},0.27,{"$f":"AI111*AJ111","v":-9.4218750000000004E-2},null,null,null,{"$error":"#N/A"},0,{"$f":"IF(AND(AP111=22,$AN$4>=49,$AN$4<=54),\"Dbl.\"&AP111&\"E\",0)","v":{"$error":"#N/A"}},null,null,{"$error":"#N/A"},0,{"$f":"IF(AND(AU111=22,$AS$4>=49,$AS$4<=54),\"Dbl.\"&AU111&\"E\",0)","v":{"$error":"#N/A"}},null,null,null,null,null,null,null,null,null,null,null,null,null,null,null,null,null,null,null,null,null,null,null,null,null,null,null,null,null,null,null,null,null,null,null,null,null,null,null,null,null,null,null,null,null,null,null,null,null,null,null,null,null,null,null,null,null,null,null,null,null,{"$error":"#N/A"},{"$error":"#N/A"},{"$f":"IF(AND(DG111=36,$DE$4>=38,$DE$4<=40),DG111&\"G\",0)","v":{"$error":"#N/A"}},null,null,{"$error":"#N/A"},{"$error":"#N/A"},{"$f":"IF(AND(DL111=36,$DJ$4>=38,$DJ$4<=40),DL111&\"G\",0)","v":{"$error":"#N/A"}}]
[null,40,"10/10",2,null,42,777,3,null,null,null,null,null,null,null,null,null,null,null,null,null,null,null,null,null,null,null,null,null,null,null,null,null,"Lock Rail Reinf.",{"$f":"((TRUNC((Frame_Width-2.14315)*32+0.5)/32)-0.25)/12","v":-0.19791666666666666},0.39200000000000002,{"$f":"AI112*AJ112","v":-7.7583333333333337E-2},null,null,null,{"$error":"#N/A"},0,{"$f":"IF(AND(AP112=22,$AN$4>=55,$AN$4<=60),\"Dbl.\"&AP112&\"F\",0)","v":{"$error":"#N/A"}},null,null,{"$error":"#N/A"},0,{"$f":"IF(AND(AU112=22,$AS$4>=55,$AS$4<=60),\"Dbl.\"&AU112&\"F\",0)","v":{"$error":"#N/A"}},null,null,null,null,null,null,null,null,null,null,null,null,null,null,null,null,null,null,null,null,null,null,null,null,null,null,null,null,null,null,null,null,null,null,null,null,null,null,null,null,null,null,null,null,null,null,null,null,null,null,null,null,null,null,null,null,null,null,null,null,null,{"$error":"#N/A"},{"$error":"#N/A"},{"$f":"IF(AND(DG112=36,$DE$4>=41,$DE$4<=43),DG112&\"H\",0)","v":{"$error":"#N/A"}},null,null,{"$error":"#N/A"},{"$error":"#N/A"},{"$f":"IF(AND(DL112=36,$DJ$4>=41,$DJ$4<=43),DL112&\"H\",0)","v":{"$error":"#N/A"}}]
[null,41,"10/10",2,null,43,877,3,null,null,null,null,null,null,null,null,null,null,null,null,null,null,null,null,null,null,null,null,"0501","Length","Weight/ft","Weight",null,"Lock Rail Reinf.",{"$f":"((((Frame_Width-3.625)-0.5)/2)*2)/12","v":-0.34375},0.22900000000000001,{"$f":"AI113*AJ113","v":-7.8718750000000004E-2},null,null,null,{"$error":"#N/A"},0,{"$f":"IF(AND(AP113=22,$AN$4>=61,$AN$4<=68),\"Dbl.\"&AP113&\"G\",0)","v":{"$error":"#N/A"}},null,null,{"$error":"#N/A"},0,{"$f":"IF(AND(AU113=22,$AS$4>=61,$AS$4<=68),\"Dbl.\"&AU113&\"G\",0)","v":{"$error":"#N/A"}},null,null,null,null,null,null,null,null,null,null,null,null,null,null,null,null,null,null,null,null,null,null,null,null,null,null,null,null,null,null,null,null,null,null,null,null,null,null,null,null,null,null,null,null,null,null,null,null,null,null,null,null,null,null,null,null,null,null,null,null,null,{"$error":"#N/A"},{"$error":"#N/A"},{"$f":"IF(AND(DG113=36,$DE$4>=44,$DE$4<=45),DG113&\"I\",0)","v":{"$error":"#N/A"}},null,null,{"$error":"#N/A"},{"$error":"#N/A"},{"$f":"IF(AND(DL113=36,$DJ$4>=44,$DJ$4<=45),DL113&\"I\",0)","v":{"$error":"#N/A"}}]
[null,42,"6/8/8",3,null,44,877,3,null,null,null,null,null,null,null,null,null,null,null,null,null,null,null,null,null,null,null,null,"Top Top Rail",{"$f":"(Frame_Width-4.25)/12","v":-0.35416666666666669},0.36899999999999999,{"$f":"AD114*AE114","v":-0.13068750000000001},null,"Handle Rail Reinf.",{"$f":"((((Frame_Width-3.625)-0.5)/2)*2)/12","v":-0.34375},0.53600000000000003,-0.18425000000000002,null,null,null,{"$error":"#N/A"},0,{"$f":"IF(AND(AP114=22,$AN$4>=69,$AN$4<=74),\"Dbl.\"&AP114&\"H\",0)","v":{"$error":"#N/A"}},null,null,{"$error":"#N/A"},0,{"$f":"IF(AND(AU114=22,$AS$4>=69,$AS$4<=74),\"Dbl.\"&AU114&\"H\",0)","v":{"$error":"#N/A"}},null,null,null,null,null,null,null,null,null,null,null,null,null,null,null,null,null,null,null,null,null,null,null,null,null,null,null,null,null,null,null,null,null,null,null,null,null,null,null,null,null,null,null,null,null,null,null,null,null,null,null,null,null,null,null,null,null,null,null,null,null,{"$error":"#N/A"},{"$f":"IF(AND($DF$4<=38,$DF$4>36),38,0)","v":{"$error":"#N/A"}},{"$f":"IF(AND(DG114=38,$DE$4>=11,$DE$4<=16),DG114&\"A\",0)","v":{"$error":"#N/A"}},null,null,{"$error":"#N/A"},{"$f":"IF(AND($DK$4<=38,$DK$4>36),38,0)","v":{"$error":"#N/A"}},{"$f":"IF(AND(DL114=38,$DJ$4>=11,$DJ$4<=16),DL114&\"A\",0)","v":{"$error":"#N/A"}}]
[null,43,"6/8/8",3,null,45,878,3,null,null,null,null,null,null,null,null,null,null,null,null,null,null,null,null,null,null,null,null,"Top Bottom Rail",{"$f":"(Frame_Width-4.25)/12","v":-0.35416666666666669},0.36899999999999999,-0.13068750000000001,null,"Bottom Stile Reinf.",{"$f":"(CMR!$E$91-2.09375)/12","v":-0.17447916666666666},0.53600000000000003,-9.3520833333333331E-2,null,null,null,{"$error":"#N/A"},0,{"$f":"IF(AND(AP115=22,$AN$4>=75,$AN$4<=80),\"Dbl.\"&AP115&\"I\",0)","v":{"$error":"#N/A"}},null,null,{"$error":"#N/A"},0,{"$f":"IF(AND(AU115=22,$AS$4>=75,$AS$4<=80),\"Dbl.\"&AU115&\"I\",0)","v":{"$error":"#N/A"}},null,null,null,null,null,null,null,null,null,null,null,null,null,null,null,null,null,null,null,null,null,null,null,null,null,null,null,null,null,null,null,null,null,null,null,null,null,null,null,null,null,null,null,null,null,null,null,null,null,null,null,null,null,null,null,null,null,null,null,null,null,{"$error":"#N/A"},{"$error":"#N/A"},{"$f":"IF(AND(DG115=38,$DE$4>=17,$DE$4<=22),DG115&\"B\",0)","v":{"$error":"#N/A"}},null,null,{"$error":"#N/A"},{"$error":"#N/A"},{"$f":"IF(AND(DL115=38,$DJ$4>=17,$DJ$4<=22),DL115&\"B\",0)","v":{"$error":"#N/A"}}]
[null,44,"6/8/8",3,null,46,878,3,null,null,null,null,null,null,null,null,null,null,null,null,null,null,null,null,null,null,null,null,"Top Stile",{"$f":"(2*(CMR!$L$42-2.25))/12","v":-0.375},0.36899999999999999,-0.138375,null,"Bottom Glass",{"$f":"(CMR!$E$94*CMR!$E$96)/144","v":9.7927517361111105E-2},{"$f":"$L$12","v":3.2},0.31336805555555558,null,null,null,{"$error":"#N/A"},{"$f":"IF(AND($AO$4<=24,$AO$4>22),24,0)","v":0},{"$f":"IF(AND(AP116=24,$AN$4>=6,$AN$4<=10),AP116&\"A\",0)","v":{"$error":"#N/A"}},null,null,{"$error":"#N/A"},{"$f":"IF(AND($AT$4<=24,$AT$4>22),24,0)","v":0},{"$f":"IF(AND(AU116=24,$AS$4>=6,$AS$4<=10),AU116&\"A\",0)","v":{"$error":"#N/A"}},null,null,null,null,null,null,null,null,null,null,null,null,null,null,null,null,null,null,null,null,null,null,null,null,null,null,null,null,null,null,null,null,null,null,null,null,null,null,null,null,null,null,null,null,null,null,null,null,null,null,null,null,null,null,null,null,null,null,null,null,null,{"$error":"#N/A"},{"$error":"#N/A"},{"$f":"IF(AND(DG116=38,$DE$4>=23,$DE$4<=27),DG116&\"C\",0)","v":{"$error":"#N/A"}},null,null,{"$error":"#N/A"},{"$error":"#N/A"},{"$f":"IF(AND(DL116=38,$DJ$4>=23,$DJ$4<=27),DL116&\"C\",0)","v":{"$error":"#N/A"}}]
[null,45,"6/8/8",3,null,47,888,3,null,null,null,null,null,null,null,null,null,null,null,null,null,null,null,null,null,null,null,null,"Top Rail Reinf.",{"$f":"(TRUNC(((Frame_Width-4.25)-6)/2)*2)/12","v":-0.83333333333333337},0.26400000000000001,-0.22000000000000003,null,"Bottom Spacer",{"$f":"((CMR!$E$94*2)+(CMR!$E$96*2))/12","v":-1.2864583333333333},5.3600000000000002E-2,-6.8954166666666664E-2,null,null,null,{"$error":"#N/A"},0,{"$f":"IF(AND(AP117=24,$AN$4>=11,$AN$4<=17),AP117&\"B\",0)","v":{"$error":"#N/A"}},null,null,{"$error":"#N/A"},0,{"$f":"IF(AND(AU117=24,$AS$4>=11,$AS$4<=17),AU117&\"B\",0)","v":{"$error":"#N/A"}},null,null,null,null,null,null,null,null,null,null,null,null,null,null,null,null,null,null,null,null,null,null,null,null,null,null,null,null,null,null,null,null,null,null,null,null,null,null,null,null,null,null,null,null,null,null,null,null,null,null,null,null,null,null,null,null,null,null,null,null,null,{"$error":"#N/A"},{"$error":"#N/A"},{"$f":"IF(AND(DG117=38,$DE$4>=28,$DE$4<=32),DG117&\"D\",0)","v":{"$error":"#N/A"}},null,null,{"$error":"#N/A"},{"$error":"#N/A"},{"$f":"IF(AND(DL117=38,$DJ$4>=28,$DJ$4<=32),DL117&\"D\",0)","v":{"$error":"#N/A"}}]
[null,46,"8/8/8",3,null,48,888,3,null,null,null,null,null,null,null,null,null,null,null,null,null,null,null,null,null,null,null,null,"Top Stile Reinf",{"$f":"IF(CMR!$L$47>26.1875,((TRUNC((CMR!$L$43-10)/2)*2)/12)*2,0)","v":0},0.26400000000000001,0,null,"Bottom Hardware",1,0.36,0.36,null,null,null,{"$error":"#N/A"},0,{"$f":"IF(AND(AP118=24,$AN$4>=18,$AN$4<=22),AP118&\"C\",0)","v":{"$error":"#N/A"}},null,null,{"$error":"#N/A"},0,{"$f":"IF(AND(AU118=24,$AS$4>=18,$AS$4<=22),AU118&\"C\",0)","v":{"$error":"#N/A"}},null,null,null,null,null,null,null,null,null,null,null,null,null,null,null,null,null,null,null,null,null,null,null,null,null,null,null,null,null,null,null,null,null,null,null,null,null,null,null,null,null,null,null,null,null,null,null,null,null,null,null,null,null,null,null,null,null,null,null,null,null,{"$error":"#N/A"},{"$error":"#N/A"},{"$f":"IF(AND(DG118=38,$DE$4>=33,$DE$4<=34),DG118&\"E\",0)","v":{"$error":"#N/A"}},null,null,{"$error":"#N/A"},{"$error":"#N/A"},{"$f":"IF(AND(DL118=38,$DJ$4>=33,$DJ$4<=34),DL118&\"E\",0)","v":{"$error":"#N/A"}}]
[null,47,"8/8/8",3,null,49,889,3,null,null,null,null,null,null,null,null,null,null,null,null,null,null,null,null,null,null,null,null,"Top Glass",{"$f":"(CMR!$L$45*CMR!$L$47)/144","v":5.18798828125E-2},{"$f":"$L$12","v":3.2},0.166015625,null,"Bottom Bead",{"$f":"(((Frame_Width-4.45565)*2)+((CMR!$E$91-4.09375)*2))/12","v":-1.4249000000000001},4.5999999999999999E-2,-6.5545400000000004E-2,null,null,null,{"$error":"#N/A"},0,{"$f":"IF(AND(AP119=24,$AN$4>=23,$AN$4<=25),AP119&\"D\",0)","v":{"$error":"#N/A"}},null,null,{"$error":"#N/A"},0,{"$f":"IF(AND(AU119=24,$AS$4>=23,$AS$4<=25),AU119&\"D\",0)","v":{"$error":"#N/A"}},null,null,null,null,null,null,null,null,null,null,null,null,null,null,null,null,null,null,null,null,null,null,null,null,null,null,null,null,null,null,null,null,null,null,null,null,null,null,null,null,null,null,null,null,null,null,null,null,null,null,null,null,null,null,null,null,null,null,null,null,null,{"$error":"#N/A"},{"$error":"#N/A"},{"$f":"IF(AND(DG119=38,$DE$4>=35,$DE$4<=37),DG119&\"F\",0)","v":{"$error":"#N/A"}},null,null,{"$error":"#N/A"},{"$error":"#N/A"},{"$f":"IF(AND(DL119=38,$DJ$4>=35,$DJ$4<=37),DL119&\"F\",0)","v":{"$error":"#N/A"}}]
[null,48,"8/8/8",3,null,50,889,3,null,null,null,null,null,null,null,null,null,null,null,null,null,null,null,null,null,null,null,null,"Top Spacer",{"$f":"((CMR!$L$45*2)+(CMR!$L$47*2))/12","v":-0.91145833333333337},5.3600000000000002E-2,-4.8854166666666671E-2,null,null,null,"Top Sash",{"$f":"IF(ModelNo=\"3100\",TRUNC((SUM(AK100:AK108))),0)","v":0},null,null,null,{"$error":"#N/A"},0,{"$f":"IF(AND(AP120=24,$AN$4>=26,$AN$4<=28),AP120&\"E\",0)","v":{"$error":"#N/A"}},null,null,{"$error":"#N/A"},0,{"$f":"IF(AND(AU120=24,$AS$4>=26,$AS$4<=28),AU120&\"E\",0)","v":{"$error":"#N/A"}},null,null,null,null,null,null,null,null,null,null,null,null,null,null,null,null,null,null,null,null,null,null,null,null,null,null,null,null,null,null,null,null,null,null,null,null,null,null,null,null,null,null,null,null,null,null,null,null,null,null,null,null,null,null,null,null,null,null,null,null,null,{"$error":"#N/A"},{"$error":"#N/A"},{"$f":"IF(AND(DG120=38,$DE$4>=38,$DE$4<=40),DG120&\"G\",0)","v":{"$error":"#N/A"}},null,null,{"$error":"#N/A"},{"$error":"#N/A"},{"$f":"IF(AND(DL120=38,$DJ$4>=38,$DJ$4<=40),DL120&\"G\",0)","v":{"$error":"#N/A"}}]
[null,49,"8/8/8",3,null,51,899,3,null,null,null,null,null,null,null,null,null,null,null,null,null,null,null,null,null,null,null,null,"Top Hardware",1,0.2,0.2,null,null,null,"Bottom Sash",{"$f":"IF(ModelNo=\"3100\",TRUNC(SUM(AK109:AK119)),0)","v":0},null,null,null,{"$error":"#N/A"},0,{"$f":"IF(AND(AP121=24,$AN$4>=29,$AN$4<=30),AP121&\"F\",0)","v":{"$error":"#N/A"}},null,null,{"$error":"#N/A"},0,{"$f":"IF(AND(AU121=24,$AS$4>=29,$AS$4<=30),AU121&\"F\",0)","v":{"$error":"#N/A"}},null,null,null,null,null,null,null,null,null,null,null,null,null,null,null,null,null,null,null,null,null,null,null,null,null,null,null,null,null,null,null,null,null,null,null,null,null,null,null,null,null,null,null,null,null,null,null,null,null,null,null,null,null,null,null,null,null,null,null,null,null,{"$error":"#N/A"},{"$error":"#N/A"},{"$f":"IF(AND(DG121=38,$DE$4>=41,$DE$4<=43),DG121&\"H\",0)","v":{"$error":"#N/A"}},null,null,{"$error":"#N/A"},{"$error":"#N/A"},{"$f":"IF(AND(DL121=38,$DJ$4>=41,$DJ$4<=43),DL121&\"H\",0)","v":{"$error":"#N/A"}}]
[null,50,"8/9/9",3,null,52,899,3,null,null,null,null,null,null,null,null,null,null,null,null,null,null,null,null,null,null,null,null,"Top Handle Bead",{"$f":"(Frame_Width-5.912)/12","v":-0.49266666666666664},0.104,-5.1237333333333329E-2,null,null,null,null,null,null,null,null,{"$error":"#N/A"},0,{"$f":"IF(AND(AP122=24,$AN$4>=31,$AN$4<=34),AP122&\"G\",0)","v":{"$error":"#N/A"}},null,null,{"$error":"#N/A"},0,{"$f":"IF(AND(AU122=24,$AS$4>=31,$AS$4<=34),AU122&\"G\",0)","v":{"$error":"#N/A"}},null,null,null,null,null,null,null,null,null,null,null,null,null,null,null,null,null,null,null,null,null,null,null,null,null,null,null,null,null,null,null,null,null,null,null,null,null,null,null,null,null,null,null,null,null,null,null,null,null,null,null,null,null,null,null,null,null,null,null,null,null,{"$error":"#N/A"},{"$error":"#N/A"},{"$f":"IF(AND(DG122=38,$DE$4>=44,$DE$4<=45),DG122&\"I\",0)","v":{"$error":"#N/A"}},null,null,{"$error":"#N/A"},{"$error":"#N/A"},{"$f":"IF(AND(DL122=38,$DJ$4>=44,$DJ$4<=45),DL122&\"I\",0)","v":{"$error":"#N/A"}}]
[null,51,"8/9/9",3,null,53,999,3,null,null,null,null,null,null,null,null,null,null,null,null,null,null,null,null,null,null,null,null,"Top Bead",{"$f":"((Frame_Width-4.25)+((CMR!$L$42-5.0625)*2))/12","v":-1.1979166666666667},7.3999999999999996E-2,{"$f":"AD123*AE123","v":-8.864583333333334E-2},null,"i201","Length","Weight/ft","Weight",null,null,null,{"$error":"#N/A"},0,{"$f":"IF(AND(AP123=24,$AN$4>=35,$AN$4<=37),AP123&\"H\",0)","v":{"$error":"#N/A"}},null,null,{"$error":"#N/A"},0,{"$f":"IF(AND(AU123=24,$AS$4>=35,$AS$4<=37),AU123&\"H\",0)","v":{"$error":"#N/A"}},null,null,null,null,null,null,null,null,null,null,null,null,null,null,null,null,null,null,null,null,null,null,null,null,null,null,null,null,null,null,null,null,null,null,null,null,null,null,null,null,null,null,null,null,null,null,null,null,null,null,null,null,null,null,null,null,null,null,null,null,null,{"$error":"#N/A"},{"$f":"IF(AND($DF$4<=40,$DF$4>38),40,0)","v":{"$error":"#N/A"}},{"$f":"IF(AND(DG123=40,$DE$4>=11,$DE$4<=16),DG123&\"A\",0)","v":{"$error":"#N/A"}},null,null,{"$error":"#N/A"},{"$f":"IF(AND($DK$4<=40,$DK$4>38),40,0)","v":{"$error":"#N/A"}},{"$f":"IF(AND(DL123=40,$DJ$4>=11,$DJ$4<=16),DL123&\"A\",0)","v":{"$error":"#N/A"}}]
[null,52,"8/9/9",3,null,54,999,3,null,null,null,null,null,null,null,null,null,null,null,null,null,null,null,null,null,null,null,null,"Bottom Top Rail",{"$f":"(Frame_Width-3.25)/12","v":-0.27083333333333331},0.437,-0.11835416666666666,null,"Top Top Rail",{"$f":"(Frame_Width-3.25)/12","v":-0.27083333333333331},0.25700000000000001,{"$f":"AI124*AJ124","v":-6.9604166666666661E-2},null,null,null,{"$error":"#N/A"},0,{"$f":"IF(AND(AP124=24,$AN$4>=38,$AN$4<=40),AP124&\"I\",0)","v":{"$error":"#N/A"}},null,null,{"$error":"#N/A"},0,{"$f":"IF(AND(AU124=24,$AS$4>=38,$AS$4<=40),AU124&\"I\",0)","v":{"$error":"#N/A"}},null,null,null,null,null,null,null,null,null,null,null,null,null,null,null,null,null,null,null,null,null,null,null,null,null,null,null,null,null,null,null,null,null,null,null,null,null,null,null,null,null,null,null,null,null,null,null,null,null,null,null,null,null,null,null,null,null,null,null,null,null,{"$error":"#N/A"},{"$error":"#N/A"},{"$f":"IF(AND(DG124=40,$DE$4>=17,$DE$4<=22),DG124&\"B\",0)","v":{"$error":"#N/A"}},null,null,{"$error":"#N/A"},{"$error":"#N/A"},{"$f":"IF(AND(DL124=40,$DJ$4>=17,$DJ$4<=22),DL124&\"B\",0)","v":{"$error":"#N/A"}}]
[null,53,"8/9/9",3,null,55,6679,4,null,null,null,null,null,null,null,null,null,null,null,null,null,null,null,null,null,null,null,null,"Bottom Bottom Rail",{"$f":"(Frame_Width-3.25)/12","v":-0.27083333333333331},0.437,-0.11835416666666666,null,"Top Bottom Rail",{"$f":"(Frame_Width-3.25)/12","v":-0.27083333333333331},0.27300000000000002,-7.3937500000000003E-2,null,null,null,{"$f":"IF(AND(AP125>0,AQ125>0),AP125,0)","v":{"$error":"#N/A"}},0,{"$f":"IF(AND(AP125=24,$AN$4>=41,$AN$4<=44),\"Dbl.\"&AP125&\"C\",0)","v":{"$error":"#N/A"}},null,null,{"$error":"#N/A"},0,{"$f":"IF(AND(AU125=24,$AS$4>=41,$AS$4<=44),\"Dbl.\"&AU125&\"C\",0)","v":{"$error":"#N/A"}},null,null,null,null,null,null,null,null,null,null,null,null,null,null,null,null,null,null,null,null,null,null,null,null,null,null,null,null,null,null,null,null,null,null,null,null,null,null,null,null,null,null,null,null,null,null,null,null,null,null,null,null,null,null,null,null,null,null,null,null,null,{"$error":"#N/A"},{"$error":"#N/A"},{"$f":"IF(AND(DG125=40,$DE$4>=23,$DE$4<=27),DG125&\"C\",0)","v":{"$error":"#N/A"}},null,null,{"$error":"#N/A"},{"$error":"#N/A"},{"$f":"IF(AND(DL125=40,$DJ$4>=23,$DJ$4<=27),DL125&\"C\",0)","v":{"$error":"#N/A"}}]
[null,54,"9/9/10",3,null,56,6679,4,null,null,null,null,null,null,null,null,null,null,null,null,null,null,null,null,null,null,null,null,"Bottom Stile",{"$f":"(2*(CMR!$L$43-1.25))/12","v":-0.20833333333333334},0.437,-9.1041666666666674E-2,null,"Top Stile",{"$f":"(2*(CMR!$E$26-1.5625))/12","v":-0.26041666666666669},0.23300000000000001,-6.067708333333334E-2,null,null,null,{"$error":"#N/A"},0,{"$f":"IF(AND(AP126=24,$AN$4>=45,$AN$4<=50),\"Dbl.\"&AP126&\"D\",0)","v":{"$error":"#N/A"}},null,null,{"$error":"#N/A"},0,{"$f":"IF(AND(AU126=24,$AS$4>=45,$AS$4<=50),\"Dbl.\"&AU126&\"D\",0)","v":{"$error":"#N/A"}},null,null,null,null,null,null,null,null,null,null,null,null,null,null,null,null,null,null,null,null,null,null,null,null,null,null,null,null,null,null,null,null,null,null,null,null,null,null,null,null,null,null,null,null,null,null,null,null,null,null,null,null,null,null,null,null,null,null,null,null,null,{"$error":"#N/A"},{"$error":"#N/A"},{"$f":"IF(AND(DG126=40,$DE$4>=28,$DE$4<=32),DG126&\"D\",0)","v":{"$error":"#N/A"}},null,null,{"$error":"#N/A"},{"$error":"#N/A"},{"$f":"IF(AND(DL126=40,$DJ$4>=28,$DJ$4<=32),DL126&\"D\",0)","v":{"$error":"#N/A"}}]
[null,55,"9/9/10",3,null,57,6779,4,null,null,null,null,null,null,null,null,null,null,null,null,null,null,null,null,null,null,null,null,"Bottom Rail Reinf.",{"$f":"(TRUNC(((Frame_Width-3.25)-6)/2)*2)/12","v":-0.66666666666666663},0.43440000000000001,-0.28959999999999997,null,"Keeper Rail Reinf.",{"$f":"(TRUNC(Frame_Width-3.25)-6)/12","v":-0.75},0.43099999999999999,-0.32324999999999998,null,null,null,{"$error":"#N/A"},0,{"$f":"IF(AND(AP127=24,$AN$4>=51,$AN$4<=56),\"Dbl.\"&AP127&\"E\",0)","v":{"$error":"#N/A"}},null,null,{"$error":"#N/A"},0,{"$f":"IF(AND(AU127=24,$AS$4>=51,$AS$4<=56),\"Dbl.\"&AU127&\"E\",0)","v":{"$error":"#N/A"}},null,null,null,null,null,null,null,null,null,null,null,null,null,null,null,null,null,null,null,null,null,null,null,null,null,null,null,null,null,null,null,null,null,null,null,null,null,null,null,null,null,null,null,null,null,null,null,null,null,null,null,null,null,null,null,null,null,null,null,null,null,{"$error":"#N/A"},{"$error":"#N/A"},{"$f":"IF(AND(DG127=40,$DE$4>=33,$DE$4<=34),DG127&\"E\",0)","v":{"$error":"#N/A"}},null,null,{"$error":"#N/A"},{"$error":"#N/A"},{"$f":"IF(AND(DL127=40,$DJ$4>=33,$DJ$4<=34),DL127&\"E\",0)","v":{"$error":"#N/A"}}]
[null,56,"9/9/10",3,null,58,6779,4,null,null,null,null,null,null,null,null,null,null,null,null,null,null,null,null,null,null,null,null,"Bottom Stile Reinf.",{"$f":"IF(CMR!$L$48>26.1875,((TRUNC((CMR!$L$43-4)/2)*2)/12)*2,0)","v":0},0.43440000000000001,0,null,"Top Stile Reinf",{"$f":"(2*(CMR!$E$26-3.5625))/12","v":-0.59375},0.43099999999999999,-0.25590625,null,null,null,{"$error":"#N/A"},0,{"$f":"IF(AND(AP128=24,$AN$4>=57,$AN$4<=60),\"Dbl.\"&AP128&\"F\",0)","v":{"$error":"#N/A"}},null,null,{"$error":"#N/A"},0,{"$f":"IF(AND(AU128=24,$AS$4>=57,$AS$4<=60),\"Dbl.\"&AU128&\"F\",0)","v":{"$error":"#N/A"}},null,null,null,null,null,null,null,null,null,null,null,null,null,null,null,null,null,null,null,null,null,null,null,null,null,null,null,null,null,null,null,null,null,null,null,null,null,null,null,null,null,null,null,null,null,null,null,null,null,null,null,null,null,null,null,null,null,null,null,null,null,{"$error":"#N/A"},{"$error":"#N/A"},{"$f":"IF(AND(DG128=40,$DE$4>=35,$DE$4<=37),DG128&\"F\",0)","v":{"$error":"#N/A"}},null,null,{"$error":"#N/A"},{"$error":"#N/A"},{"$f":"IF(AND(DL128=40,$DJ$4>=35,$DJ$4<=37),DL128&\"F\",0)","v":{"$error":"#N/A"}}]
[null,57,"9/9/10",3,null,59,7779,4,null,null,null,null,null,null,null,null,null,null,null,null,null,null,null,null,null,null,null,null,"Bottom Glass",{"$f":"(CMR!$L$46*CMR!$L$48)/144","v":0.1001925998263889},{"$f":"$L$12","v":3.2},0.32061631944444446,null,"Top Glass",{"$f":"(CMR!$E$29*CMR!$E$31)/144","v":0.10791015625},{"$f":"$L$12","v":3.2},0.34531250000000002,null,null,null,{"$error":"#N/A"},0,{"$f":"IF(AND(AP129=24,$AN$4>=61,$AN$4<=68),\"Dbl.\"&AP129&\"G\",0)","v":{"$error":"#N/A"}},null,null,{"$error":"#N/A"},0,{"$f":"IF(AND(AU129=24,$AS$4>=61,$AS$4<=68),\"Dbl.\"&AU129&\"G\",0)","v":{"$error":"#N/A"}},null,null,null,null,null,null,null,null,null,null,null,null,null,null,null,null,null,null,null,null,null,null,null,null,null,null,null,null,null,null,null,null,null,null,null,null,null,null,null,null,null,null,null,null,null,null,null,null,null,null,null,null,null,null,null,null,null,null,null,null,null,{"$error":"#N/A"},{"$error":"#N/A"},{"$f":"IF(AND(DG129=40,$DE$4>=38,$DE$4<=40),DG129&\"G\",0)","v":{"$error":"#N/A"}},null,null,{"$error":"#N/A"},{"$error":"#N/A"},{"$f":"IF(AND(DL129=40,$DJ$4>=38,$DJ$4<=40),DL129&\"G\",0)","v":{"$error":"#N/A"}}]
[null,58,"10/10/10",3,null,60,7779,4,null,null,null,null,null,null,null,null,null,null,null,null,null,null,null,null,null,null,null,null,"Bottom Spacer",{"$f":"((CMR!$L$46*2)+(CMR!$L$48*2))/12","v":-1.359375},5.3600000000000002E-2,-7.2862499999999997E-2,null,"Top Spacer",{"$f":"((CMR!$E$29*2)+(CMR!$E$31*2))/12","v":-1.34375},5.3600000000000002E-2,-7.2025000000000006E-2,null,null,null,{"$error":"#N/A"},0,{"$f":"IF(AND(AP130=24,$AN$4>=69,$AN$4<=74),\"Dbl.\"&AP130&\"H\",0)","v":{"$error":"#N/A"}},null,null,{"$error":"#N/A"},0,{"$f":"IF(AND(AU130=24,$AS$4>=69,$AS$4<=74),\"Dbl.\"&AU130&\"H\",0)","v":{"$error":"#N/A"}},null,null,null,null,null,null,null,null,null,null,null,null,null,null,null,null,null,null,null,null,null,null,null,null,null,null,null,null,null,null,null,null,null,null,null,null,null,null,null,null,null,null,null,null,null,null,null,null,null,null,null,null,null,null,null,null,null,null,null,null,null,{"$error":"#N/A"},{"$error":"#N/A"},{"$f":"IF(AND(DG130=40,$DE$4>=41,$DE$4<=42),DG130&\"H\",0)","v":{"$error":"#N/A"}},null,null,{"$error":"#N/A"},{"$error":"#N/A"},{"$f":"IF(AND(DL130=40,$DJ$4>=41,$DJ$4<=42),DL130&\"H\",0)","v":{"$error":"#N/A"}}]
[null,59,"10/10/10",3,null,61,6799,4,null,null,null,null,null,null,null,null,null,null,null,null,null,null,null,null,null,null,null,null,"Bottom Hardware",1,0.36,0.36,null,"Top Hardware",1,{"$f":"IF(Frame_Width>36,0.258,0.2)","v":0.2},0.2,null,null,null,{"$error":"#N/A"},0,{"$f":"IF(AND(AP131=24,$AN$4>=75,$AN$4<=80),\"Dbl.\"&AP131&\"I\",0)","v":{"$error":"#N/A"}},null,null,{"$error":"#N/A"},0,{"$f":"IF(AND(AU131=24,$AS$4>=75,$AS$4<=80),\"Dbl.\"&AU131&\"I\",0)","v":{"$error":"#N/A"}},null,null,null,null,null,null,null,null,null,null,null,null,null,null,null,null,null,null,null,null,null,null,null,null,null,null,null,null,null,null,null,null,null,null,null,null,null,null,null,null,null,null,null,null,null,null,null,null,null,null,null,null,null,null,null,null,null,null,null,null,null,{"$error":"#N/A"},{"$error":"#N/A"},{"$f":"IF(AND(DG131=40,$DE$4>=43,$DE$4<=45),DG131&\"I\",0)","v":{"$error":"#N/A"}},null,null,{"$error":"#N/A"},{"$error":"#N/A"},{"$f":"IF(AND(DL131=40,$DJ$4>=43,$DJ$4<=45),DL131&\"I\",0)","v":{"$error":"#N/A"}}]
[null,60,"10/10/10",3,null,62,6799,4,null,null,null,null,null,null,null,null,null,null,null,null,null,null,null,null,null,null,null,null,"Bottom Keeper Bead",{"$f":"(Frame_Width-5.912)/12","v":-0.49266666666666664},0.109,-5.370066666666666E-2,null,"Top Bead",{"$f":"(((Frame_Width-4.3125)*2)+((CMR!$E$26-2.625)*2))/12","v":-1.15625},2.8000000000000001E-2,-3.2375000000000001E-2,null,null,null,{"$f":"IF(AND(AP132>0,AQ132>0),AP132,0)","v":{"$error":"#N/A"}},{"$f":"IF(AND($AO$4<=26,$AO$4>24),26,0)","v":0},{"$f":"IF(AND(AP132=26,$AN$4>=6,$AN$4<=11),AP132&\"A\",0)","v":{"$error":"#N/A"}},null,null,{"$error":"#N/A"},{"$f":"IF(AND($AT$4<=26,$AT$4>24),26,0)","v":0},{"$f":"IF(AND(AU132=26,$AS$4>=6,$AS$4<=11),AU132&\"A\",0)","v":{"$error":"#N/A"}},null,null,null,null,null,null,null,null,null,null,null,null,null,null,null,null,null,null,null,null,null,null,null,null,null,null,null,null,null,null,null,null,null,null,null,null,null,null,null,null,null,null,null,null,null,null,null,null,null,null,null,null,null,null,null,null,null,null,null,null,null,{"$error":"#N/A"},{"$f":"IF(AND($DF$4<=42,$DF$4>40),42,0)","v":{"$error":"#N/A"}},{"$f":"IF(AND(DG132=42,$DE$4>=11,$DE$4<=16),DG132&\"A\",0)","v":{"$error":"#N/A"}},null,null,{"$error":"#N/A"},{"$f":"IF(AND($DK$4<=42,$DK$4>40),42,0)","v":{"$error":"#N/A"}},{"$f":"IF(AND(DL132=42,$DJ$4>=11,$DJ$4<=16),DL132&\"A\",0)","v":{"$error":"#N/A"}}]
[null,61,"10/10/10",3,null,63,7799,4,null,null,null,null,null,null,null,null,null,null,null,null,null,null,null,null,null,null,null,null,"Bottom Bead",{"$f":"((Frame_Width-5.912)+((CMR!$L$43-5.0625)*2))/12","v":-1.3364166666666666},7.3999999999999996E-2,-9.8894833333333321E-2,null,"Bottom Top Rail",{"$f":"(Frame_Width-2.25)/12","v":-0.1875},0.246,-4.6124999999999999E-2,null,null,null,{"$error":"#N/A"},0,{"$f":"IF(AND(AP133=26,$AN$4>=12,$AN$4<=17),AP133&\"B\",0)","v":{"$error":"#N/A"}},null,null,{"$f":"IF(AND(AU133>0,AV133>0),AU133,0)","v":{"$error":"#N/A"}},0,{"$f":"IF(AND(AU133=26,$AS$4>=12,$AS$4<=17),AU133&\"B\",0)","v":{"$error":"#N/A"}},null,null,null,null,null,null,null,null,null,null,null,null,null,null,null,null,null,null,null,null,null,null,null,null,null,null,null,null,null,null,null,null,null,null,null,null,null,null,null,null,null,null,null,null,null,null,null,null,null,null,null,null,null,null,null,null,null,null,null,null,null,{"$f":"IF(AND(DG133>0,DH133>0),DG133,0)","v":{"$error":"#N/A"}},{"$error":"#N/A"},{"$f":"IF(AND(DG133=42,$DE$4>=17,$DE$4<=22),DG133&\"B\",0)","v":{"$error":"#N/A"}},null,null,{"$f":"IF(AND(DL133>0,DM133>0),DL133,0)","v":{"$error":"#N/A"}},{"$error":"#N/A"},{"$f":"IF(AND(DL133=42,$DJ$4>=17,$DJ$4<=22),DL133&\"B\",0)","v":{"$error":"#N/A"}}]
[null,62,"8/8/8/8",4,null,64,7799,4,null,null,null,null,null,null,null,null,null,null,null,null,null,null,null,null,null,null,null,null,null,null,"Top Sash",{"$f":"IF(OR(ModelNo=\"0501\",ModelNo=\"B501\",ModelNo=\"U501\"),(TRUNC((SUM(AF114:AF123))))+5,0)","v":0},null,"Bottom Bottom Rail",{"$f":"(Frame_Width-2.25)/12","v":-0.1875},0.25700000000000001,-4.8187500000000001E-2,null,null,null,{"$error":"#N/A"},0,{"$f":"IF(AND(AP134=26,$AN$4>=18,$AN$4<=22),AP134&\"C\",0)","v":{"$error":"#N/A"}},null,null,{"$error":"#N/A"},0,{"$f":"IF(AND(AU134=26,$AS$4>=18,$AS$4<=22),AU134&\"C\",0)","v":{"$error":"#N/A"}},null,null,null,null,null,null,null,null,null,null,null,null,null,null,null,null,null,null,null,null,null,null,null,null,null,null,null,null,null,null,null,null,null,null,null,null,null,null,null,null,null,null,null,null,null,null,null,null,null,null,null,null,null,null,null,null,null,null,null,null,null,{"$error":"#N/A"},{"$error":"#N/A"},{"$f":"IF(AND(DG134=42,$DE$4>=23,$DE$4<=27),DG134&\"C\",0)","v":{"$error":"#N/A"}},null,null,{"$error":"#N/A"},{"$error":"#N/A"},{"$f":"IF(AND(DL134=42,$DJ$4>=23,$DJ$4<=27),DL134&\"C\",0)","v":{"$error":"#N/A"}}]
[null,63,"8/8/8/8",4,null,65,7899,4,null,null,null,null,null,null,null,null,null,null,null,null,null,null,null,null,null,null,null,null,null,null,"Bottom Sash",{"$f":"IF(OR(ModelNo=\"0501\",ModelNo=\"B501\",ModelNo=\"U501\"),TRUNC((SUM(AF124:AF133))),0)","v":0},null,"Bottom Stile",{"$f":"(2*(CMR!$E$27-0.5625))/12","v":-9.375E-2},0.23300000000000001,-2.1843750000000002E-2,null,null,null,{"$error":"#N/A"},0,{"$f":"IF(AND(AP135=26,$AN$4>=23,$AN$4<=26),AP135&\"D\",0)","v":{"$error":"#N/A"}},null,null,{"$error":"#N/A"},0,{"$f":"IF(AND(AU135=26,$AS$4>=23,$AS$4<=26),AU135&\"D\",0)","v":{"$error":"#N/A"}},null,null,null,null,null,null,null,null,null,null,null,null,null,null,null,null,null,null,null,null,null,null,null,null,null,null,null,null,null,null,null,null,null,null,null,null,null,null,null,null,null,null,null,null,null,null,null,null,null,null,null,null,null,null,null,null,null,null,null,null,null,{"$error":"#N/A"},{"$error":"#N/A"},{"$f":"IF(AND(DG135=42,$DE$4>=28,$DE$4<=31),DG135&\"D\",0)","v":{"$error":"#N/A"}},null,null,{"$error":"#N/A"},{"$error":"#N/A"},{"$f":"IF(AND(DL135=42,$DJ$4>=28,$DJ$4<=31),DL135&\"D\",0)","v":{"$error":"#N/A"}}]
[null,64,"8/8/8/8",4,null,66,7899,4,null,null,null,null,null,null,null,null,null,null,null,null,null,null,null,null,null,null,null,null,null,null,null,null,null,"Lock Rail Reinf.",{"$f":"(Frame_Width-3)/12","v":-0.25},0.56010000000000004,-0.14002500000000001,null,null,null,{"$error":"#N/A"},0,{"$f":"IF(AND(AP136=26,$AN$4>=27,$AN$4<=30),AP136&\"E\",0)","v":{"$error":"#N/A"}},null,null,{"$error":"#N/A"},0,{"$f":"IF(AND(AU136=26,$AS$4>=27,$AS$4<=30),AU136&\"E\",0)","v":{"$error":"#N/A"}},null,null,null,null,null,null,null,null,null,null,null,null,null,null,null,null,null,null,null,null,null,null,null,null,null,null,null,null,null,null,null,null,null,null,null,null,null,null,null,null,null,null,null,null,null,null,null,null,null,null,null,null,null,null,null,null,null,null,null,null,null,{"$error":"#N/A"},{"$error":"#N/A"},{"$f":"IF(AND(DG136=42,$DE$4>=32,$DE$4<=34),DG136&\"E\",0)","v":{"$error":"#N/A"}},null,null,{"$error":"#N/A"},{"$error":"#N/A"},{"$f":"IF(AND(DL136=42,$DJ$4>=32,$DJ$4<=34),DL136&\"E\",0)","v":{"$error":"#N/A"}}]
[null,65,"8/8/8/8",4,null,67,8899,4,null,null,null,null,null,null,null,null,null,null,null,null,null,null,null,null,null,null,null,null,"V100","Length","Weight/ft","Weight",null,"Bottom Rail Reinf.",{"$f":"(Frame_Width-8.25)/12","v":-0.6875},0.43,{"$f":"AI137*AJ137","v":-0.29562499999999997},null,null,null,{"$error":"#N/A"},0,{"$f":"IF(AND(AP137=26,$AN$4>=31,$AN$4<=34),AP137&\"F\",0)","v":{"$error":"#N/A"}},null,null,{"$error":"#N/A"},0,{"$f":"IF(AND(AU137=26,$AS$4>=31,$AS$4<=34),AU137&\"F\",0)","v":{"$error":"#N/A"}},null,null,null,null,null,null,null,null,null,null,null,null,null,null,null,null,null,null,null,null,null,null,null,null,null,null,null,null,null,null,null,null,null,null,null,null,null,null,null,null,null,null,null,null,null,null,null,null,null,null,null,null,null,null,null,null,null,null,null,null,null,{"$error":"#N/A"},{"$error":"#N/A"},{"$f":"IF(AND(DG137=42,$DE$4>=35,$DE$4<=37),DG137&\"F\",0)","v":{"$error":"#N/A"}},null,null,{"$error":"#N/A"},{"$error":"#N/A"},{"$f":"IF(AND(DL137=42,$DJ$4>=35,$DJ$4<=37),DL137&\"F\",0)","v":{"$error":"#N/A"}}]
[null,66,"8/8/9/9",4,null,68,8899,4,null,null,null,null,null,null,null,null,null,null,null,null,null,null,null,null,null,null,null,null,"Top Top Rail",0,0,{"$f":"AD138*AE138","v":0},null,"Bottom Stile Reinf.",{"$f":"2*((CMR!$E$27-2.5625)/12)","v":-0.42708333333333331},0.43,-0.18364583333333331,null,null,null,{"$error":"#N/A"},0,{"$f":"IF(AND(AP138=26,$AN$4>=35,$AN$4<=38),AP138&\"G\",0)","v":{"$error":"#N/A"}},null,null,{"$error":"#N/A"},0,{"$f":"IF(AND(AU138=26,$AS$4>=35,$AS$4<=38),AU138&\"G\",0)","v":{"$error":"#N/A"}},null,null,null,null,null,null,null,null,null,null,null,null,null,null,null,null,null,null,null,null,null,null,null,null,null,null,null,null,null,null,null,null,null,null,null,null,null,null,null,null,null,null,null,null,null,null,null,null,null,null,null,null,null,null,null,null,null,null,null,null,null,{"$error":"#N/A"},{"$error":"#N/A"},{"$f":"IF(AND(DG138=42,$DE$4>=38,$DE$4<=40),DG138&\"G\",0)","v":{"$error":"#N/A"}},null,null,{"$error":"#N/A"},{"$error":"#N/A"},{"$f":"IF(AND(DL138=42,$DJ$4>=38,$DJ$4<=40),DL138&\"G\",0)","v":{"$error":"#N/A"}}]
[null,67,"8/8/9/9",4,null,69,8999,4,null,null,null,null,null,null,null,null,null,null,null,null,null,null,null,null,null,null,null,null,"Top Bottom Rail",0,0,0,null,"Bottom Glass",{"$f":"(CMR!$E$30*CMR!$E$32)/144","v":5.8865017361111112E-2},{"$f":"$L$12","v":3.2},0.18836805555555558,null,null,null,{"$error":"#N/A"},0,{"$f":"IF(AND(AP139=26,$AN$4>=39,$AN$4<=42),AP139&\"H\",0)","v":{"$error":"#N/A"}},null,null,{"$error":"#N/A"},0,{"$f":"IF(AND(AU139=26,$AS$4>=39,$AS$4<=42),AU139&\"H\",0)","v":{"$error":"#N/A"}},null,null,null,null,null,null,null,null,null,null,null,null,null,null,null,null,null,null,null,null,null,null,null,null,null,null,null,null,null,null,null,null,null,null,null,null,null,null,null,null,null,null,null,null,null,null,null,null,null,null,null,null,null,null,null,null,null,null,null,null,null,{"$error":"#N/A"},{"$error":"#N/A"},{"$f":"IF(AND(DG139=42,$DE$4>=41,$DE$4<=43),DG139&\"H\",0)","v":{"$error":"#N/A"}},null,null,{"$error":"#N/A"},{"$error":"#N/A"},{"$f":"IF(AND(DL139=42,$DJ$4>=41,$DJ$4<=43),DL139&\"H\",0)","v":{"$error":"#N/A"}}]
[null,68,"8/8/9/9",4,null,70,8999,4,null,null,null,null,null,null,null,null,null,null,null,null,null,null,null,null,null,null,null,null,"Top Stile",0,0,0,null,"Bottom Spacer",{"$f":"((CMR!$E$30*2)+(CMR!$E$32*2))/12","v":-1.0104166666666667},5.3600000000000002E-2,-5.4158333333333336E-2,null,null,null,{"$error":"#N/A"},0,{"$f":"IF(AND(AP140=26,$AN$4>=43,$AN$4<=45),AP140&\"I\",0)","v":{"$error":"#N/A"}},null,null,{"$error":"#N/A"},0,{"$f":"IF(AND(AU140=26,$AS$4>=43,$AS$4<=45),AU140&\"I\",0)","v":{"$error":"#N/A"}},null,null,null,null,null,null,null,null,null,null,null,null,null,null,null,null,null,null,null,null,null,null,null,null,null,null,null,null,null,null,null,null,null,null,null,null,null,null,null,null,null,null,null,null,null,null,null,null,null,null,null,null,null,null,null,null,null,null,null,null,null,{"$error":"#N/A"},{"$error":"#N/A"},{"$f":"IF(AND(DG140=42,$DE$4>=44,$DE$4<=45),DG140&\"I\",0)","v":{"$error":"#N/A"}},null,null,{"$error":"#N/A"},{"$error":"#N/A"},{"$f":"IF(AND(DL140=42,$DJ$4>=44,$DJ$4<=45),DL140&\"I\",0)","v":{"$error":"#N/A"}}]
[null,69,"8/8/9/9",4,null,71,9999,4,null,null,null,null,null,null,null,null,null,null,null,null,null,null,null,null,null,null,null,null,"Top Rail Reinf.",0,0,0,null,"Bottom Hardware",1,{"$f":"IF(Frame_Width>36,0.482,0.36)","v":0.36},0.36,null,null,null,{"$error":"#N/A"},0,{"$f":"IF(AND(AP141=26,$AN$4>=46,$AN$4<=52),\"Dbl.\"&AP141&\"D\",0)","v":{"$error":"#N/A"}},null,null,{"$error":"#N/A"},0,{"$f":"IF(AND(AU141=26,$AS$4>=46,$AS$4<=52),\"Dbl.\"&AU141&\"D\",0)","v":{"$error":"#N/A"}},null,null,null,null,null,null,null,null,null,null,null,null,null,null,null,null,null,null,null,null,null,null,null,null,null,null,null,null,null,null,null,null,null,null,null,null,null,null,null,null,null,null,null,null,null,null,null,null,null,null,null,null,null,null,null,null,null,null,null,null,null,{"$error":"#N/A"},{"$f":"IF(AND($DF$4<=44,$DF$4>42),44,0)","v":{"$error":"#N/A"}},{"$f":"IF(AND(DG141=44,$DE$4>=11,$DE$4<=16),DG141&\"A\",0)","v":{"$error":"#N/A"}},null,null,{"$error":"#N/A"},{"$f":"IF(AND($DK$4<=44,$DK$4>42),44,0)","v":{"$error":"#N/A"}},{"$f":"IF(AND(DL141=44,$DJ$4>=11,$DJ$4<=16),DL141&\"A\",0)","v":{"$error":"#N/A"}}]
[null,70,"9/9/9/9",4,null,72,9999,4,null,null,null,null,null,null,null,null,null,null,null,null,null,null,null,null,null,null,null,null,"Top Stile Reinf",0,0,0,null,"Bottom Bead",{"$f":"(((Frame_Width-3.3125)*2)+((CMR!$E$27-1.625)*2))/12","v":-0.82291666666666663},2.8000000000000001E-2,-2.3041666666666665E-2,null,null,null,{"$error":"#N/A"},0,{"$f":"IF(AND(AP142=26,$AN$4>=53,$AN$4<=60),\"Dbl.\"&AP142&\"E\",0)","v":{"$error":"#N/A"}},null,null,{"$error":"#N/A"},0,{"$f":"IF(AND(AU142=26,$AS$4>=53,$AS$4<=60),\"Dbl.\"&AU142&\"E\",0)","v":{"$error":"#N/A"}},null,null,null,null,null,null,null,null,null,null,null,null,null,null,null,null,null,null,null,null,null,null,null,null,null,null,null,null,null,null,null,null,null,null,null,null,null,null,null,null,null,null,null,null,null,null,null,null,null,null,null,null,null,null,null,null,null,null,null,null,null,{"$error":"#N/A"},{"$error":"#N/A"},{"$f":"IF(AND(DG142=44,$DE$4>=17,$DE$4<=22),DG142&\"B\",0)","v":{"$error":"#N/A"}},null,null,{"$error":"#N/A"},{"$error":"#N/A"},{"$f":"IF(AND(DL142=44,$DJ$4>=17,$DJ$4<=22),DL142&\"B\",0)","v":{"$error":"#N/A"}}]
[null,71,"9/9/9/9",4,null,null,null,null,null,null,null,null,null,null,null,null,null,null,null,null,null,null,null,null,null,null,null,null,"Top Glass",0,0,0,null,null,null,"Top Sash",{"$f":"IF(ModelNo=\"i201\",(TRUNC((SUM(AK124:AK132))))+5,0)","v":0},null,null,null,{"$error":"#N/A"},0,{"$f":"IF(AND(AP143=26,$AN$4>=61,$AN$4<=68),\"Dbl.\"&AP143&\"F\",0)","v":{"$error":"#N/A"}},null,null,{"$error":"#N/A"},0,{"$f":"IF(AND(AU143=26,$AS$4>=61,$AS$4<=68),\"Dbl.\"&AU143&\"F\",0)","v":{"$error":"#N/A"}},null,null,null,null,null,null,null,null,null,null,null,null,null,null,null,null,null,null,null,null,null,null,null,null,null,null,null,null,null,null,null,null,null,null,null,null,null,null,null,null,null,null,null,null,null,null,null,null,null,null,null,null,null,null,null,null,null,null,null,null,null,{"$error":"#N/A"},{"$error":"#N/A"},{"$f":"IF(AND(DG143=44,$DE$4>=23,$DE$4<=27),DG143&\"C\",0)","v":{"$error":"#N/A"}},null,null,{"$error":"#N/A"},{"$error":"#N/A"},{"$f":"IF(AND(DL143=44,$DJ$4>=23,$DJ$4<=27),DL143&\"C\",0)","v":{"$error":"#N/A"}}]
[null,72,"9/9/9/9",4,null,null,null,null,null,null,null,null,null,null,null,null,null,null,null,null,null,null,null,null,null,null,null,null,"Top Spacer",0,0,0,null,null,null,"Bottom Sash",{"$f":"IF(ModelNo=\"i201\",TRUNC((SUM(AK133:AK142))),0)","v":0},null,null,null,{"$error":"#N/A"},0,{"$f":"IF(AND(AP144=26,$AN$4>=69,$AN$4<=76),\"Dbl.\"&AP144&\"G\",0)","v":{"$error":"#N/A"}},null,null,{"$error":"#N/A"},0,{"$f":"IF(AND(AU144=26,$AS$4>=69,$AS$4<=76),\"Dbl.\"&AU144&\"G\",0)","v":{"$error":"#N/A"}},null,null,null,null,null,null,null,null,null,null,null,null,null,null,null,null,null,null,null,null,null,null,null,null,null,null,null,null,null,null,null,null,null,null,null,null,null,null,null,null,null,null,null,null,null,null,null,null,null,null,null,null,null,null,null,null,null,null,null,null,null,{"$error":"#N/A"},{"$error":"#N/A"},{"$f":"IF(AND(DG144=44,$DE$4>=28,$DE$4<=32),DG144&\"D\",0)","v":{"$error":"#N/A"}},null,null,{"$error":"#N/A"},{"$error":"#N/A"},{"$f":"IF(AND(DL144=44,$DJ$4>=28,$DJ$4<=32),DL144&\"D\",0)","v":{"$error":"#N/A"}}]
[null,73,"9/9/9/9",4,null,null,null,null,null,null,null,null,null,null,null,null,null,null,null,null,null,null,null,null,null,null,null,null,"Top Hardware",0,0,0,null,null,null,null,null,null,null,null,{"$error":"#N/A"},0,{"$f":"IF(AND(AP145=26,$AN$4>=77,$AN$4<=80),\"Dbl.\"&AP145&\"H\",0)","v":{"$error":"#N/A"}},null,null,{"$error":"#N/A"},0,{"$f":"IF(AND(AU145=26,$AS$4>=77,$AS$4<=80),\"Dbl.\"&AU145&\"H\",0)","v":{"$error":"#N/A"}},null,null,null,null,null,null,null,null,null,null,null,null,null,null,null,null,null,null,null,null,null,null,null,null,null,null,null,null,null,null,null,null,null,null,null,null,null,null,null,null,null,null,null,null,null,null,null,null,null,null,null,null,null,null,null,null,null,null,null,null,null,{"$error":"#N/A"},{"$error":"#N/A"},{"$f":"IF(AND(DG145=44,$DE$4>=33,$DE$4<=34),DG145&\"E\",0)","v":{"$error":"#N/A"}},null,null,{"$error":"#N/A"},{"$error":"#N/A"},{"$f":"IF(AND(DL145=44,$DJ$4>=33,$DJ$4<=34),DL145&\"E\",0)","v":{"$error":"#N/A"}}]
[null,74,"9/9/9/9",4,null,null,null,null,null,null,null,null,null,null,null,null,null,null,null,null,null,null,null,null,null,null,null,null,"Top Bead",0,0,0,null,null,null,null,null,null,null,null,{"$error":"#N/A"},{"$f":"IF(AND($AO$4<=28,$AO$4>26),28,0)","v":0},{"$f":"IF(AND(AP146=28,$AN$4>=7,$AN$4<=12),AP146&\"A\",0)","v":{"$error":"#N/A"}},null,null,{"$error":"#N/A"},{"$f":"IF(AND($AT$4<=28,$AT$4>26),28,0)","v":0},{"$f":"IF(AND(AU146=28,$AS$4>=7,$AS$4<=12),AU146&\"A\",0)","v":{"$error":"#N/A"}},null,null,null,null,null,null,null,null,null,null,null,null,null,null,null,null,null,null,null,null,null,null,null,null,null,null,null,null,null,null,null,null,null,null,null,null,null,null,null,null,null,null,null,null,null,null,null,null,null,null,null,null,null,null,null,null,null,null,null,null,null,{"$error":"#N/A"},{"$error":"#N/A"},{"$f":"IF(AND(DG146=44,$DE$4>=35,$DE$4<=37),DG146&\"F\",0)","v":{"$error":"#N/A"}},null,null,{"$error":"#N/A"},{"$error":"#N/A"},{"$f":"IF(AND(DL146=44,$DJ$4>=35,$DJ$4<=37),DL146&\"F\",0)","v":{"$error":"#N/A"}}]
[null,null,null,null,null,null,null,null,null,null,null,null,null,null,null,null,null,null,null,null,null,null,null,null,null,null,null,null,"Bottom Top Rail",{"$f":"(Frame_Width-2.1875)/12","v":-0.18229166666666666},0.224,-4.0833333333333333E-2,null,"V200","Length","Weight/ft","Weight",null,null,null,{"$error":"#N/A"},0,{"$f":"IF(AND(AP147=28,$AN$4>=13,$AN$4<=18),AP147&\"B\",0)","v":{"$error":"#N/A"}},null,null,{"$error":"#N/A"},0,{"$f":"IF(AND(AU147=28,$AS$4>=13,$AS$4<=18),AU147&\"B\",0)","v":{"$error":"#N/A"}},null,null,null,null,null,null,null,null,null,null,null,null,null,null,null,null,null,null,null,null,null,null,null,null,null,null,null,null,null,null,null,null,null,null,null,null,null,null,null,null,null,null,null,null,null,null,null,null,null,null,null,null,null,null,null,null,null,null,null,null,null,{"$error":"#N/A"},{"$error":"#N/A"},{"$f":"IF(AND(DG147=44,$DE$4>=38,$DE$4<=40),DG147&\"G\",0)","v":{"$error":"#N/A"}},null,null,{"$error":"#N/A"},{"$error":"#N/A"},{"$f":"IF(AND(DL147=44,$DJ$4>=38,$DJ$4<=40),DL147&\"G\",0)","v":{"$error":"#N/A"}}]
[null,null,null,null,null,null,null,null,null,null,null,null,null,null,null,null,null,null,null,null,null,null,null,null,null,null,null,null,"Bottom Bottom Rail",{"$f":"(Frame_Width-2.1875)/12","v":-0.18229166666666666},0.19900000000000001,-3.6276041666666668E-2,null,"Top Top Rail",0,0,{"$f":"AI148*AJ148","v":0},null,null,null,{"$error":"#N/A"},0,{"$f":"IF(AND(AP148=28,$AN$4>=19,$AN$4<=23),AP148&\"C\",0)","v":{"$error":"#N/A"}},null,null,{"$error":"#N/A"},0,{"$f":"IF(AND(AU148=28,$AS$4>=19,$AS$4<=23),AU148&\"C\",0)","v":{"$error":"#N/A"}},null,null,null,null,null,null,null,null,null,null,null,null,null,null,null,null,null,null,null,null,null,null,null,null,null,null,null,null,null,null,null,null,null,null,null,null,null,null,null,null,null,null,null,null,null,null,null,null,null,null,null,null,null,null,null,null,null,null,null,null,null,{"$error":"#N/A"},{"$error":"#N/A"},{"$f":"IF(AND(DG148=44,$DE$4>=41,$DE$4<=43),DG148&\"H\",0)","v":{"$error":"#N/A"}},null,null,{"$error":"#N/A"},{"$error":"#N/A"},{"$f":"IF(AND(DL148=44,$DJ$4>=41,$DJ$4<=43),DL148&\"H\",0)","v":{"$error":"#N/A"}}]
[null,null,null,null,null,null,null,null,null,null,null,null,null,null,null,null,null,null,null,null,null,null,null,null,null,null,null,null,"Bottom Stile",{"$f":"((CMR!$L$100-0.844)*2)/12","v":-0.14066666666666666},0.19900000000000001,-2.7992666666666666E-2,null,"Top Bottom Rail",0,0,0,null,null,null,{"$error":"#N/A"},0,{"$f":"IF(AND(AP149=28,$AN$4>=24,$AN$4<=28),AP149&\"D\",0)","v":{"$error":"#N/A"}},null,null,{"$error":"#N/A"},0,{"$f":"IF(AND(AU149=28,$AS$4>=24,$AS$4<=28),AU149&\"D\",0)","v":{"$error":"#N/A"}},null,null,null,null,null,null,null,null,null,null,null,null,null,null,null,null,null,null,null,null,null,null,null,null,null,null,null,null,null,null,null,null,null,null,null,null,null,null,null,null,null,null,null,null,null,null,null,null,null,null,null,null,null,null,null,null,null,null,null,null,null,{"$error":"#N/A"},{"$error":"#N/A"},{"$f":"IF(AND(DG149=44,$DE$4>=44,$DE$4<=45),DG149&\"I\",0)","v":{"$error":"#N/A"}},null,null,{"$error":"#N/A"},{"$error":"#N/A"},{"$f":"IF(AND(DL149=44,$DJ$4>=44,$DJ$4<=45),DL149&\"I\",0)","v":{"$error":"#N/A"}}]
[null,null,null,null,null,null,null,null,null,null,null,null,null,null,null,null,null,null,null,null,null,null,null,null,null,null,null,null,"Bottom Rail Reinf.",{"$f":"(TRUNC(((Frame_Width-8.188)-0.5)/2)*2)/12","v":-0.66666666666666663},0.13300000000000001,-8.8666666666666671E-2,null,"Top Stile",0,0,0,null,null,null,{"$error":"#N/A"},0,{"$f":"IF(AND(AP150=28,$AN$4>=29,$AN$4<=32),AP150&\"E\",0)","v":{"$error":"#N/A"}},null,null,{"$error":"#N/A"},0,{"$f":"IF(AND(AU150=28,$AS$4>=29,$AS$4<=32),AU150&\"E\",0)","v":{"$error":"#N/A"}}]
[null,null,null,null,null,null,null,null,null,null,null,null,null,null,null,null,null,null,null,null,null,null,null,null,null,null,null,null,"Bottom Stile Reinf.",{"$f":"(TRUNC((((CMR!$L$100-0.844)-1.46875)-0.25)/2)*2)/12","v":-0.16666666666666666},0.10100000000000001,-1.6833333333333332E-2,null,"Top Rail Reinf.",0,0,0,null,null,null,{"$error":"#N/A"},0,{"$f":"IF(AND(AP151=28,$AN$4>=33,$AN$4<=36),AP151&\"F\",0)","v":{"$error":"#N/A"}},null,null,{"$error":"#N/A"},0,{"$f":"IF(AND(AU151=28,$AS$4>=33,$AS$4<=36),AU151&\"F\",0)","v":{"$error":"#N/A"}}]
[null,null,null,null,null,null,null,null,null,null,null,null,null,null,null,null,null,null,null,null,null,null,null,null,null,null,null,null,"Bottom Glass",{"$f":"(CMR!$L$103*CMR!$L$105)/144","v":5.4456922743055552E-2},{"$f":"$L$12","v":3.2},0.17426215277777779,null,"Top Stile Reinf",0,0,0,null,null,null,{"$error":"#N/A"},0,{"$f":"IF(AND(AP152=28,$AN$4>=37,$AN$4<=40),AP152&\"G\",0)","v":{"$error":"#N/A"}},null,null,{"$error":"#N/A"},0,{"$f":"IF(AND(AU152=28,$AS$4>=37,$AS$4<=40),AU152&\"G\",0)","v":{"$error":"#N/A"}}]
[null,null,null,null,null,null,null,null,null,null,null,null,null,null,null,null,null,null,null,null,null,null,null,null,null,null,null,null,"Bottom Spacer",{"$f":"((CMR!$L$103*2)+(CMR!$L$105*2))/12","v":-0.953125},5.3600000000000002E-2,-5.1087500000000001E-2,null,"Top Glass",0,0,0,null,null,null,{"$error":"#N/A"},0,{"$f":"IF(AND(AP153=28,$AN$4>=41,$AN$4<=43),AP153&\"H\",0)","v":{"$error":"#N/A"}},null,null,{"$error":"#N/A"},0,{"$f":"IF(AND(AU153=28,$AS$4>=41,$AS$4<=43),AU153&\"H\",0)","v":{"$error":"#N/A"}}]
[null,null,null,null,null,null,null,null,null,null,null,null,null,null,null,null,null,null,null,null,null,null,null,null,null,null,null,null,"Bottom Hardware",1,0.36,0.36,null,"Top Spacer",0,0,0,null,null,null,{"$error":"#N/A"},0,{"$f":"IF(AND(AP154=28,$AN$4>=44,$AN$4<=45),AP154&\"I\",0)","v":{"$error":"#N/A"}},null,null,{"$error":"#N/A"},0,{"$f":"IF(AND(AU154=28,$AS$4>=44,$AS$4<=45),AU154&\"I\",0)","v":{"$error":"#N/A"}}]
[null,null,null,null,null,null,null,null,null,null,null,null,null,null,null,null,null,null,null,null,null,null,null,null,null,null,null,null,"Bottom Bead",{"$f":"(((Frame_Width-2.9375)*2)+((CMR!$L$100-1.625)*2))/12","v":-0.76041666666666663},2.1000000000000001E-2,-1.596875E-2,null,"Top Hardware",0,0,0,null,null,null,{"$error":"#N/A"},0,{"$f":"IF(AND(AP155=28,$AN$4=46),\"Dbl.\"&AP155&\"C\",0)","v":{"$error":"#N/A"}},null,null,{"$error":"#N/A"},0,{"$f":"IF(AND(AU155=28,$AS$4=46),\"Dbl.\"&AU155&\"C\",0)","v":{"$error":"#N/A"}}]
[null,null,null,null,null,null,null,null,null,null,null,null,null,null,null,null,null,null,null,null,null,null,null,null,null,null,null,null,null,null,"Top Sash",{"$f":"IF(ModelNo=\"V100\",ROUND((SUM(AF138:AF146)),0),0)","v":0},null,"Top Bead",0,0,0,null,null,null,{"$error":"#N/A"},0,{"$f":"IF(AND(AP156=28,$AN$4>=47,$AN$4<=56),\"Dbl.\"&AP156&\"D\",0)","v":{"$error":"#N/A"}},null,null,{"$error":"#N/A"},0,{"$f":"IF(AND(AU156=28,$AS$4>=47,$AS$4<=56),\"Dbl.\"&AU156&\"D\",0)","v":{"$error":"#N/A"}}]
[null,null,null,null,null,null,null,null,null,null,null,null,null,null,null,null,null,null,null,null,null,null,null,null,null,null,null,null,null,null,"Bottom Sash",{"$f":"IF(OR(ModelNo=\"V100\",ModelNo=\"V100\",ModelNo=\"V100\"),TRUNC((SUM(AF147:AF155))),0)","v":0},null,"Bottom Top Rail",{"$f":"(Frame_Width-2.1875)/12","v":-0.18229166666666666},0.224,-4.0833333333333333E-2,null,null,null,{"$error":"#N/A"},0,{"$f":"IF(AND(AP157=28,$AN$4>=57,$AN$4<=64),\"Dbl.\"&AP157&\"E\",0)","v":{"$error":"#N/A"}},null,null,{"$error":"#N/A"},0,{"$f":"IF(AND(AU157=28,$AS$4>=57,$AS$4<=64),\"Dbl.\"&AU157&\"E\",0)","v":{"$error":"#N/A"}}]
[null,null,null,null,null,null,null,null,null,null,null,null,null,null,null,null,null,null,null,null,null,null,null,null,null,null,null,null,null,null,null,null,null,"Bottom Bottom Rail",{"$f":"(Frame_Width-2.1875)/12","v":-0.18229166666666666},0.19900000000000001,-3.6276041666666668E-2,null,null,null,{"$error":"#N/A"},0,{"$f":"IF(AND(AP158=28,$AN$4>=65,$AN$4<=72),\"Dbl.\"&AP158&\"F\",0)","v":{"$error":"#N/A"}},null,null,{"$error":"#N/A"},0,{"$f":"IF(AND(AU158=28,$AS$4>=65,$AS$4<=72),\"Dbl.\"&AU158&\"F\",0)","v":{"$error":"#N/A"}}]
[null,null,null,null,null,null,null,null,null,null,null,null,null,null,null,null,null,null,null,null,null,null,null,null,null,null,null,null,"V101","Length","Weight/ft","Weight",null,"Bottom Stile",{"$f":"((CMR!$L$125-0.875)*2)/12","v":-0.14583333333333334},0.19900000000000001,-2.9020833333333336E-2,null,null,null,{"$error":"#N/A"},0,{"$f":"IF(AND(AP159=28,$AN$4>=73,$AN$4<=80),\"Dbl.\"&AP159&\"G\",0)","v":{"$error":"#N/A"}},null,null,{"$error":"#N/A"},0,{"$f":"IF(AND(AU159=28,$AS$4>=73,$AS$4<=80),\"Dbl.\"&AU159&\"G\",0)","v":{"$error":"#N/A"}}]
[null,null,null,null,null,null,null,null,null,null,null,null,null,null,null,null,null,null,null,null,null,null,null,null,null,null,null,null,"Top Top Rail",{"$f":"(Frame_Width-3.4375)/12","v":-0.28645833333333331},0.20799999999999999,{"$f":"AD160*AE160","v":-5.9583333333333328E-2},null,"Bottom Rail Reinf.",{"$f":"(TRUNC(((Frame_Width-3.625)-0.5)/2)*2-2)/12","v":-0.5},0.13300000000000001,-6.6500000000000004E-2,null,null,null,{"$error":"#N/A"},{"$f":"IF(AND($AO$4<=30,$AO$4>28),30,0)","v":0},{"$f":"IF(AND(AP160=30,$AN$4>=8,$AN$4<=13),AP160&\"A\",0)","v":{"$error":"#N/A"}},null,null,{"$error":"#N/A"},{"$f":"IF(AND($AT$4<=30,$AT$4>28),30,0)","v":0},{"$f":"IF(AND(AU160=30,$AS$4>=8,$AS$4<=13),AU160&\"A\",0)","v":{"$error":"#N/A"}}]
[null,null,null,null,null,null,null,null,null,null,null,null,null,null,null,null,null,null,null,null,null,null,null,null,null,null,null,null,"Top Bottom Rail",{"$f":"(Frame_Width-3.4375)/12","v":-0.28645833333333331},0.23799999999999999,-6.8177083333333333E-2,null,"Bottom Stile Reinf.",{"$f":"(TRUNC((((TRUNC(((CMR!$L$125-0.8125)*32+0.5))/32-0.0625)-1.46875)-0.25)/2)*2)/12","v":-0.16666666666666666},0.10100000000000001,-1.6833333333333332E-2,null,null,null,{"$error":"#N/A"},0,{"$f":"IF(AND(AP161=30,$AN$4>=14,$AN$4<=19),AP161&\"B\",0)","v":{"$error":"#N/A"}},null,null,{"$error":"#N/A"},0,{"$f":"IF(AND(AU161=30,$AS$4>=14,$AS$4<=19),AU161&\"B\",0)","v":{"$error":"#N/A"}}]
[null,null,null,null,null,null,null,null,null,null,null,null,null,null,null,null,null,null,null,null,null,null,null,null,null,null,null,null,"Top Stile",{"$f":"(2*(CMR!$L$115-1.5625))/12","v":-0.26041666666666669},0.19900000000000001,-5.182291666666667E-2,null,"Bottom Glass",{"$f":"(CMR!$L$128*CMR!$L$130)/144","v":5.46875E-2},{"$f":"$L$12","v":3.2},0.17500000000000002,null,null,null,{"$error":"#N/A"},0,{"$f":"IF(AND(AP162=30,$AN$4>=20,$AN$4<=24),AP162&\"C\",0)","v":{"$error":"#N/A"}},null,null,{"$error":"#N/A"},0,{"$f":"IF(AND(AU162=30,$AS$4>=20,$AS$4<=24),AU162&\"C\",0)","v":{"$error":"#N/A"}}]
[null,null,null,null,null,null,null,null,null,null,null,null,null,null,null,null,null,null,null,null,null,null,null,null,null,null,null,null,"Top Rail Reinf.",{"$f":"(TRUNC(((Frame_Width-9.4375)+0.5)/2)*2)/12","v":-0.66666666666666663},0.10100000000000001,-6.7333333333333328E-2,null,"Bottom Spacer",{"$f":"((CMR!$L$128*2)+(CMR!$L$130*2))/12","v":-0.95833333333333337},5.3600000000000002E-2,-5.1366666666666672E-2,null,null,null,{"$error":"#N/A"},0,{"$f":"IF(AND(AP163=30,$AN$4>=25,$AN$4<=29),AP163&\"D\",0)","v":{"$error":"#N/A"}},null,null,{"$error":"#N/A"},0,{"$f":"IF(AND(AU163=30,$AS$4>=25,$AS$4<=29),AU163&\"D\",0)","v":{"$error":"#N/A"}}]
[null,null,null,null,null,null,null,null,null,null,null,null,null,null,null,null,null,null,null,null,null,null,null,null,null,null,null,null,"Top Stile Reinf",{"$f":"((TRUNC(((CMR!$L$115-2.5625)+0.5)/2)*2)/12)*2","v":-0.33333333333333331},0.13300000000000001,-4.4333333333333336E-2,null,"Bottom Hardware",1,0.36,0.36,null,null,null,{"$f":"IF(AND(AP164>0,AQ164>0),AP164,0)","v":{"$error":"#N/A"}},0,{"$f":"IF(AND(AP164=30,$AN$4>=30,$AN$4<=33),AP164&\"E\",0)","v":{"$error":"#N/A"}},null,null,{"$error":"#N/A"},0,{"$f":"IF(AND(AU164=30,$AS$4>=30,$AS$4<=33),AU164&\"E\",0)","v":{"$error":"#N/A"}}]
[null,null,null,null,null,null,null,null,null,null,null,null,null,null,null,null,null,null,null,null,null,null,null,null,null,null,null,null,"Top Glass",{"$f":"(CMR!$L$118*CMR!$L$120)/144","v":9.3587239583333329E-2},{"$f":"$L$12","v":3.2},0.29947916666666669,null,"Bottom Bead",{"$f":"(((Frame_Width-2.9375)*2)+((CMR!$L$125-1.625)*2))/12","v":-0.76041666666666663},2.1000000000000001E-2,-1.596875E-2,null,null,null,{"$error":"#N/A"},0,{"$f":"IF(AND(AP165=30,$AN$4>=34,$AN$4<=37),AP165&\"F\",0)","v":{"$error":"#N/A"}},null,null,{"$error":"#N/A"},0,{"$f":"IF(AND(AU165=30,$AS$4>=34,$AS$4<=37),AU165&\"F\",0)","v":{"$error":"#N/A"}}]
[null,null,null,null,null,null,null,null,null,null,null,null,null,null,null,null,null,null,null,null,null,null,null,null,null,null,null,null,"Top Spacer",{"$f":"((CMR!$L$118*2)+(CMR!$L$120*2))/12","v":-1.2604166666666667},5.3600000000000002E-2,-6.7558333333333345E-2,null,null,null,"Top Sash",{"$f":"IF(ModelNo=\"V200\",ROUND((SUM(AK148:AK156)),0),0)","v":0},null,null,null,{"$error":"#N/A"},0,{"$f":"IF(AND(AP166=30,$AN$4>=38,$AN$4<=40),AP166&\"G\",0)","v":{"$error":"#N/A"}},null,null,{"$error":"#N/A"},0,{"$f":"IF(AND(AU166=30,$AS$4>=38,$AS$4<=40),AU166&\"G\",0)","v":{"$error":"#N/A"}}]
[null,null,null,null,null,null,null,null,null,null,null,null,null,null,null,null,null,null,null,null,null,null,null,null,null,null,null,null,"Top Hardware",1,0.2,0.2,null,null,null,"Bottom Sash",{"$f":"IF(ModelNo=\"V200\",TRUNC((SUM(AK157:AK165))),0)","v":0},null,null,null,{"$error":"#N/A"},0,{"$f":"IF(AND(AP167=30,$AN$4>=41,$AN$4<=43),AP167&\"H\",0)","v":{"$error":"#N/A"}},null,null,{"$error":"#N/A"},0,{"$f":"IF(AND(AU167=30,$AS$4>=41,$AS$4<=43),AU167&\"H\",0)","v":{"$error":"#N/A"}}]
[null,null,null,null,null,null,null,null,null,null,null,null,null,null,null,null,null,null,null,null,null,null,null,null,null,null,null,null,"Top Bead",{"$f":"(((Frame_Width-4.2)*2)+((CMR!$L$115-2.875)*2))/12","v":-1.1791666666666667},2.1000000000000001E-2,-2.4762500000000003E-2,null,null,null,null,null,null,null,null,{"$error":"#N/A"},0,{"$f":"IF(AND(AP168=30,$AN$4>=44,$AN$4<=45),AP168&\"I\",0)","v":{"$error":"#N/A"}},null,null,{"$error":"#N/A"},0,{"$f":"IF(AND(AU168=30,$AS$4>=44,$AS$4<=45),AU168&\"I\",0)","v":{"$error":"#N/A"}}]
[null,null,null,null,null,null,null,null,null,null,null,null,null,null,null,null,null,null,null,null,null,null,null,null,null,null,null,null,"Bottom Top Rail",{"$f":"(Frame_Width-2.1875)/12","v":-0.18229166666666666},0.224,-4.0833333333333333E-2,null,"3001","Length","Weight/ft","Weight",null,null,null,{"$error":"#N/A"},0,{"$f":"IF(AND(AP169=30,$AN$4>=46,$AN$4<=48),\"Dbl.\"&AP169&\"C\",0)","v":{"$error":"#N/A"}},null,null,{"$error":"#N/A"},0,{"$f":"IF(AND(AU169=30,$AS$4>=46,$AS$4<=48),\"Dbl.\"&AU169&\"C\",0)","v":{"$error":"#N/A"}}]
[null,null,null,null,null,null,null,null,null,null,null,null,null,null,null,null,null,null,null,null,null,null,null,null,null,null,null,null,"Bottom Bottom Rail",{"$f":"(Frame_Width-2.1875)/12","v":-0.18229166666666666},0.19900000000000001,-3.6276041666666668E-2,null,"Top Top Rail",{"$f":"(Frame_Width-4.125)/12","v":-0.34375},0.29699999999999999,{"$f":"AI170*AJ170","v":-0.10209375},null,null,null,{"$error":"#N/A"},0,{"$f":"IF(AND(AP170=30,$AN$4>=49,$AN$4<=58),\"Dbl.\"&AP170&\"D\",0)","v":{"$error":"#N/A"}},null,null,{"$error":"#N/A"},0,{"$f":"IF(AND(AU170=30,$AS$4>=49,$AS$4<=58),\"Dbl.\"&AU170&\"D\",0)","v":{"$error":"#N/A"}}]
[null,null,null,null,null,null,null,null,null,null,null,null,null,null,null,null,null,null,null,null,null,null,null,null,null,null,null,null,"Bottom Stile",{"$f":"(2*(CMR!$L$116-0.3125))/12","v":-5.2083333333333336E-2},0.19900000000000001,-1.0364583333333335E-2,null,"Top Bottom Rail",{"$f":"(Frame_Width-4.125)/12","v":-0.34375},0.28899999999999998,-9.9343749999999995E-2,null,null,null,{"$error":"#N/A"},0,{"$f":"IF(AND(AP171=30,$AN$4>=59,$AN$4<=66),\"Dbl.\"&AP171&\"E\",0)","v":{"$error":"#N/A"}},null,null,{"$error":"#N/A"},0,{"$f":"IF(AND(AU171=30,$AS$4>=59,$AS$4<=66),\"Dbl.\"&AU171&\"E\",0)","v":{"$error":"#N/A"}}]
[null,null,null,null,null,null,null,null,null,null,null,null,null,null,null,null,null,null,null,null,null,null,null,null,null,null,null,null,"Bottom Rail Reinf.",{"$f":"(TRUNC(((Frame_Width-8.1875)+0.5)/2)*2)/12","v":-0.5},0.13300000000000001,-6.6500000000000004E-2,null,"Top Stile",{"$f":"(2*(CMR!$E$116-1.625))/12","v":-0.27083333333333331},0.218,-5.9041666666666666E-2,null,null,null,{"$error":"#N/A"},0,{"$f":"IF(AND(AP172=30,$AN$4>=67,$AN$4<=74),\"Dbl.\"&AP172&\"F\",0)","v":{"$error":"#N/A"}},null,null,{"$error":"#N/A"},0,{"$f":"IF(AND(AU172=30,$AS$4>=67,$AS$4<=74),\"Dbl.\"&AU172&\"F\",0)","v":{"$error":"#N/A"}}]
[null,null,null,null,null,null,null,null,null,null,null,null,null,null,null,null,null,null,null,null,null,null,null,null,null,null,null,null,"Bottom Stile Reinf.",{"$f":"((TRUNC(((CMR!$L$116-1.3125)+0.5)/2)*2)/12)*2","v":0},0.13300000000000001,0,null,"Keeper Rail Reinf.",{"$f":"(TRUNC(((Frame_Width-4.125)-2)/2)*2)/12","v":-0.5},{"$f":"IF(OR(EXTSELECT=2,Frame_Width<48,Frame_Height<84),0.0516,IF(OR(EXTSELECT=3,Frame_Width>48,Frame_Height>84),0.3784,0))","v":5.16E-2},-2.58E-2,null,null,null,{"$error":"#N/A"},0,{"$f":"IF(AND(AP173=30,$AN$4>=75,$AN$4<=80),\"Dbl.\"&AP173&\"G\",0)","v":{"$error":"#N/A"}},null,null,{"$error":"#N/A"},0,{"$f":"IF(AND(AU173=30,$AS$4>=75,$AS$4<=80),\"Dbl.\"&AU173&\"G\",0)","v":{"$error":"#N/A"}}]
[null,null,null,null,null,null,null,null,null,null,null,null,null,null,null,null,null,null,null,null,null,null,null,null,null,null,null,null,"Bottom Glass",{"$f":"(CMR!$L$119*CMR!$L$121)/144","v":3.8791232638888888E-2},{"$f":"$L$12","v":3.2},0.12413194444444445,null,"Top Stile Reinf",{"$f":"IF(OR(Frame_Width>48,Frame_Height>84,EXTTYPE=\"Steel\"),((TRUNC(((CMR!$E$116-1.625)-8)/2)*2)/12)*2,0)","v":0},0.45600000000000002,0,null,null,null,{"$error":"#N/A"},{"$f":"IF(AND($AO$4<=32,$AO$4>30),32,0)","v":0},{"$f":"IF(AND(AP174=32,$AN$4>=8,$AN$4<=14),AP174&\"A\",0)","v":{"$error":"#N/A"}},null,null,{"$error":"#N/A"},{"$f":"IF(AND($AT$4<=32,$AT$4>30),32,0)","v":0},{"$f":"IF(AND(AU174=32,$AS$4>=8,$AS$4<=14),AU174&\"A\",0)","v":{"$error":"#N/A"}}]
[null,null,null,null,null,null,null,null,null,null,null,null,null,null,null,null,null,null,null,null,null,null,null,null,null,null,null,null,"Bottom Spacer",{"$f":"((CMR!$L$119*2)+(CMR!$L$121*2))/12","v":-0.84375},5.3600000000000002E-2,-4.5225000000000001E-2,null,"Top Glass",{"$f":"(CMR!$E$119*CMR!$E$121)/144","v":0.12852647569444445},{"$f":"$L$12","v":3.2},0.41128472222222223,null,null,null,{"$error":"#N/A"},0,{"$f":"IF(AND(AP175=32,$AN$4>=15,$AN$4<=20),AP175&\"B\",0)","v":{"$error":"#N/A"}},null,null,{"$error":"#N/A"},0,{"$f":"IF(AND(AU175=32,$AS$4>=15,$AS$4<=20),AU175&\"B\",0)","v":{"$error":"#N/A"}}]
[null,null,null,null,null,null,null,null,null,null,null,null,null,null,null,null,null,null,null,null,null,null,null,null,null,null,null,null,"Bottom Hardware",1,0.36,0.36,null,"Top Spacer",{"$f":"((CMR!$E$119*2)+(CMR!$E$121*2))/12","v":-1.4947916666666667},5.3600000000000002E-2,-8.0120833333333336E-2,null,null,null,{"$error":"#N/A"},0,{"$f":"IF(AND(AP176=32,$AN$4>=21,$AN$4<=25),AP176&\"C\",0)","v":{"$error":"#N/A"}},null,null,{"$error":"#N/A"},0,{"$f":"IF(AND(AU176=32,$AS$4>=21,$AS$4<=25),AU176&\"C\",0)","v":{"$error":"#N/A"}}]
[null,null,null,null,null,null,null,null,null,null,null,null,null,null,null,null,null,null,null,null,null,null,null,null,null,null,null,null,"Bottom Bead",{"$f":"(((Frame_Width-2.95)*2)+((CMR!$L$116-1.0625)*2))/12","v":-0.66875000000000007},2.1000000000000001E-2,-1.4043750000000002E-2,null,"Top Hardware",1,0.4,0.4,null,null,null,{"$error":"#N/A"},0,{"$f":"IF(AND(AP177=32,$AN$4>=26,$AN$4<=30),AP177&\"D\",0)","v":{"$error":"#N/A"}},null,null,{"$error":"#N/A"},0,{"$f":"IF(AND(AU177=32,$AS$4>=26,$AS$4<=30),AU177&\"D\",0)","v":{"$error":"#N/A"}}]
[null,null,null,null,null,null,null,null,null,null,null,null,null,null,null,null,null,null,null,null,null,null,null,null,null,null,null,null,null,null,"Top Sash",{"$f":"IF(ModelNo=\"V101\",(TRUNC((SUM(AF160:AF168))))+5,0)","v":0},null,"Top Bead",{"$f":"(((Frame_Width-5.125)*2)+((CMR!$E$116-4.3125)*2))/12","v":-1.5729166666666667},7.1999999999999995E-2,-0.11325,null,null,null,{"$error":"#N/A"},0,{"$f":"IF(AND(AP178=32,$AN$4>=31,$AN$4<=34),AP178&\"E\",0)","v":{"$error":"#N/A"}},null,null,{"$error":"#N/A"},0,{"$f":"IF(AND(AU178=32,$AS$4>=31,$AS$4<=34),AU178&\"E\",0)","v":{"$error":"#N/A"}}]
[null,null,null,null,null,null,null,null,null,null,null,null,null,null,null,null,null,null,null,null,null,null,null,null,null,null,null,null,null,null,"Bottom Sash",{"$f":"IF(ModelNo=\"V101\",TRUNC((SUM(AF169:AF177))),0)","v":0},null,"Bottom Top Rail",{"$f":"(Frame_Width-3.125)/12","v":-0.26041666666666669},0.29699999999999999,-7.7343750000000003E-2,null,null,null,{"$error":"#N/A"},0,{"$f":"IF(AND(AP179=32,$AN$4>=35,$AN$4<=37),AP179&\"F\",0)","v":{"$error":"#N/A"}},null,null,{"$error":"#N/A"},0,{"$f":"IF(AND(AU179=32,$AS$4>=35,$AS$4<=37),AU179&\"F\",0)","v":{"$error":"#N/A"}}]
[null,null,null,null,null,null,null,null,null,null,null,null,null,null,null,null,null,null,null,null,null,null,null,null,null,null,null,null,null,null,null,null,null,"Bottom Bottom Rail",{"$f":"(Frame_Width-3.125)/12","v":-0.26041666666666669},0.23200000000000001,-6.0416666666666674E-2,null,null,null,{"$error":"#N/A"},0,{"$f":"IF(AND(AP180=32,$AN$4>=38,$AN$4<=40),AP180&\"G\",0)","v":{"$error":"#N/A"}},null,null,{"$error":"#N/A"},0,{"$f":"IF(AND(AU180=32,$AS$4>=38,$AS$4<=40),AU180&\"G\",0)","v":{"$error":"#N/A"}}]
[null,null,null,null,null,null,null,null,null,null,null,null,null,null,null,null,null,null,null,null,null,null,null,null,null,null,null,null,"03A0","Length","Weight/ft","Weight",null,"Bottom Stile",{"$f":"(2*(CMR!$E$117-0.625))/12","v":-0.10416666666666667},0.219,-2.2812499999999999E-2,null,null,null,{"$error":"#N/A"},0,{"$f":"IF(AND(AP181=32,$AN$4>=41,$AN$4<=43),AP181&\"H\",0)","v":{"$error":"#N/A"}},null,null,{"$error":"#N/A"},0,{"$f":"IF(AND(AU181=32,$AS$4>=41,$AS$4<=43),AU181&\"H\",0)","v":{"$error":"#N/A"}}]
[null,null,null,null,null,null,null,null,null,null,null,null,null,null,null,null,null,null,null,null,null,null,null,null,null,null,null,null,"Bottom Top Rail",{"$f":"(Frame_Width-3.125)/12","v":-0.26041666666666669},0.29699999999999999,{"$f":"AD182*AE182","v":-7.7343750000000003E-2},null,"Bottom Rail Reinf.",{"$f":"(TRUNC(((Frame_Width-3.125)-6)/2)*2)/12","v":-0.66666666666666663},{"$f":"IF(OR(EXTSELECT=2,Frame_Width<48,Frame_Height<84),0.0516,IF(OR(EXTSELECT=3,Frame_Width>48,Frame_Height>84),0.57,0))","v":5.16E-2},-3.44E-2,null,null,null,{"$error":"#N/A"},0,{"$f":"IF(AND(AP182=32,$AN$4>=44,$AN$4<=45),AP182&\"I\",0)","v":{"$error":"#N/A"}},null,null,{"$error":"#N/A"},0,{"$f":"IF(AND(AU182=32,$AS$4>=44,$AS$4<=45),AU182&\"I\",0)","v":{"$error":"#N/A"}}]
[null,null,null,null,null,null,null,null,null,null,null,null,null,null,null,null,null,null,null,null,null,null,null,null,null,null,null,null,"Bottom Bottom Rail",{"$f":"(Frame_Width-3.125)/12","v":-0.26041666666666669},0.23200000000000001,-6.0416666666666674E-2,null,"Bottom Stile Reinf.",{"$f":"IF(OR(Frame_Width>48,Frame_Height>84,EXTTYPE=\"Steel\"),((TRUNC((CMR!$E$117-2)/2)*2)/12)*2,0)","v":0},0.45600000000000002,0,null,null,null,{"$error":"#N/A"},0,{"$f":"IF(AND(AP183=32,$AN$4>=46,$AN$4<=50),\"Dbl.\"&AP183&\"C\",0)","v":{"$error":"#N/A"}},null,null,{"$error":"#N/A"},0,{"$f":"IF(AND(AU183=32,$AS$4>=46,$AS$4<=50),\"Dbl.\"&AU183&\"C\",0)","v":{"$error":"#N/A"}}]
[null,null,null,null,null,null,null,null,null,null,null,null,null,null,null,null,null,null,null,null,null,null,null,null,null,null,null,null,"Bottom Stile",{"$f":"(2*(CMR!$E$133-1.125))/12","v":-0.1875},0.219,-4.1062500000000002E-2,null,"Bottom Glass",{"$f":"(CMR!$E$120*CMR!$E$122)/144","v":7.3187934027777776E-2},{"$f":"$L$12","v":3.2},0.23420138888888889,null,null,null,{"$error":"#N/A"},0,{"$f":"IF(AND(AP184=32,$AN$4>=51,$AN$4<=60),\"Dbl.\"&AP184&\"D\",0)","v":{"$error":"#N/A"}},null,null,{"$error":"#N/A"},0,{"$f":"IF(AND(AU184=32,$AS$4>=51,$AS$4<=60),\"Dbl.\"&AU184&\"D\",0)","v":{"$error":"#N/A"}}]
[null,null,null,null,null,null,null,null,null,null,null,null,null,null,null,null,null,null,null,null,null,null,null,null,null,null,null,null,"Bottom Rail Reinf.",{"$f":"(TRUNC(((Frame_Width-3.125)-6)/2)*2)/12","v":-0.66666666666666663},{"$f":"IF(OR(EXTSELECT=2,Frame_Width<48,Frame_Height<84),0.0516,IF(OR(EXTSELECT=3,Frame_Width>48,Frame_Height>84),0.57,0))","v":5.16E-2},-3.44E-2,null,"Bottom Spacer",{"$f":"((CMR!$E$120*2)+(CMR!$E$122*2))/12","v":-1.1614583333333333},5.3600000000000002E-2,-6.2254166666666666E-2,null,null,null,{"$error":"#N/A"},0,{"$f":"IF(AND(AP185=32,$AN$4>=61,$AN$4<=68),\"Dbl.\"&AP185&\"E\",0)","v":{"$error":"#N/A"}},null,null,{"$error":"#N/A"},0,{"$f":"IF(AND(AU185=32,$AS$4>=61,$AS$4<=68),\"Dbl.\"&AU185&\"E\",0)","v":{"$error":"#N/A"}}]
[null,null,null,null,null,null,null,null,null,null,null,null,null,null,null,null,null,null,null,null,null,null,null,null,null,null,null,null,"Bottom Stile Reinf.",{"$f":"IF(OR(Frame_Width>48,Frame_Height>84,EXTTYPE=\"Steel\"),((TRUNC(((CDIM03A0-1.125)-4)/2)*2)/12)*2,0)","v":0},0.45600000000000002,0,null,"Bottom Hardware",1,0.36,0.36,null,null,null,{"$error":"#N/A"},0,{"$f":"IF(AND(AP186=32,$AN$4>=69,$AN$4<=74),\"Dbl.\"&AP186&\"F\",0)","v":{"$error":"#N/A"}},null,null,{"$error":"#N/A"},0,{"$f":"IF(AND(AU186=32,$AS$4>=69,$AS$4<=74),\"Dbl.\"&AU186&\"F\",0)","v":{"$error":"#N/A"}}]
[null,null,null,null,null,null,null,null,null,null,null,null,null,null,null,null,null,null,null,null,null,null,null,null,null,null,null,null,"Bottom Glass",{"$f":"(CMR!$E$136*CMR!$E$138)/144","v":8.9680989583333329E-2},{"$f":"$L$12","v":3.2},0.28697916666666667,null,"Bottom Bead",{"$f":"(((Frame_Width-4.125)*2)+((CDIM3001-3.3125)*2))/12","v":{"$error":"#NAME?"}},7.1999999999999995E-2,{"$error":"#NAME?"},null,null,null,{"$error":"#N/A"},0,{"$f":"IF(AND(AP187=32,$AN$4>=75,$AN$4<=80),\"Dbl.\"&AP187&\"G\",0)","v":{"$error":"#N/A"}},null,null,{"$error":"#N/A"},0,{"$f":"IF(AND(AU187=32,$AS$4>=75,$AS$4<=80),\"Dbl.\"&AU187&\"G\",0)","v":{"$error":"#N/A"}}]
[null,null,null,null,null,null,null,null,null,null,null,null,null,null,null,null,null,null,null,null,null,null,null,null,null,null,null,null,"Bottom Spacer",{"$f":"((CMR!$E$136*2)+(CMR!$E$138*2))/12","v":-1.2447916666666667},5.3600000000000002E-2,-6.672083333333334E-2,null,null,null,"Top Sash",{"$f":"IF(ModelNo=\"3001\",(TRUNC((SUM(AK170:AK178))))+5,0)","v":0},null,null,null,{"$error":"#N/A"},{"$f":"IF(AND($AO$4<=34,$AO$4>32),34,0)","v":0},{"$f":"IF(AND(AP188=34,$AN$4>=11,$AN$4<=16),AP188&\"A\",0)","v":{"$error":"#N/A"}},null,null,{"$error":"#N/A"},{"$f":"IF(AND($AT$4<=34,$AT$4>32),34,0)","v":0},{"$f":"IF(AND(AU188=34,$AS$4>=11,$AS$4<=16),AU188&\"A\",0)","v":{"$error":"#N/A"}}]
[null,null,null,null,null,null,null,null,null,null,null,null,null,null,null,null,null,null,null,null,null,null,null,null,null,null,null,null,"Bottom Hardware",1,0.36,0.36,null,null,null,"Bottom Sash",{"$f":"IF(ModelNo=\"3001\",TRUNC((SUM(AK179:AK187))),0)","v":0},null,null,null,{"$error":"#N/A"},0,{"$f":"IF(AND(AP189=34,$AN$4>=17,$AN$4<=22),AP189&\"B\",0)","v":{"$error":"#N/A"}},null,null,{"$error":"#N/A"},0,{"$f":"IF(AND(AU189=34,$AS$4>=17,$AS$4<=22),AU189&\"B\",0)","v":{"$error":"#N/A"}}]
[null,null,null,null,null,null,null,null,null,null,null,null,null,null,null,null,null,null,null,null,null,null,null,null,null,null,null,null,"Bottom Bead",{"$f":"(((Frame_Width-4.125)*2)+((CDIM03A0-3.3125)*2))/12","v":-1.2395833333333333},7.1999999999999995E-2,-8.9249999999999982E-2,null,null,null,null,null,null,null,null,{"$error":"#N/A"},0,{"$f":"IF(AND(AP190=34,$AN$4>=23,$AN$4<=27),AP190&\"C\",0)","v":{"$error":"#N/A"}},null,null,{"$error":"#N/A"},0,{"$f":"IF(AND(AU190=34,$AS$4>=23,$AS$4<=27),AU190&\"C\",0)","v":{"$error":"#N/A"}}]
[null,null,null,null,null,null,null,null,null,null,null,null,null,null,null,null,null,null,null,null,null,null,null,null,null,null,null,null,null,null,"Bottom Sash",{"$f":"IF(OR(ModelNo=\"03A0\",ModelNo=\"S140\",ModelNo=\"S144\",ModelNo=\"S146\",ModelNo=\"S140 (HP)\",ModelNo=\"S144 (HP)\",ModelNo=\"S146 (HP)\"),TRUNC((SUM(AF182:AF190))),0)","v":0},null,null,null,null,null,null,null,null,{"$error":"#N/A"},0,{"$f":"IF(AND(AP191=34,$AN$4>=28,$AN$4<=32),AP191&\"D\",0)","v":{"$error":"#N/A"}},null,null,{"$error":"#N/A"},0,{"$f":"IF(AND(AU191=34,$AS$4>=28,$AS$4<=32),AU191&\"D\",0)","v":{"$error":"#N/A"}}]
[null,null,null,null,null,null,null,null,null,null,null,null,null,null,null,null,null,null,null,null,null,null,null,null,null,null,null,null,null,null,null,null,null,null,null,null,null,null,null,null,{"$error":"#N/A"},0,{"$f":"IF(AND(AP192=34,$AN$4>=33,$AN$4<=34),AP192&\"E\",0)","v":{"$error":"#N/A"}},null,null,{"$error":"#N/A"},0,{"$f":"IF(AND(AU192=34,$AS$4>=33,$AS$4<=34),AU192&\"E\",0)","v":{"$error":"#N/A"}}]
[null,null,null,null,null,null,null,null,null,null,null,null,null,null,null,null,null,null,null,null,null,null,null,null,null,null,null,null,null,null,null,null,null,null,null,null,null,null,null,null,{"$error":"#N/A"},0,{"$f":"IF(AND(AP193=34,$AN$4>=35,$AN$4<=37),AP193&\"F\",0)","v":{"$error":"#N/A"}},null,null,{"$error":"#N/A"},0,{"$f":"IF(AND(AU193=34,$AS$4>=35,$AS$4<=37),AU193&\"F\",0)","v":{"$error":"#N/A"}}]
[null,null,null,null,null,null,null,null,null,null,null,null,null,null,null,null,null,null,null,null,null,null,null,null,null,null,null,null,null,null,null,null,null,null,null,null,null,null,null,null,{"$error":"#N/A"},0,{"$f":"IF(AND(AP194=34,$AN$4>=38,$AN$4<=40),AP194&\"G\",0)","v":{"$error":"#N/A"}},null,null,{"$error":"#N/A"},0,{"$f":"IF(AND(AU194=34,$AS$4>=38,$AS$4<=40),AU194&\"G\",0)","v":{"$error":"#N/A"}}]
[null,null,null,null,null,null,null,null,null,null,null,null,null,null,null,null,null,null,null,null,null,null,null,null,null,null,null,null,null,null,null,null,null,null,null,null,null,null,null,null,{"$error":"#N/A"},0,{"$f":"IF(AND(AP195=34,$AN$4>=41,$AN$4<=43),AP195&\"H\",0)","v":{"$error":"#N/A"}},null,null,{"$error":"#N/A"},0,{"$f":"IF(AND(AU195=34,$AS$4>=41,$AS$4<=43),AU195&\"H\",0)","v":{"$error":"#N/A"}}]
[null,null,null,null,null,null,null,null,null,null,null,null,null,null,null,null,null,null,null,null,null,null,null,null,null,null,null,null,null,null,null,null,null,null,null,null,null,null,null,null,{"$f":"IF(AND(AP196>0,AQ196>0),AP196,0)","v":{"$error":"#N/A"}},0,{"$f":"IF(AND(AP196=34,$AN$4>=44,$AN$4<=45),AP196&\"I\",0)","v":{"$error":"#N/A"}},null,null,{"$error":"#N/A"},0,{"$f":"IF(AND(AU196=34,$AS$4>=44,$AS$4<=45),AU196&\"I\",0)","v":{"$error":"#N/A"}}]
[null,null,null,null,null,null,null,null,null,null,null,null,null,null,null,null,null,null,null,null,null,null,null,null,null,null,null,null,null,null,null,null,null,null,null,null,null,null,null,null,{"$error":"#N/A"},0,{"$f":"IF(AND(AP197=34,$AN$4>=46,$AN$4<=54),\"Dbl.\"&AP197&\"C\",0)","v":{"$error":"#N/A"}},null,null,{"$f":"IF(AND(AU197>0,AV197>0),AU197,0)","v":{"$error":"#N/A"}},0,{"$f":"IF(AND(AU197=34,$AS$4>=46,$AS$4<=54),\"Dbl.\"&AU197&\"C\",0)","v":{"$error":"#N/A"}}]
[null,null,null,null,null,null,null,null,null,null,null,null,null,null,null,null,null,null,null,null,null,null,null,null,null,null,null,null,null,null,null,null,null,null,null,null,null,null,null,null,{"$error":"#N/A"},0,{"$f":"IF(AND(AP198=34,$AN$4>=55,$AN$4<=64),\"Dbl.\"&AP198&\"D\",0)","v":{"$error":"#N/A"}},null,null,{"$error":"#N/A"},0,{"$f":"IF(AND(AU198=34,$AS$4>=55,$AS$4<=64),\"Dbl.\"&AU198&\"D\",0)","v":{"$error":"#N/A"}}]
[null,null,null,null,null,null,null,null,null,null,null,null,null,null,null,null,null,null,null,null,null,null,null,null,null,null,null,null,null,null,null,null,null,null,null,null,null,null,null,null,{"$error":"#N/A"},0,{"$f":"IF(AND(AP199=34,$AN$4>=65,$AN$4<=68),\"Dbl.\"&AP199&\"E\",0)","v":{"$error":"#N/A"}},null,null,{"$error":"#N/A"},0,{"$f":"IF(AND(AU199=34,$AS$4>=65,$AS$4<=68),\"Dbl.\"&AU199&\"E\",0)","v":{"$error":"#N/A"}}]
[null,null,null,null,null,null,null,null,null,null,null,null,null,null,null,null,null,null,null,null,null,null,null,null,null,null,null,null,null,null,null,null,null,null,null,null,null,null,null,null,{"$error":"#N/A"},0,{"$f":"IF(AND(AP200=34,$AN$4>=69,$AN$4<=74),\"Dbl.\"&AP200&\"F\",0)","v":{"$error":"#N/A"}},null,null,{"$error":"#N/A"},0,{"$f":"IF(AND(AU200=34,$AS$4>=69,$AS$4<=74),\"Dbl.\"&AU200&\"F\",0)","v":{"$error":"#N/A"}}]
[null,null,null,null,null,null,null,null,null,null,null,null,null,null,null,null,null,null,null,null,null,null,null,null,null,null,null,null,null,null,null,null,null,null,null,null,null,null,null,null,{"$error":"#N/A"},0,{"$f":"IF(AND(AP201=34,$AN$4>=75,$AN$4<=80),\"Dbl.\"&AP201&\"G\",0)","v":{"$error":"#N/A"}},null,null,{"$error":"#N/A"},0,{"$f":"IF(AND(AU201=34,$AS$4>=75,$AS$4<=80),\"Dbl.\"&AU201&\"G\",0)","v":{"$error":"#N/A"}}]
[null,null,null,null,null,null,null,null,null,null,null,null,null,null,null,null,null,null,null,null,null,null,null,null,null,null,null,null,null,null,null,null,null,null,null,null,null,null,null,null,{"$error":"#N/A"},{"$f":"IF(AND($AO$4<=36,$AO$4>34),36,0)","v":0},{"$f":"IF(AND(AP202=36,$AN$4>=11,$AN$4<=16),AP202&\"A\",0)","v":{"$error":"#N/A"}},null,null,{"$error":"#N/A"},{"$f":"IF(AND($AT$4<=36,$AT$4>34),36,0)","v":0},{"$f":"IF(AND(AU202=36,$AS$4>=11,$AS$4<=16),AU202&\"A\",0)","v":{"$error":"#N/A"}}]
[null,null,null,null,null,null,null,null,null,null,null,null,null,null,null,null,null,null,null,null,null,null,null,null,null,null,null,null,null,null,null,null,null,null,null,null,null,null,null,null,{"$error":"#N/A"},0,{"$f":"IF(AND(AP203=36,$AN$4>=17,$AN$4<=22),AP203&\"B\",0)","v":{"$error":"#N/A"}},null,null,{"$error":"#N/A"},0,{"$f":"IF(AND(AU203=36,$AS$4>=17,$AS$4<=22),AU203&\"B\",0)","v":{"$error":"#N/A"}}]
[null,null,null,null,null,null,null,null,null,null,null,null,null,null,null,null,null,null,null,null,null,null,null,null,null,null,null,null,null,null,null,null,null,null,null,null,null,null,null,null,{"$error":"#N/A"},0,{"$f":"IF(AND(AP204=36,$AN$4>=23,$AN$4<=27),AP204&\"C\",0)","v":{"$error":"#N/A"}},null,null,{"$error":"#N/A"},0,{"$f":"IF(AND(AU204=36,$AS$4>=23,$AS$4<=27),AU204&\"C\",0)","v":{"$error":"#N/A"}}]
[null,null,null,null,null,null,null,null,null,null,null,null,null,null,null,null,null,null,null,null,null,null,null,null,null,null,null,null,null,null,null,null,null,null,null,null,null,null,null,null,{"$error":"#N/A"},0,{"$f":"IF(AND(AP205=36,$AN$4>=28,$AN$4<=32),AP205&\"D\",0)","v":{"$error":"#N/A"}},null,null,{"$error":"#N/A"},0,{"$f":"IF(AND(AU205=36,$AS$4>=28,$AS$4<=32),AU205&\"D\",0)","v":{"$error":"#N/A"}}]
[null,null,null,null,null,null,null,null,null,null,null,null,null,null,null,null,null,null,null,null,null,null,null,null,null,null,null,null,null,null,null,null,null,null,null,null,null,null,null,null,{"$error":"#N/A"},0,{"$f":"IF(AND(AP206=36,$AN$4>=33,$AN$4<=34),AP206&\"E\",0)","v":{"$error":"#N/A"}},null,null,{"$error":"#N/A"},0,{"$f":"IF(AND(AU206=36,$AS$4>=33,$AS$4<=34),AU206&\"E\",0)","v":{"$error":"#N/A"}}]
[null,null,null,null,null,null,null,null,null,null,null,null,null,null,null,null,null,null,null,null,null,null,null,null,null,null,null,null,null,null,null,null,null,null,null,null,null,null,null,null,{"$error":"#N/A"},0,{"$f":"IF(AND(AP207=36,$AN$4>=35,$AN$4<=37),AP207&\"F\",0)","v":{"$error":"#N/A"}},null,null,{"$error":"#N/A"},0,{"$f":"IF(AND(AU207=36,$AS$4>=35,$AS$4<=37),AU207&\"F\",0)","v":{"$error":"#N/A"}}]
[null,null,null,null,null,null,null,null,null,null,null,null,null,null,null,null,null,null,null,null,null,null,null,null,null,null,null,null,null,null,null,null,null,null,null,null,null,null,null,null,{"$error":"#N/A"},0,{"$f":"IF(AND(AP208=36,$AN$4>=38,$AN$4<=40),AP208&\"G\",0)","v":{"$error":"#N/A"}},null,null,{"$error":"#N/A"},0,{"$f":"IF(AND(AU208=36,$AS$4>=38,$AS$4<=40),AU208&\"G\",0)","v":{"$error":"#N/A"}}]
[null,null,null,null,null,null,null,null,null,null,null,null,null,null,null,null,null,null,null,null,null,null,null,null,null,null,null,null,null,null,null,null,null,null,null,null,null,null,null,null,{"$error":"#N/A"},0,{"$f":"IF(AND(AP209=36,$AN$4>=41,$AN$4<=43),AP209&\"H\",0)","v":{"$error":"#N/A"}},null,null,{"$error":"#N/A"},0,{"$f":"IF(AND(AU209=36,$AS$4>=41,$AS$4<=43),AU209&\"H\",0)","v":{"$error":"#N/A"}}]
[null,null,null,null,null,null,null,null,null,null,null,null,null,null,null,null,null,null,null,null,null,null,null,null,null,null,null,null,null,null,null,null,null,null,null,null,null,null,null,null,{"$error":"#N/A"},0,{"$f":"IF(AND(AP210=36,$AN$4>=44,$AN$4<=45),AP210&\"I\",0)","v":{"$error":"#N/A"}},null,null,{"$error":"#N/A"},0,{"$f":"IF(AND(AU210=36,$AS$4>=44,$AS$4<=45),AU210&\"I\",0)","v":{"$error":"#N/A"}}]
[null,null,null,null,null,null,null,null,null,null,null,null,null,null,null,null,null,null,null,null,null,null,null,null,null,null,null,null,null,null,null,null,null,null,null,null,null,null,null,null,{"$error":"#N/A"},0,{"$f":"IF(AND(AP211=36,$AN$4>=46,$AN$4<=54),\"Dbl.\"&AP211&\"C\",0)","v":{"$error":"#N/A"}},null,null,{"$error":"#N/A"},0,{"$f":"IF(AND(AU211=36,$AS$4>=46,$AS$4<=54),\"Dbl.\"&AU211&\"C\",0)","v":{"$error":"#N/A"}}]
[null,null,null,null,null,null,null,null,null,null,null,null,null,null,null,null,null,null,null,null,null,null,null,null,null,null,null,null,null,null,null,null,null,null,null,null,null,null,null,null,{"$error":"#N/A"},0,{"$f":"IF(AND(AP212=36,$AN$4>=55,$AN$4<=64),\"Dbl.\"&AP212&\"D\",0)","v":{"$error":"#N/A"}},null,null,{"$error":"#N/A"},0,{"$f":"IF(AND(AU212=36,$AS$4>=55,$AS$4<=64),\"Dbl.\"&AU212&\"D\",0)","v":{"$error":"#N/A"}}]
[null,null,null,null,null,null,null,null,null,null,null,null,null,null,null,null,null,null,null,null,null,null,null,null,null,null,null,null,null,null,null,null,null,null,null,null,null,null,null,null,{"$error":"#N/A"},0,{"$f":"IF(AND(AP213=36,$AN$4>=65,$AN$4<=68),\"Dbl.\"&AP213&\"E\",0)","v":{"$error":"#N/A"}},null,null,{"$error":"#N/A"},0,{"$f":"IF(AND(AU213=36,$AS$4>=65,$AS$4<=68),\"Dbl.\"&AU213&\"E\",0)","v":{"$error":"#N/A"}}]
[null,null,null,null,null,null,null,null,null,null,null,null,null,null,null,null,null,null,null,null,null,null,null,null,null,null,null,null,null,null,null,null,null,null,null,null,null,null,null,null,{"$error":"#N/A"},0,{"$f":"IF(AND(AP214=36,$AN$4>=69,$AN$4<=74),\"Dbl.\"&AP214&\"F\",0)","v":{"$error":"#N/A"}},null,null,{"$error":"#N/A"},0,{"$f":"IF(AND(AU214=36,$AS$4>=69,$AS$4<=74),\"Dbl.\"&AU214&\"F\",0)","v":{"$error":"#N/A"}}]
[null,null,null,null,null,null,null,null,null,null,null,null,null,null,null,null,null,null,null,null,null,null,null,null,null,null,null,null,null,null,null,null,null,null,null,null,null,null,null,null,{"$error":"#N/A"},0,{"$f":"IF(AND(AP215=36,$AN$4>=75,$AN$4<=80),\"Dbl.\"&AP215&\"G\",0)","v":{"$error":"#N/A"}},null,null,{"$error":"#N/A"},0,{"$f":"IF(AND(AU215=36,$AS$4>=75,$AS$4<=80),\"Dbl.\"&AU215&\"G\",0)","v":{"$error":"#N/A"}}]
[null,null,null,null,null,null,null,null,null,null,null,null,null,null,null,null,null,null,null,null,null,null,null,null,null,null,null,null,null,null,null,null,null,null,null,null,null,null,null,null,{"$error":"#N/A"},{"$f":"IF(AND($AO$4<=38,$AO$4>36),38,0)","v":0},{"$f":"IF(AND(AP216=38,$AN$4>=11,$AN$4<=16),AP216&\"A\",0)","v":{"$error":"#N/A"}},null,null,{"$error":"#N/A"},{"$f":"IF(AND($AT$4<=38,$AT$4>36),38,0)","v":0},{"$f":"IF(AND(AU216=38,$AS$4>=11,$AS$4<=16),AU216&\"A\",0)","v":{"$error":"#N/A"}}]
[null,null,null,null,null,null,null,null,null,null,null,null,null,null,null,null,null,null,null,null,null,null,null,null,null,null,null,null,null,null,null,null,null,null,null,null,null,null,null,null,{"$error":"#N/A"},0,{"$f":"IF(AND(AP217=38,$AN$4>=17,$AN$4<=22),AP217&\"B\",0)","v":{"$error":"#N/A"}},null,null,{"$f":"IF(AND(AU217>0,AV217>0),AU217,0)","v":{"$error":"#N/A"}},0,{"$f":"IF(AND(AU217=38,$AS$4>=17,$AS$4<=22),AU217&\"B\",0)","v":{"$error":"#N/A"}}]
[null,null,null,null,null,null,null,null,null,null,null,null,null,null,null,null,null,null,null,null,null,null,null,null,null,null,null,null,null,null,null,null,null,null,null,null,null,null,null,null,{"$error":"#N/A"},0,{"$f":"IF(AND(AP218=38,$AN$4>=23,$AN$4<=27),AP218&\"C\",0)","v":{"$error":"#N/A"}},null,null,{"$error":"#N/A"},0,{"$f":"IF(AND(AU218=38,$AS$4>=23,$AS$4<=27),AU218&\"C\",0)","v":{"$error":"#N/A"}}]
[null,null,null,null,null,null,null,null,null,null,null,null,null,null,null,null,null,null,null,null,null,null,null,null,null,null,null,null,null,null,null,null,null,null,null,null,null,null,null,null,{"$error":"#N/A"},0,{"$f":"IF(AND(AP219=38,$AN$4>=28,$AN$4<=32),AP219&\"D\",0)","v":{"$error":"#N/A"}},null,null,{"$error":"#N/A"},0,{"$f":"IF(AND(AU219=38,$AS$4>=28,$AS$4<=32),AU219&\"D\",0)","v":{"$error":"#N/A"}}]
[null,null,null,null,null,null,null,null,null,null,null,null,null,null,null,null,null,null,null,null,null,null,null,null,null,null,null,null,null,null,null,null,null,null,null,null,null,null,null,null,{"$error":"#N/A"},0,{"$f":"IF(AND(AP220=38,$AN$4>=33,$AN$4<=34),AP220&\"E\",0)","v":{"$error":"#N/A"}},null,null,{"$error":"#N/A"},0,{"$f":"IF(AND(AU220=38,$AS$4>=33,$AS$4<=34),AU220&\"E\",0)","v":{"$error":"#N/A"}}]
[null,null,null,null,null,null,null,null,null,null,null,null,null,null,null,null,null,null,null,null,null,null,null,null,null,null,null,null,null,null,null,null,null,null,null,null,null,null,null,null,{"$error":"#N/A"},0,{"$f":"IF(AND(AP221=38,$AN$4>=35,$AN$4<=37),AP221&\"F\",0)","v":{"$error":"#N/A"}},null,null,{"$error":"#N/A"},0,{"$f":"IF(AND(AU221=38,$AS$4>=35,$AS$4<=37),AU221&\"F\",0)","v":{"$error":"#N/A"}}]
[null,null,null,null,null,null,null,null,null,null,null,null,null,null,null,null,null,null,null,null,null,null,null,null,null,null,null,null,null,null,null,null,null,null,null,null,null,null,null,null,{"$error":"#N/A"},0,{"$f":"IF(AND(AP222=38,$AN$4>=38,$AN$4<=40),AP222&\"G\",0)","v":{"$error":"#N/A"}},null,null,{"$error":"#N/A"},0,{"$f":"IF(AND(AU222=38,$AS$4>=38,$AS$4<=40),AU222&\"G\",0)","v":{"$error":"#N/A"}}]
[null,null,null,null,null,null,null,null,null,null,null,null,null,null,null,null,null,null,null,null,null,null,null,null,null,null,null,null,null,null,null,null,null,null,null,null,null,null,null,null,{"$error":"#N/A"},0,{"$f":"IF(AND(AP223=38,$AN$4>=41,$AN$4<=43),AP223&\"H\",0)","v":{"$error":"#N/A"}},null,null,{"$error":"#N/A"},0,{"$f":"IF(AND(AU223=38,$AS$4>=41,$AS$4<=43),AU223&\"H\",0)","v":{"$error":"#N/A"}}]
[null,null,null,null,null,null,null,null,null,null,null,null,null,null,null,null,null,null,null,null,null,null,null,null,null,null,null,null,null,null,null,null,null,null,null,null,null,null,null,null,{"$error":"#N/A"},0,{"$f":"IF(AND(AP224=38,$AN$4>=44,$AN$4<=45),AP224&\"I\",0)","v":{"$error":"#N/A"}},null,null,{"$error":"#N/A"},0,{"$f":"IF(AND(AU224=38,$AS$4>=44,$AS$4<=45),AU224&\"I\",0)","v":{"$error":"#N/A"}}]
[null,null,null,null,null,null,null,null,null,null,null,null,null,null,null,null,null,null,null,null,null,null,null,null,null,null,null,null,null,null,null,null,null,null,null,null,null,null,null,null,{"$error":"#N/A"},0,{"$f":"IF(AND(AP225=38,$AN$4>=46,$AN$4<=54),\"Dbl.\"&AP225&\"C\",0)","v":{"$error":"#N/A"}},null,null,{"$error":"#N/A"},0,{"$f":"IF(AND(AU225=38,$AS$4>=46,$AS$4<=54),\"Dbl.\"&AU225&\"C\",0)","v":{"$error":"#N/A"}}]
[null,null,null,null,null,null,null,null,null,null,null,null,null,null,null,null,null,null,null,null,null,null,null,null,null,null,null,null,null,null,null,null,null,null,null,null,null,null,null,null,{"$error":"#N/A"},0,{"$f":"IF(AND(AP226=38,$AN$4>=55,$AN$4<=64),\"Dbl.\"&AP226&\"D\",0)","v":{"$error":"#N/A"}},null,null,{"$error":"#N/A"},0,{"$f":"IF(AND(AU226=38,$AS$4>=55,$AS$4<=64),\"Dbl.\"&AU226&\"D\",0)","v":{"$error":"#N/A"}}]
[null,null,null,null,null,null,null,null,null,null,null,null,null,null,null,null,null,null,null,null,null,null,null,null,null,null,null,null,null,null,null,null,null,null,null,null,null,null,null,null,{"$error":"#N/A"},0,{"$f":"IF(AND(AP227=38,$AN$4>=65,$AN$4<=68),\"Dbl.\"&AP227&\"E\",0)","v":{"$error":"#N/A"}},null,null,{"$error":"#N/A"},0,{"$f":"IF(AND(AU227=38,$AS$4>=65,$AS$4<=68),\"Dbl.\"&AU227&\"E\",0)","v":{"$error":"#N/A"}}]
[null,null,null,null,null,null,null,null,null,null,null,null,null,null,null,null,null,null,null,null,null,null,null,null,null,null,null,null,null,null,null,null,null,null,null,null,null,null,null,null,{"$f":"IF(AND(AP228>0,AQ228>0),AP228,0)","v":{"$error":"#N/A"}},0,{"$f":"IF(AND(AP228=38,$AN$4>=69,$AN$4<=74),\"Dbl.\"&AP228&\"F\",0)","v":{"$error":"#N/A"}},null,null,{"$error":"#N/A"},0,{"$f":"IF(AND(AU228=38,$AS$4>=69,$AS$4<=74),\"Dbl.\"&AU228&\"F\",0)","v":{"$error":"#N/A"}}]
[null,null,null,null,null,null,null,null,null,null,null,null,null,null,null,null,null,null,null,null,null,null,null,null,null,null,null,null,null,null,null,null,null,null,null,null,null,null,null,null,{"$f":"IF(AND(AP229>0,AQ229>0),AP229,0)","v":{"$error":"#N/A"}},0,{"$f":"IF(AND(AP229=38,$AN$4>=75,$AN$4<=80),\"Dbl.\"&AP229&\"G\",0)","v":{"$error":"#N/A"}},null,null,{"$error":"#N/A"},0,{"$f":"IF(AND(AU229=38,$AS$4>=75,$AS$4<=80),\"Dbl.\"&AU229&\"G\",0)","v":{"$error":"#N/A"}}]

{"sheet":"CMR","index":3,"n_rows":138,"n_cols":16,"rows_kept":138,"cut":false,"hidden":true,"merged":[[106,11,106,12],[114,8,114,9],[115,8,115,9],[117,8,117,10],[122,11,122,12],[123,8,123,9],[107,4,107,5],[123,4,123,5],[136,1,136,3],[137,1,137,3],[115,1,115,2],[116,1,116,2],[118,1,118,3],[119,1,119,3],[131,1,131,2],[132,1,132,2],[120,1,120,3],[121,1,121,3],[134,1,134,3],[135,1,135,3],[81,18,81,19],[102,8,102,10],[95,15,95,17],[95,8,95,10],[81,11,81,12],[89,8,89,9],[90,8,90,9],[92,8,92,10],[94,15,94,17],[89,15,89,16],[90,15,90,16],[92,15,92,17],[93,15,93,17],[77,15,77,17],[78,15,78,17],[79,15,79,17],[103,8,103,10],[104,8,104,10],[97,11,97,12],[98,8,98,9],[99,8,99,9],[101,8,101,10],[76,15,76,17],[47,15,47,17],[49,18,49,19],[57,15,57,16],[58,15,58,16],[74,15,74,16],[63,15,63,17],[65,18,65,19],[73,15,73,16],[60,15,60,17],[1,18,1,19],[9,15,9,16],[10,15,10,16],[31,15,31,17],[25,15,25,16],[30,15,30,17],[26,15,26,16],[45,15,45,17],[46,15,46,17],[41,15,41,16],[17,18,17,19],[33,18,33,19],[12,1,12,3],[13,1,13,3],[14,1,14,3],[25,8,25,9],[26,1,26,2],[61,15,61,17],[62,15,62,17],[42,15,42,16],[44,15,44,17],[33,11,33,12],[41,8,41,9],[42,8,42,9],[44,8,44,10],[31,8,31,10],[47,8,47,10],[49,4,49,5],[26,8,26,9],[28,8,28,10],[33,4,33,5],[44,1,44,3],[15,15,15,17],[28,15,28,17],[29,15,29,17],[13,8,13,10],[29,8,29,10],[1,11,1,12],[9,8,9,9],[10,8,10,9],[12,8,12,10],[30,8,30,10],[14,8,14,10],[15,8,15,10],[17,11,17,12],[65,11,65,12],[62,8,62,10],[63,8,63,10],[49,11,49,12],[62,1,62,3],[41,1,41,2],[63,1,63,3],[47,1,47,3],[61,1,61,3],[42,1,42,2],[65,4,65,5],[58,1,58,2],[46,1,46,3],[57,1,57,2],[46,8,46,10],[45,8,45,10],[57,8,57,9],[58,8,58,9],[1,4,1,5],[17,4,17,5],[15,1,15,3],[60,1,60,3],[31,1,31,3],[25,1,25,2],[9,1,9,2],[10,1,10,2],[30,1,30,3],[45,1,45,3],[28,1,28,3],[29,1,29,3],[79,1,79,3],[79,8,79,10],[92,1,92,3],[93,1,93,3],[60,8,60,10],[61,8,61,10],[94,1,94,3],[78,1,78,3],[73,1,73,2],[73,8,73,9],[74,1,74,2],[74,8,74,9],[78,8,78,10],[76,8,76,10],[127,8,127,10],[128,8,128,10],[129,8,129,10],[118,8,118,10],[119,8,119,10],[120,8,120,10],[124,8,124,9],[126,8,126,10],[76,1,76,3],[105,1,105,3],[97,3,97,4],[102,1,102,3],[103,1,103,3],[99,1,99,2],[100,1,100,2],[104,1,104,3],[81,4,81,5],[89,1,89,2],[90,1,90,2],[95,1,95,3],[77,1,77,3],[77,8,77,10],[93,8,93,10],[94,8,94,10]]}
[]
[null,null,"W",null,"3R10A",null,null,null,null,"W",null,"S140, S144, S146",null,null,null,{"$f":"Frame_Height-MR","v":0}]
[null,null,{"$f":"IF(TYPE=1,$C$2,IF(TYPE= \"\",$C$2,\" \"))","v":"W"},1,{"$f":"Frame_Width/2","v":0},{"$f":"TRUNC($E$3*16+0.5)/16","v":0},null,null,null,{"$f":"IF(TYPE=1,$J$2,IF(TYPE= \"\",$J$2,\" \"))","v":"W"},1,{"$f":"Frame_Height/2","v":0},{"$f":"TRUNC($L$3*16+0.5)/16","v":0}]
[null,null,null,2,{"$f":"CEILING(((Frame_Width/5-0.093)*3-0.03125),0.0625)","v":-0.25},{"$f":"TRUNC($E4*16+0.5)/16","v":-0.1875},5,null,null,{"$f":"IF(TYPE=5,$J$2,IF(TYPE=2,IF(Frame_Height>=54.5,IF(Frame_Height<72.5,$J$2,\"\"),\"\"),\"\"))","v":""},2,{"$f":"CEILING(((Frame_Height/3-0.22)*2-0.03125),0.0625)","v":-0.4375},{"$f":"TRUNC($L$4*16+0.5)/16","v":-0.375},5]
[null,null,null,null,{"$f":"TRUNC((Frame_Width/3-0.22)*32+0.5)/16","v":-0.375},{"$f":"TRUNC($E$5*16+0.5)/16","v":-0.3125},6,null,null,{"$f":"IF(TYPE=6,$J$2,IF(AND(TYPE=2,OR(Frame_Height<54.5,Frame_Height>=72.5)),$J$2,\"\"))","v":""},null,{"$f":"TRUNC((Frame_Height/5-0.093)*32+0.5)/16","v":-0.125},{"$f":"TRUNC($L$5*16+0.5)/16","v":-6.25E-2},6]
[null,null,null,3,{"$f":"TRUNC((Frame_Width/5+0.156)*32+0.5)/16","v":0.3125},{"$f":"TRUNC($E$6*16+0.5)/16","v":0.3125},7,null,null,{"$f":"IF(TYPE=7,$J$2,IF(TYPE=3,IF(Frame_Height>=54.5,IF(Frame_Height<72.5,$J$2,\"\"),\"\"),\"\"))","v":""},3,{"$f":"TRUNC((Frame_Height/3+0.44)*32+0.5)/16","v":0.875},{"$f":"TRUNC($L$6*16+0.5)/16","v":0.875},7]
[null,null,null,null,{"$f":"TRUNC((Frame_Width/3+0.44)*16+0.5)/16","v":0.4375},{"$f":"TRUNC($E$7*16+0.5)/16","v":0.4375},8,null,null,{"$f":"IF(TYPE=8,$J$2,IF(AND(TYPE=3,OR(Frame_Height<54.5,Frame_Height>=72.5)),$J$2,\"\"))","v":""},null,{"$f":"TRUNC((Frame_Height/5+0.156)*16+0.5)/16","v":0.125},{"$f":"TRUNC($L$7*16+0.5)/16","v":0.125},8]
[null,null,{"$f":"IF(TYPE=2,$C$2,\"\")","v":""},4,{"$f":"CMR","v":0},{"$f":"TRUNC($E$8*16+0.5)/16","v":0},null,null,null,{"$f":"IF(TYPE=4,$J$2,\"\")","v":""},4,{"$f":"CMR","v":0},{"$f":"TRUNC($L$8*16+0.5)/16","v":0}]
[]
[null,"Dim.,\"D\"",null,"=",{"$f":"IF(C3=C2,F3,IF(C4=C2,F4,IF(C5=C2,F5,IF(C6=C2,F6,IF(C7=C2,F7,IF(C8=C2,F8,F3))))))","v":0},null,null,null,"Dim.,\"D\"",null,"=",{"$f":"IF(EXTSELECT=2,L26,IF($J$3=$J$2,$M$3,IF($J$4=$J$2,$M$4,IF($J$5=$J$2,$M$5,IF($J$6=$J$2,$M$6,IF($J$7=$J$2,$M$7,IF($J$8=$J$2,$M$8,$M$3)))))))","v":0}]
[null,"Dim.,\"C\"",null,"=",{"$f":"Frame_Width-E10","v":0},null,null,null,"Dim.,\"C\"",null,"=",{"$f":"IF(EXTSELECT=5,L27,IF(EXTSELECT=2,CDIM03A0,Frame_Height-$L$10))","v":0}]
[]
[null,"Ext. Glass Width",null,null,{"$f":"TRUNC((E10-2.6875)*16+0.5)/16","v":-2.625},null,null,null,"Top Glass Width",null,null,{"$f":"TRUNC((Frame_Width-2*EXT)*16+0.5)/16","v":0},"Glass R:",{"$f":"IF(ModelNo=\"S146\",(((Frame_Height-LEG)/2)+(((Frame_Width*2)^2)/(8*(Frame_Height-LEG))))-EXT,(((Frame_Height-LEG)/2)+((Frame_Width^2)/(8*(Frame_Height-LEG))))-EXT)","v":{"$error":"#DIV/0!"}},"F",{"$f":"IF(Frame_Width>=(Frame_Height-LEG),2*(ASIN((EXT*2)/(2*N13))),2*(ASIN(((N13-(Frame_Width-2*EXT))*2)/(2*N13))))","v":{"$error":"#DIV/0!"}}]
[null,"Int. Glass Width",null,null,{"$f":"TRUNC((E11-2.625)*16+0.5)/16","v":-2.5625},null,null,null,"Bottom Glass Width",null,null,{"$f":"IF(EXTSELECT=5,$L$30,IF(EXTSELECT=2,$E$136,TRUNC((Frame_Width-4)*16+0.5)/16))","v":-3.9375}," Glass h:",{"$f":"IF(ModelNo=\"S146\",N13-(SQRT((4*N13^2)-((Frame_Width-(EXT*2))*2)^2)/2),N13-(SQRT((4*N13^2)-(Frame_Width-(EXT*2))^2)/2))","v":{"$error":"#DIV/0!"}},"d",{"$f":"N13*COS(P13/2)","v":{"$error":"#DIV/0!"}}]
[null,"Ext. Glass Height",null,null,{"$f":"TRUNC((Frame_Height-2.875)*16+0.5)/16","v":-2.8125},null,null,null,"Top Glass Height",null,null,{"$f":"IF(ModelNo=\"S146\",Frame_Height-($L$11+$N$15+EXT+P15),Frame_Height-($L$11+N15+EXT))","v":-0.91979999999999995},null,{"$f":"IF(EXTSELECT=5,0.5137,IF(EXTSELECT=2,0.264,0.9198))","v":0.91979999999999995},"h",{"$f":"N13-P14","v":{"$error":"#DIV/0!"}}]
[null,"Int. Glass Height",null,null,{"$f":"IF(Frame_Height<16.01,(TRUNC((Frame_Height-5.8125)*16+0.5)/16),IF(Frame_Height>16.01,(TRUNC((Frame_Height-5.75)*16+0.5)/16)))","v":-5.75},null,null,null,"Bottom Glass Height",null,null,{"$f":"IF(EXTSELECT=5,$L$32,IF(EXTSELECT=2,$E$138,TRUNC(($L$11-1.5625)*16+0.5)/16))","v":-1.5},"Top Glass Leg:",{"$f":"L15-N14","v":{"$error":"#DIV/0!"}}]
[]
[null,null,"W",null,"L201",null,null,null,null,"W",null,"02A0"]
[null,null,{"$f":"IF(TYPE=1,$C$2,IF(TYPE= \"\",$C$2,\" \"))","v":"W"},1,{"$f":"Frame_Height/2","v":0},{"$f":"TRUNC($E$19*32+0.5)/32","v":0},null,null,null,{"$f":"IF(TYPE=1,$J$18,IF(TYPE= \"\",$J$18,\" \"))","v":"W"},1,{"$f":"Frame_Height/2","v":0},{"$f":"TRUNC($L$19*16+0.5)/16","v":0}]
[null,null,null,2,{"$f":"INT((Frame_Height/5)*48+0.5)/16","v":0},{"$f":"TRUNC($E20*16+0.5)/16","v":0},5,null,null,{"$f":"IF(TYPE=5,$J$18,IF(TYPE=2,IF(Frame_Height>=54.5,IF(Frame_Height<72.5,$J$18,\"\"),\"\"),\"\"))","v":""},2,{"$f":"INT((Frame_Height/5)*48+0.5)/16","v":0},{"$f":"TRUNC($L$20*16+0.5)/16","v":0},5]
[null,null,null,null,{"$f":"INT((Frame_Height/3-0.22)*32+0.5)/16","v":-0.4375},{"$f":"TRUNC($E$21*16+0.5)/16","v":-0.375},6,null,null,{"$f":"IF(TYPE=6,$J$18,IF(AND(TYPE=2,OR(Frame_Height<54.5,Frame_Height>=72.5)),$J$18,\"\"))","v":""},null,{"$f":"INT((Frame_Height/3-0.22)*32+0.5)/16","v":-0.4375},{"$f":"TRUNC($L$21*16+0.5)/16","v":-0.375},6]
[null,null,null,3,{"$f":"INT((Frame_Height/5+0.55)*32+0.5)/16","v":1.125},{"$f":"TRUNC($E$22*16+0.5)/16","v":1.125},7,null,null,{"$f":"IF(TYPE=7,$J$18,IF(TYPE=3,IF(Frame_Height>=54.5,IF(Frame_Height<72.5,$J$18,\"\"),\"\"),\"\"))","v":""},3,{"$f":"INT((Frame_Height/5+0.55)*32+0.5)/16","v":1.125},{"$f":"TRUNC($L$22*16+0.5)/16","v":1.125},7]
[null,null,null,null,{"$f":"INT((Frame_Height/3+1.4)*16+0.5)/16","v":1.375},{"$f":"TRUNC($E$23*16+0.5)/16","v":1.375},8,null,null,{"$f":"IF(TYPE=8,$J$18,IF(AND(TYPE=3,OR(Frame_Height<54.5,Frame_Height>=72.5)),$J$18,\"\"))","v":""},null,{"$f":"INT((Frame_Height/3+1.4)*16+0.5)/16","v":1.375},{"$f":"TRUNC($L$23*16+0.5)/16","v":1.375},8]
[null,null,{"$f":"IF(TYPE=2,$C$2,\"\")","v":""},4,{"$f":"CMR","v":0},{"$f":"TRUNC($E$24*16+0.5)/16","v":0},null,null,null,{"$f":"IF(TYPE=4,$J$18,\"\")","v":""},4,{"$f":"CMR","v":0},{"$f":"TRUNC($L$24*16+0.5)/16","v":0}]
[]
[null,"Dim.,\"D\"",null,"=",{"$f":"TRUNC((IF($C$19=$C$18,$F$19,IF($C$20=$C$18,$F$20,IF($C$21=$C$18,$F$21,IF($C$22=$C$18,$F$22,IF($C$23=$C$18,$F$23,IF($C$24=$C$18,$F$24,$F$19)))))))*32+0.5)/32","v":0},null,null,null,"Dim.,\"D\"",null,"=",{"$f":"IF($J$19=$J$18,$M$19,IF($J$20=$J$18,$M$20,IF($J$21=$J$18,$M$21,IF($J$22=$J$18,$M$22,IF($J$23=$J$18,$M$23,IF($J$24=$J$18,$M$24,$M$19))))))","v":0}]
[null,"Dim.,\"C\"",null,"=",{"$f":"TRUNC((Frame_Height-$E$26)*32+0.5)/32","v":0},null,null,null,"Dim.,\"C\"",null,"=",{"$f":"Frame_Height-$L$26","v":0}]
[]
[null,"Top Glass Width",null,null,{"$f":"TRUNC((Frame_Width-4.9375)*16+0.5)/16","v":-4.875},null,null,null,"Top Glass Width",null,null,{"$f":"TRUNC((Frame_Width-3.4375)*16+0.5)/16","v":-3.375}]
[null,"Bottom Glass Width",null,null,{"$f":"TRUNC((Frame_Width-3.9375)*16+0.5)/16","v":-3.875},null,null,null,"Bottom Glass Width",null,null,{"$f":"TRUNC((Frame_Width-3.90625)*16+0.5)/16","v":-3.875}]
[null,"Top Glass Height",null,null,{"$f":"TRUNC(($E$26-3.21875)*32+0.5)/32","v":-3.1875},null,null,null,"Top Glass Height",null,null,{"$f":"TRUNC(($L$26-2.25)*16+0.5)/16","v":-2.1875}]
[null,"Bottom Glass Height",null,null,{"$f":"TRUNC(($E$27-2.21875)*32+0.5)/32","v":-2.1875},null,null,null,"Bottom Glass Height",null,null,{"$f":"TRUNC(($L$27-2.40625)*16+0.5)/16","v":-2.375}]
[]
[null,null,"W",null,"3R21A",null,null,null,null,"W",null,"3R40A"]
[null,null,{"$f":"IF(TYPE=1,$C$2,IF(TYPE= \"\",$C$2,\" \"))","v":"W"},1,{"$f":"Frame_Width/2","v":0},{"$f":"TRUNC($E$3*16+0.5)/16","v":0},null,null,null,{"$f":"IF(TYPE=1,$C$2,IF(TYPE= \"\",$C$2,\" \"))","v":"W"},1,{"$f":"Frame_Height/2","v":0},{"$f":"TRUNC(L35*32+0.5)/32","v":0}]
[null,null,null,2,{"$f":"CEILING(((Frame_Width/5-0.093)*3-0.03125),0.0625)","v":-0.25},{"$f":"TRUNC($E36*16+0.5)/16","v":-0.1875},5,null,null,null,2,{"$f":"INT((Frame_Height/5)*48+0.5)/16","v":0},{"$f":"TRUNC(L36*16+0.5)/16","v":0},5]
[null,null,null,null,{"$f":"TRUNC((Frame_Width/3-0.22)*32+0.5)/16","v":-0.375},{"$f":"TRUNC($E$5*16+0.5)/16","v":-0.3125},6,null,null,null,null,{"$f":"INT((Frame_Height/3-0.22)*32+0.5)/16","v":-0.4375},{"$f":"TRUNC(L37*16+0.5)/16","v":-0.375},6]
[null,null,null,3,{"$f":"TRUNC((Frame_Width/5+0.156)*32+0.5)/16","v":0.3125},{"$f":"TRUNC($E$6*16+0.5)/16","v":0.3125},7,null,null,null,3,{"$f":"INT((Frame_Height/5+0.55)*32+0.5)/16","v":1.125},{"$f":"TRUNC(L38*16+0.5)/16","v":1.125},7]
[null,null,null,null,{"$f":"TRUNC((Frame_Width/3+0.44)*16+0.5)/16","v":0.4375},{"$f":"TRUNC($E$7*16+0.5)/16","v":0.4375},8,null,null,null,null,{"$f":"INT((Frame_Height/3+1.4)*16+0.5)/16","v":1.375},{"$f":"TRUNC(L39*16+0.5)/16","v":1.375},8]
[null,null,{"$f":"IF(TYPE=2,$C$2,\"\")","v":""},4,{"$f":"CMR","v":0},{"$f":"TRUNC($E$8*16+0.5)/16","v":0},null,null,null,{"$f":"IF(TYPE=2,$C$2,\"\")","v":""},4,{"$f":"CMR","v":0},{"$f":"TRUNC(L40*16+0.5)/16","v":0}]
[]
[null,"Dim.,\"D\"",null,"=",{"$f":"IF(C35=C34,F35,IF(C36=C34,F36,IF(C37=C34,F37,IF(C38=C34,F38,IF(C39=C34,F39,IF(C40=C34,F40,F35))))))","v":0},null,null,null,"Dim.,\"D\"",null,"=",{"$f":"TRUNC((IF(J35=J34,M35,IF(J36=J34,M36,IF(J37=J34,M37,IF(J38=J34,M38,IF(J39=J34,M39,IF(J40=J34,M40,M35)))))))*32+0.5)/32","v":0}]
[null,"Dim.,\"C\"",null,"=",{"$f":"Frame_Width-E42","v":0},null,null,null,"Dim.,\"C\"",null,"=",{"$f":"TRUNC((Frame_Height-L42)*32+0.5)/32","v":0}]
[]
[null,"Ext. Glass Width",null,null,{"$f":"TRUNC((E42-2.6875)*16+0.5)/16","v":-2.625},null,null,null,"Top Glass Width",null,null,{"$f":"TRUNC((Frame_Width-2.875)*16+0.5)/16","v":-2.8125}]
[null,"Int. Glass Width",null,null,{"$f":"TRUNC((E43-2.625)*16+0.5)/16","v":-2.5625},null,null,null,"Bottom Glass Width",null,null,{"$f":"TRUNC((Frame_Width-5.625)*16+0.5)/16","v":-5.5625}]
[null,"Ext. Glass Height",null,null,{"$f":"TRUNC((Frame_Height-2.875)*16+0.5)/16","v":-2.8125},null,null,null,"Top Glass Height",null,null,{"$f":"TRUNC((L42-2.6875)*32+0.5)/32","v":-2.65625}]
[null,"Int. Glass Height",null,null,{"$f":"TRUNC((Frame_Height-5.625)*16+0.5)/16","v":-5.5625},null,null,null,"Bottom Glass Height",null,null,{"$f":"TRUNC((L43-2.625)*32+0.5)/32","v":-2.59375}]
[]
[null,null,"W",null,"3R10C",null,null,null,null,"W",null,"3R21C"]
[null,null,{"$f":"IF(TYPE=1,$C$2,IF(TYPE= \"\",$C$2,\" \"))","v":"W"},1,{"$f":"(Frame_Width/4)+1.411","v":1.411},{"$f":"TRUNC(E51*16+0.5)/16","v":1.4375},null,null,null,{"$f":"IF(TYPE=1,$C$2,IF(TYPE= \"\",$C$2,\" \"))","v":"W"},1,{"$f":"(Frame_Width/4)+1.411","v":1.411},{"$f":"TRUNC(L51*16+0.5)/16","v":1.4375}]
[null,null,null,2,null,null,null,null,null,null,2]
[]
[null,null,null,3,null,null,null,null,null,null,3]
[]
[null,null,{"$f":"IF(TYPE=2,$C$2,\"\")","v":""},4,{"$f":"CMR","v":0},{"$f":"TRUNC(E56*16+0.5)/16","v":0},null,null,null,{"$f":"IF(TYPE=2,$C$2,\"\")","v":""},4,{"$f":"CMR","v":0},{"$f":"TRUNC(L56*16+0.5)/16","v":0}]
[]
[null,"Dim.,\"D\"",null,"=",{"$f":"IF(C51=C50,F51,IF(C52=C50,F52,IF(C53=C50,F53,IF(C54=C50,F54,IF(C55=C50,F55,IF(C56=C50,F56,F51))))))","v":1.4375},null,null,null,"Dim.,\"D\"",null,"=",{"$f":"IF(J51=J50,M51,IF(J52=J50,M52,IF(J53=J50,M53,IF(J54=J50,M54,IF(J55=J50,M55,IF(J56=J50,M56,M51))))))","v":1.4375}]
[null,"Dim.,\"C\"",null,"=",{"$f":"Frame_Width-(E58*2)","v":-2.875},null,null,null,"Dim.,\"C\"",null,"=",{"$f":"Frame_Width-(L58*2)","v":-2.875}]
[]
[null,"Int. Glass Height",null,null,{"$f":"TRUNC((Frame_Height-5.75)*16+0.5)/16","v":-5.6875},null,null,null,"Int. Glass Height",null,null,{"$f":"TRUNC((Frame_Height-5.625)*16+0.5)/16","v":-5.5625}]
[null,"Ext. Glass Height",null,null,{"$f":"TRUNC((Frame_Height-2.875)*16+0.5)/16","v":-2.8125},null,null,null,"Ext. Glass Height",null,null,{"$f":"TRUNC((Frame_Height-2.875)*16+0.5)/16","v":-2.8125}]
[null,"Int. Glass Width",null,null,{"$f":"TRUNC((E58-2.625)*16+0.5)/16","v":-1.125},null,null,null,"Int. Glass Width",null,null,{"$f":"TRUNC((L58-2.625)*16+0.5)/16","v":-1.125}]
[null,"Ext. Glass Width",null,null,{"$f":"TRUNC((E59-2.5625)*16+0.5)/16","v":-5.375},null,null,null,"Ext. Glass Width",null,null,{"$f":"TRUNC((L59-2.5625)*16+0.5)/16","v":-5.375}]
[]
[null,null,"W",null,"8R10A",null,null,null,null,"W",null,"8R21A"]
[null,null,{"$f":"IF(TYPE=1,$C$2,IF(TYPE= \"\",$C$2,\" \"))","v":"W"},1,{"$f":"Frame_Width/2","v":0},{"$f":"TRUNC($E$3*16+0.5)/16","v":0},null,null,null,{"$f":"IF(TYPE=1,$C$2,IF(TYPE= \"\",$C$2,\" \"))","v":"W"},1,{"$f":"Frame_Width/2","v":0},{"$f":"TRUNC($E$3*16+0.5)/16","v":0}]
[null,null,null,2,{"$f":"CEILING(((Frame_Width/5-0.093)*3-0.03125),0.0625)","v":-0.25},{"$f":"TRUNC($E68*16+0.5)/16","v":-0.1875},5,null,null,null,2,{"$f":"CEILING(((Frame_Width/5-0.093)*3-0.03125),0.0625)","v":-0.25},{"$f":"TRUNC($E68*16+0.5)/16","v":-0.1875},5]
[null,null,null,null,{"$f":"TRUNC((Frame_Width/3-0.22)*32+0.5)/16","v":-0.375},{"$f":"TRUNC($E$5*16+0.5)/16","v":-0.3125},6,null,null,null,null,{"$f":"TRUNC((Frame_Width/3-0.22)*32+0.5)/16","v":-0.375},{"$f":"TRUNC($E$5*16+0.5)/16","v":-0.3125},6]
[null,null,null,3,{"$f":"TRUNC((Frame_Width/5+0.156)*32+0.5)/16","v":0.3125},{"$f":"TRUNC($E$6*16+0.5)/16","v":0.3125},7,null,null,null,3,{"$f":"TRUNC((Frame_Width/5+0.156)*32+0.5)/16","v":0.3125},{"$f":"TRUNC($E$6*16+0.5)/16","v":0.3125},7]
[null,null,null,null,{"$f":"TRUNC((Frame_Width/3+0.44)*16+0.5)/16","v":0.4375},{"$f":"TRUNC($E$7*16+0.5)/16","v":0.4375},8,null,null,null,null,{"$f":"TRUNC((Frame_Width/3+0.44)*16+0.5)/16","v":0.4375},{"$f":"TRUNC($E$7*16+0.5)/16","v":0.4375},8]
[null,null,{"$f":"IF(TYPE=2,$C$2,\"\")","v":""},4,{"$f":"CMR","v":0},{"$f":"TRUNC($E$8*16+0.5)/16","v":0},null,null,null,{"$f":"IF(TYPE=2,$C$2,\"\")","v":""},4,{"$f":"CMR","v":0},{"$f":"TRUNC($E$8*16+0.5)/16","v":0}]
[]
[null,"Dim.,\"D\"",null,"=",{"$f":"IF(C67=C66,F67,IF(C68=C66,F68,IF(C69=C66,F69,IF(C70=C66,F70,IF(C71=C66,F71,IF(C72=C66,F72,F67))))))","v":0},null,null,null,"Dim.,\"D\"",null,"=",{"$f":"IF(J67=J66,M67,IF(J68=J66,M68,IF(J69=J66,M69,IF(J70=J66,M70,IF(J71=J66,M71,IF(J72=J66,M72,M67))))))","v":0}]
[null,"Dim.,\"C\"",null,"=",{"$f":"Frame_Width-E74","v":0},null,null,null,"Dim.,\"C\"",null,"=",{"$f":"Frame_Width-L74","v":0}]
[]
[null,"Ext. Glass Width",null,null,{"$f":"TRUNC((E74-3.5)*16+0.5)/16","v":-3.4375},null,null,null,"Ext. Glass Width",null,null,{"$f":"TRUNC((L74-3.5)*16+0.5)/16","v":-3.4375}]
[null,"Int. Glass Width",null,null,{"$f":"TRUNC((E75-3.5)*16+0.5)/16","v":-3.4375},null,null,null,"Int. Glass Width",null,null,{"$f":"TRUNC((L75-3.5)*16+0.5)/16","v":-3.4375}]
[null,"Ext. Glass Height",null,null,{"$f":"TRUNC((Frame_Height-5.875)*16+0.5)/16","v":-5.8125},null,null,null,"Ext. Glass Height",null,null,{"$f":"TRUNC((Frame_Height-5.75)*16+0.5)/16","v":-5.6875}]
[null,"Int. Glass Height",null,null,{"$f":"TRUNC((Frame_Height-5.875)*16+0.5)/16","v":-5.8125},null,null,null,"Int. Glass Height",null,null,{"$f":"TRUNC((Frame_Height-5.75)*16+0.5)/16","v":-5.6875}]
[]
[null,null,"W",null,"3100",null,null,null,null,"W",null,"8R40A"]
[null,null,{"$f":"IF(TYPE=1,$C82,IF(TYPE= \"\",$C82,\" \"))","v":"W"},1,{"$f":"Frame_Height/2","v":0},{"$f":"TRUNC($E83*16+0.5)/16","v":0},null,null,null,{"$f":"IF(TYPE=1,$C$2,IF(TYPE= \"\",$C$2,\" \"))","v":"W"},1,{"$f":"Frame_Height/2","v":0},{"$f":"TRUNC(L83*16+0.5)/16","v":0}]
[null,null,{"$f":"IF(TYPE=5,$C82,IF(TYPE=2,IF(Frame_Height>=54.5,IF(Frame_Height<72.5,$C82,\"\"),\"\"),\"\"))","v":""},2,{"$f":"INT((Frame_Height/5)*16+0.5)/16","v":0},0,5,null,null,null,2,{"$f":"CEILING(((Frame_Height/5-0.24)*3-0.03125),0.0625)","v":-0.75},-0.6875,5]
[null,null,{"$f":"IF(TYPE=6,$C82,IF(AND(TYPE=2,OR(Frame_Height<54.5,Frame_Height>=72.5)),$C82,\"\"))","v":""},null,{"$f":"INT((Frame_Height/3-0.22)*32+0.5)/16","v":-0.4375},-0.375,6,null,null,null,null,{"$f":"TRUNC((Frame_Height/3-0.62)*32+0.5)/16","v":-1.1875},-1.125,6]
[null,null,{"$f":"IF(TYPE=7,$C82,IF(TYPE=3,IF(Frame_Height>=54.5,IF(Frame_Height<72.5,$C82,\"\"),\"\"),\"\"))","v":""},3,{"$f":"INT((Frame_Height/5+0.55)*32+0.5)/16","v":1.125},1.125,7,null,null,null,3,{"$f":"TRUNC((Frame_Height/5+0.38)*32+0.5)/16","v":0.75},0.75,7]
[null,null,{"$f":"IF(TYPE=8,$C82,IF(AND(TYPE=3,OR(Frame_Height<54.5,Frame_Height>=72.5)),$C82,\"\"))","v":""},null,{"$f":"INT((Frame_Height/3+1.4)*16+0.5)/16","v":1.375},1.375,8,null,null,null,null,{"$f":"TRUNC((Frame_Height/3+1.3)*16+0.5)/16","v":1.3125},1.3125,8]
[null,null,{"$f":"IF(TYPE=4,$C82,\"\")","v":""},4,{"$f":"CMR","v":0},0,null,null,null,{"$f":"IF(TYPE=2,$C$2,\"\")","v":""},4,{"$f":"CMR","v":0},0]
[]
[null,"Dim.,\"D\"",null,"=",{"$f":"IF(C83=C82,F83,IF(C84=C82,F84,IF(C85=C82,F85,IF(C86=C82,F86,IF(C87=C82,F87,IF(C88=C82,F88,F83))))))","v":0},null,null,null,"Dim.,\"D\"",null,"=",{"$f":"IF(J83=J82,M83,IF(J84=J82,M84,IF(J85=J82,M85,IF(J86=J82,M86,IF(J87=J82,M87,IF(J88=J82,M88,M83))))))","v":0}]
[null,"Dim.,\"C\"",null,"=",{"$f":"Frame_Height-$E90","v":0},null,null,null,"Dim.,\"C\"",null,"=",{"$f":"Frame_Height-L90","v":0}]
[]
[null,"Top Glass Width",null,null,{"$f":"TRUNC((Frame_Width-4.03125)*32+0.5)/32","v":-4},null,null,null,"Top Glass Width",null,null,{"$f":"TRUNC((Frame_Width-5.75)*16+0.5)/16","v":-5.6875}]
[null,"Bottom Glass Width",null,null,{"$f":"TRUNC((Frame_Width-4.76815)*32+0.5)/32","v":-4.75},null,null,null,"Bottom Glass Width",null,null,{"$f":"TRUNC((Frame_Width-5.75)*16+0.5)/16","v":-5.6875}]
[null,"Top Glass Height",null,null,{"$f":"TRUNC(($E90-3.0625)*32+0.5)/32","v":-3.03125},null,null,null,"Top Glass Height",null,null,{"$f":"TRUNC((L90-3.5)*16+0.5)/16","v":-3.4375}]
[null,"Bottom Glass Height",null,null,{"$f":"TRUNC(($E91-3.00375)*32+0.5)/32","v":-2.96875},null,null,null,"Bottom Glass Height",null,null,{"$f":"TRUNC((L91-3.5)*16+0.5)/16","v":-3.4375}]
[]
[null,null,null,3102,null,null,null,null,null,null,null,"V100"]
[null,null,null,null,null,null,null,null,"Dim.,\"D\"",null,"=",{"$f":"IF(TYPE=1,(Frame_Height/2),IF(TYPE=2,CMR))","v":0}]
[null,"Dim.,\"D\"",null,"=",{"$f":"IF(TYPE=1,(Frame_Width/2),IF(TYPE=4,CMR))","v":0},null,null,null,"Dim.,\"C\"",null,"=",{"$f":"Frame_Height-L99","v":0}]
[null,"Dim.,\"C\"",null,"=",{"$f":"Frame_Width-$E100","v":0}]
[null,null,null,null,null,null,null,null,"Top Glass Width",null,null,{"$f":"TRUNC((Frame_Width-3.5)*32+0.5)/32","v":-3.46875}]
[null,"Fixed Glass Width",null,null,{"$f":"$E$100-3.09375","v":-3.09375},null,null,null,"Bottom Glass Width",null,null,{"$f":"TRUNC(((TRUNC((Frame_Width-2.188)*32+0.5)/32)-1.3125)*32+0.5)/32","v":-3.4375}]
[null,"Sash Glass Width",null,null,{"$f":"(TRUNC(($E$101-0.7)*16+0.5)/16)-1.625","v":-2.25},null,null,null,"Top Glass Height",null,null,{"$f":"TRUNC((L99-2.157)*32+0.5)/32","v":-2.125}]
[null,"Fixed Glass Height",null,null,{"$f":"Frame_Height-5.09375","v":-5.09375},null,null,null,"Bottom Glass Height",null,null,{"$f":"TRUNC(((TRUNC(((L100-1.0625)*16+0.5))/16)-1.312)*32+0.5)/32","v":-2.28125}]
[null,"Sash Glass Height",null,null,{"$f":"(TRUNC((Frame_Height-3.4)*16+0.5)/16)-1.625","v":-4.9375}]
[null,null,null,null,null,null,null,null,null,"W",null,"V101"]
[null,null,"W",null,"3001",null,null,null,null,{"$f":"IF(TYPE=1,$J107,IF(TYPE=\"\",$J107,\" \"))","v":"W"},1,{"$f":"Frame_Height/2","v":0},{"$f":"TRUNC($L108*16+0.5)/16","v":0}]
[null,null,{"$f":"IF(TYPE=1,C108,IF(TYPE= \"\",C108,\" \"))","v":"W"},1,{"$f":"Frame_Height/2","v":0},{"$f":"TRUNC(E109*32+0.5)/32","v":0},null,null,null,{"$f":"IF(TYPE=5,$J107,IF(TYPE=2,IF(Frame_Height>=54.5,IF(Frame_Height<72.5,$J107,\"\"),\"\"),\"\"))","v":""},2,{"$f":"INT((Frame_Height/5)*48+0.5)/16","v":0},0,5]
[null,null,{"$f":"IF(TYPE=5,C108,IF(TYPE=2,IF(Frame_Height>=54.5,IF(Frame_Height<72.5,C108,\"\"),\"\"),\"\"))","v":""},2,{"$f":"INT((Frame_Height/5)*48+0.5)/16","v":0},{"$f":"TRUNC(E110*16+0.5)/16","v":0},5,null,null,{"$f":"IF(TYPE=6,$J107,IF(AND(TYPE=2,OR(Frame_Height<54.5,Frame_Height>=72.5)),$J107,\"\"))","v":""},null,{"$f":"INT((Frame_Height/3-0.22)*32+0.5)/16","v":-0.4375},-0.375,6]
[null,null,{"$f":"IF(TYPE=6,C108,IF(AND(TYPE=2,OR(Frame_Height<54.5,Frame_Height>=72.5)),C108,\"\"))","v":""},null,{"$f":"INT((Frame_Height/3-0.22)*32+0.5)/16","v":-0.4375},{"$f":"TRUNC(E111*16+0.5)/16","v":-0.375},6,null,null,{"$f":"IF(TYPE=7,$J107,IF(TYPE=3,IF(Frame_Height>=54.5,IF(Frame_Height<72.5,$J107,\"\"),\"\"),\"\"))","v":""},3,{"$f":"INT((Frame_Height/5+0.55)*32+0.5)/16","v":1.125},1.125,7]
[null,null,{"$f":"IF(TYPE=7,C108,IF(TYPE=3,IF(Frame_Height>=54.5,IF(Frame_Height<72.5,C108,\"\"),\"\"),\"\"))","v":""},3,{"$f":"INT((Frame_Height/5+0.55)*32+0.5)/16","v":1.125},{"$f":"TRUNC(E112*16+0.5)/16","v":1.125},7,null,null,{"$f":"IF(TYPE=8,$J107,IF(AND(TYPE=3,OR(Frame_Height<54.5,Frame_Height>=72.5)),$J107,\"\"))","v":""},null,{"$f":"INT((Frame_Height/3+1.4)*16+0.5)/16","v":1.375},1.375,8]
[null,null,{"$f":"IF(TYPE=8,C108,IF(AND(TYPE=3,OR(Frame_Height<54.5,Frame_Height>=72.5)),C108,\"\"))","v":""},null,{"$f":"INT((Frame_Height/3+1.4)*16+0.5)/16","v":1.375},{"$f":"TRUNC(E113*16+0.5)/16","v":1.375},8,null,null,{"$f":"IF(TYPE=4,$J107,\"\")","v":""},4,{"$f":"CMR","v":0},0]
[null,null,{"$f":"IF(TYPE=4,C108,\"\")","v":""},4,{"$f":"CMR","v":0},{"$f":"TRUNC(E114*16+0.5)/16","v":0}]
[null,null,null,null,null,null,null,null,"Dim.,\"D\"",null,"=",{"$f":"IF($J108=$J107,$M108,IF($J109=$J107,$M109,IF($J110=$J107,$M110,IF($J111=$J107,$M111,IF($J112=$J107,$M112,IF($J113=$J107,$M113))))))","v":0}]
[null,"Dim.,\"D\"",null,"=",{"$f":"TRUNC((IF(C109=C108,F109,IF(C110=C108,F110,IF(C111=C108,F111,IF(C112=C108,F112,IF(C113=C108,F113,IF(C114=C108,F114,F109)))))))*32+0.5)/32","v":0},null,null,null,"Dim.,\"C\"",null,"=",{"$f":"Frame_Height-$L115","v":0}]
[null,"Dim.,\"C\"",null,"=",{"$f":"TRUNC((Frame_Height-E116)*32+0.5)/32","v":0}]
[null,null,null,null,null,null,null,null,"Top Glass Width",null,null,{"$f":"TRUNC((Frame_Width-4.75)*16+0.5)/16","v":-4.6875}]
[null,"Top Glass Width",null,null,{"$f":"TRUNC((Frame_Width-5.8125)*16+0.5)/16","v":-5.75},null,null,null,"Bottom Glass Width",null,null,{"$f":"TRUNC((Frame_Width-3.5)*16+0.5)/16","v":-3.4375}]
[null,"Bottom Glass Width",null,null,{"$f":"TRUNC((Frame_Width-4.8125)*16+0.5)/16","v":-4.75},null,null,null,"Top Glass Height",null,null,{"$f":"TRUNC(($L115-2.9375)*16+0.5)/16","v":-2.875}]
[null,"Top Glass Height",null,null,{"$f":"TRUNC((E116-3.25)*32+0.5)/32","v":-3.21875},null,null,null,"Bottom Glass Height",null,null,{"$f":"TRUNC(($L116-1.6875)*16+0.5)/16","v":-1.625}]
[null,"Bottom Glass Height",null,null,{"$f":"TRUNC((E117-2.25)*32+0.5)/32","v":-2.21875}]
[null,null,null,null,null,null,null,null,null,null,null,"V200"]
[null,null,"W",null,"03A0",null,null,null,"Dim.,\"D\"",null,"=",{"$f":"IF(TYPE=1,(Frame_Height/2),IF(TYPE=2,CMR))","v":0}]
[null,null,{"$f":"IF(TYPE=1,C124,IF(TYPE= \"\",C124,\" \"))","v":"W"},1,{"$f":"Frame_Height/2","v":0},{"$f":"TRUNC(E125*32+0.5)/32","v":0},null,null,"Dim.,\"C\"",null,"=",{"$f":"Frame_Height-L124","v":0}]
[null,null,{"$f":"IF(TYPE=5,C124,IF(TYPE=2,IF(Frame_Height>=54.5,IF(Frame_Height<72.5,C124,\"\"),\"\"),\"\"))","v":""},2,{"$f":"INT((Frame_Height/5)*48+0.5)/16","v":0},{"$f":"TRUNC(E126*16+0.5)/16","v":0},5]
[null,null,{"$f":"IF(TYPE=6,C124,IF(AND(TYPE=2,OR(Frame_Height<54.5,Frame_Height>=72.5)),C124,\"\"))","v":""},null,{"$f":"INT((Frame_Height/3-0.22)*32+0.5)/16","v":-0.4375},{"$f":"TRUNC(E127*16+0.5)/16","v":-0.375},6,null,"Top Glass Width",null,null,{"$f":"TRUNC((Frame_Width-3.5625)*32+0.5)/32","v":-3.53125}]
[null,null,{"$f":"IF(TYPE=7,C124,IF(TYPE=3,IF(Frame_Height>=54.5,IF(Frame_Height<72.5,C124,\"\"),\"\"),\"\"))","v":""},3,{"$f":"INT((Frame_Height/5+0.55)*32+0.5)/16","v":1.125},{"$f":"TRUNC(E128*16+0.5)/16","v":1.125},7,null,"Bottom Glass Width",null,null,{"$f":"TRUNC(((TRUNC((Frame_Width-2.1875)*32+0.5)/32)-1.375)*32+0.5)/32","v":-3.5}]
[null,null,{"$f":"IF(TYPE=8,C124,IF(AND(TYPE=3,OR(Frame_Height<54.5,Frame_Height>=72.5)),C124,\"\"))","v":""},null,{"$f":"INT((Frame_Height/3+1.4)*16+0.5)/16","v":1.375},{"$f":"TRUNC(E129*16+0.5)/16","v":1.375},8,null,"Top Glass Height",null,null,{"$f":"TRUNC((L124-2.25)*32+0.5)/32","v":-2.21875}]
[null,null,{"$f":"IF(TYPE=4,C124,\"\")","v":""},4,{"$f":"CMR","v":0},{"$f":"TRUNC(E130*16+0.5)/16","v":0},null,null,"Bottom Glass Height",null,null,{"$f":"TRUNC(((TRUNC(((L125-0.8125)*32+0.5))/32-0.0625)-1.4375)*32+0.5)/32","v":-2.25}]
[]
[null,"Dim.,\"D\"",null,"=",{"$f":"TRUNC((IF(C125=C124,F125,IF(C126=C124,F126,IF(C127=C124,F127,IF(C128=C124,F128,IF(C129=C124,F129,IF(C130=C124,F130,F125)))))))*32+0.5)/32","v":0}]
[null,"Dim.,\"C\"",null,"=",{"$f":"TRUNC((Frame_Height-E132)*32+0.5)/32","v":0}]
[]
[null,"Top Glass Width",null,null,{"$f":"TRUNC((Frame_Width-4.75)*16+0.5)/16","v":-4.6875}]
[null,"Bottom Glass Width",null,null,{"$f":"TRUNC((Frame_Width-4.8125)*16+0.5)/16","v":-4.75}]
[null,"Top Glass Height",null,null,{"$f":"TRUNC((E132-2.625)*32+0.5)/32","v":-2.59375}]
[null,"Bottom Glass Height",null,null,{"$f":"TRUNC((E133-2.75)*32+0.5)/32","v":-2.71875}]