{"text_format":"1","workbook":"xlsx","n_sheets":4,"sheets":["Form","Data","Balance","CMR"],"not_rendered":{"charts":0,"images":1,"macros":1,"external_links":0,"defined_names":159,"comments":0,"pivot_tables":0},"unopened":[],"bounds":{"document_bytes":16777216,"sheet_cells":100000,"rows_first":2000,"rows_last":500,"rows_between":2000,"halvings":0,"cell_chars":16384,"cell_head_chars":4096},"cells_cut":0,"cells_raw":0,"read":"whole","date_system":"1900"}

{"sheet":"Form","index":0,"n_rows":24,"n_cols":16,"rows_kept":24,"cut":false,"hidden":false,"merged":[[15,13,16,15],[13,14,13,15],[28,12,28,13],[25,12,25,13],[19,12,19,14],[20,12,20,14],[27,12,27,13],[21,12,21,14],[23,9,23,15],[20,9,20,10],[22,9,22,15],[19,9,19,10],[21,9,21,10],[26,12,26,13],[2,1,2,6],[6,14,6,15],[5,14,5,15],[2,9,2,12],[3,1,3,7],[3,9,3,12],[2,13,2,14],[3,13,3,14]]}
[]
[null,{"$f":"IF(AND(WSIZE>0,HSIZE>0),\"Only Available At\"&\"  \"&WSIZE&\" x \"&HSIZE&IF(HCONTROL=1,\" or \"&HSIZE2,\"\"),\"\")","v":""},null,null,null,null,null,"Select a Model"]
[null,{"$f":"IF(Model_Select=\"Select Model\",\"Select a Model\",\"(Model\"&\" \"&ModelNo&\")\")","v":"Select a Model"},null,null,null,null,null,null,null,{"$f":"\"Min. W:\"&\" \"&MINW","v":"Min. W: 0"},null,null,null,{"$f":"\"Max W:\"&\" \"&MAXW","v":"Max W: 0"}]
[null,{"$f":"Description","v":0},null,null,null,null,null,null,null,{"$f":"\"Min. H:\"&\" \"&MINH","v":"Min. H: 0"},null,null,null,{"$f":"\"Max H:\"&\" \"&MAXH","v":"Max H: 0"},null,{"$f":"\"Max UI:\"&\" \"&MAXUI","v":"Max UI: 0"}]
[null,{"$f":"IF(AND(W>0,H>0),(IF(ISERROR(VLOOKUP(1,Data!$A:$D,3,FALSE)),\"\",VLOOKUP(1,Data!$A:$D,3,FALSE))),\"\")","v":""},null,null,null,null,null,{"$f":"IF(AND(W>0,H>0),(IF(ISERROR(VLOOKUP(1,Data!$A:$D,4,FALSE)),\"\",VLOOKUP(1,Data!$A:$D,4,FALSE))),\"\")","v":""},null,null,null,null,null,"Exact Size"]
[null,{"$f":"IF(AND(W>0,H>0),(IF(ISERROR(VLOOKUP(2,Data!$A:$D,3,FALSE)),\"\",VLOOKUP(2,Data!$A:$D,3,FALSE))),\"\")","v":""},null,null,null,null,null,{"$f":"IF(AND(W>0,H>0),(IF(ISERROR(VLOOKUP(2,Data!$A:$D,4,FALSE)),\"\",VLOOKUP(2,Data!$A:$D,4,FALSE))),\"\")","v":""},null,"Width:",null,null,null,{"$f":"IF(AND(RO=2,W>0),W-WCUTBACK,W)","v":0},{"$f":"IF(AND(W>0,WSIZE>0,W<>WSIZE),\"<< Width Not Available\",\"\")","v":""}]
[null,{"$f":"IF(AND(W>0,H>0),(IF(ISERROR(VLOOKUP(3,Data!$A:$D,3,FALSE)),\"\",VLOOKUP(3,Data!$A:$D,3,FALSE))),\"\")","v":""},null,null,null,null,null,{"$f":"IF(AND(W>0,H>0),(IF(ISERROR(VLOOKUP(3,Data!$A:$D,4,FALSE)),\"\",VLOOKUP(3,Data!$A:$D,4,FALSE))),\"\")","v":""},null,"Height:",null,null,null,{"$f":"IF(AND(RO=2,H>0),H-HCUTBACK,H)","v":0},{"$f":"IF(AND(H>0,HSIZE>0,HSIZE2>0,H<>HSIZE,H<>HSIZE2),\"<< Height Not Available\",\"\")","v":""}]
[null,{"$f":"IF(AND(W>0,H>0),(IF(ISERROR(VLOOKUP(4,Data!$A:$D,3,FALSE)),\"\",VLOOKUP(4,Data!$A:$D,3,FALSE))),\"\")","v":""},null,null,null,null,null,{"$f":"IF(AND(W>0,H>0),(IF(ISERROR(VLOOKUP(4,Data!$A:$D,4,FALSE)),\"\",VLOOKUP(4,Data!$A:$D,4,FALSE))),\"\")","v":""}]
[null,{"$f":"IF(AND(W>0,H>0),(IF(ISERROR(VLOOKUP(5,Data!$A:$D,3,FALSE)),\"\",VLOOKUP(5,Data!$A:$D,3,FALSE))),\"\")","v":""},null,null,null,null,null,{"$f":"IF(AND(W>0,H>0),(IF(ISERROR(VLOOKUP(5,Data!$A:$D,4,FALSE)),\"\",VLOOKUP(5,Data!$A:$D,4,FALSE))),\"\")","v":""},null,{"$f":"IF(BTYPE=\"Custom\",\"CMR:\",\"\")","v":""},null,null,null,{"$f":"IF(AND(W>0,H>0,BTYPE=\"Custom\",CMR=0),\"<< Enter CMR Location\",\"\")","v":""}]
[null,{"$f":"IF(AND(W>0,H>0),(IF(ISERROR(VLOOKUP(6,Data!$A:$D,3,FALSE)),\"\",VLOOKUP(6,Data!$A:$D,3,FALSE))),\"\")","v":""},null,null,null,null,null,{"$f":"IF(AND(W>0,H>0),(IF(ISERROR(VLOOKUP(6,Data!$A:$D,4,FALSE)),\"\",VLOOKUP(6,Data!$A:$D,4,FALSE))),\"\")","v":""},null,{"$f":"IF(SELECTEXT=\"Select Extrusion\",\"Ext.\",IF(SELECTEXT=\"Select Reinforcement\",\"Reinforce\",\"\"))","v":""},null,null,null,{"$f":"EXT_MESSAGE","v":""}]
{"$rows_left_out":15}
{"sheet":"Data","index":1,"n_rows":352,"n_cols":31,"rows_kept":352,"cut":false,"hidden":true,"merged":[]}
[null,"Model","Description","Value"]
[{"$f":"IF(ModelNo=B2,1,\"\")","v":""},"8E00A","Glass Width",{"$f":"Frame_Width-2.9375","v":-2.9375},null,{"$f":"Model_Select","v":"Select Model"},"Models","Description","W cut-back","H-cut-back","Width","Height","Min W","Min H","Max W","Max H","Max UI","Type1","Type2","Type3","Type4","Screen1","Screen2","Screen3","Ext./Reinf.","Ext./Reinf.","Ext./Reinf.","Ext./Reinf.","Ext./Reinf.","Glass","Opening"]
[{"$f":"IF(ModelNo=B3,2,\"\")","v":""},"8E00A","Glass Height",{"$f":"Frame_Height-2.9375","v":-2.9375},null,1,"Select Model"]
[{"$f":"IF(ModelNo=B4,3,\"\")","v":""},"8E00A","Glass Area (sq.ft.)",{"$f":"(D2*D3)/144","v":5.9922960069444448E-2},null,2,"8E00A","Small Frame Picture Window",null,null,null,null,12,12,120,120,168,"Standard",null,null,null,"N/A"]
[{"$f":"IF(ModelNo=B5,1,\"\")","v":""},"3S10A","Sash Width",{"$f":"CDIM3R10A+0.25","v":0.25},null,3,"3S10A","Single Slider (Lift Out)",null,null,null,null,20,13,80,60,132,"Standard","Custom",null,null,"Half"]
[{"$f":"IF(ModelNo=B6,2,\"\")","v":""},"3S10A","Sash Height",{"$f":"Frame_Height-2.875","v":-2.875},null,4,"3S21A","Single Slider (Tilt)",null,null,null,null,20,13,78,60,132,"Standard","Custom",null,null,"Half"]
[{"$f":"IF(ModelNo=B7,3,\"\")","v":""},"3S10A","Sash Glass Width",{"$f":"INTGW3R10A","v":-2.5625},null,5,"3S40A","Single Hung",null,null,null,null,13,20,54,84,132,"Standard","Custom",null,null,"Half"]
[{"$f":"IF(ModelNo=B8,4,\"\")","v":""},"3S10A","Sash Glass Height",{"$f":"INTGH3R10A","v":-5.75},null,6,"3S10C","Three Lite Slider (Lift Out)",null,null,null,null,36,13,120,60,168,"Standard","Custom",null,null,"Half"]
[{"$f":"IF(ModelNo=B9,5,\"\")","v":""},"3S10A","Fixed Glass Width",{"$f":"EXTGW3R10A","v":-2.625},null,7,"3S21C","Three Lite Slider (Tilt)",null,null,null,null,36,13,120,60,168,"Standard","Custom",null,null,"Half"]
[{"$f":"IF(ModelNo=B10,6,\"\")","v":""},"3S10A","Fixed Glass Height",{"$f":"EXTGH3R10A","v":-2.8125},null,8,"8E10A","Double Slider (Lift Out)",null,null,null,null,21,13,80,60,132,"Standard","Custom",null,null,"Half","Full"]
{"$rows_left_out":343}
{"sheet":"Balance","index":2,"n_rows":229,"n_cols":117,"rows_kept":229,"cut":false,"hidden":true,"merged":[[79,16,79,21],[1,108,1,111],[2,51,2,53],[1,113,1,116],[0,108,0,116],[1,24,1,25],[1,1,1,3],[1,14,1,21],[0,41,0,45],[1,39,1,42],[1,44,1,47],[1,5,1,7]]}
[null,null,null,null,null,null,null,null,null,null,null,null,null,null,null,null,null,null,null,null,null,null,null,null,null,null,null,null,null,null,null,null,null,null,null,null,null,null,null,null,null,"BLOCK & TACKLE BALANCE CHART",null,null,null,null,null,null,null,null,null,null,null,null,null,"Spiral Balance",null,null,null,null,null,null,null,null,null,null,null,null,null,null,null,null,null,null,null,null,null,null,null,null,null,null,null,null,null,null,null,null,null,null,null,null,null,null,null,null,null,null,null,null,null,null,null,null,null,null,null,null,"V-Series BLOCK & TACKLE BALANCE CHART"]
[null,"CFB",null,null,null,"Curve CFB",null,null,null,null,null,null,"Glass Strength",null,"Weight Calculation",null,null,null,null,null,null,null,null,null,"Egress Calculation",null,null,null,null,null,null,null,null,null,null,null,null,null,null,"TOP SASH",null,null,null,null,"BOTTOM SASH",null,null,null,null,null,null,null,null,null,"Top Sash",{"$f":"IF(ISERROR(VLOOKUP((TRUNC(TOP_WGT)),$BD$7:$DB$41,TOPTUBELENGTH,FALSE)),\"N/A\",VLOOKUP((TRUNC(TOP_WGT)),$BD$7:$DB$41,TOPTUBELENGTH,FALSE))","v":"N/A"},{"$f":"TOPTUBELENGTH","v":{"$error":"#N/A"}},null,null,null,null,null,null,null,null,null,null,null,null,null,null,null,null,null,null,null,null,null,null,null,null,null,null,null,null,null,null,null,null,null,null,null,null,null,null,null,null,null,null,null,null,null,null,null,null,null,null,null,"TOP SASH",null,null,null,null,"BOTTOM SASH"]
[null,4,3,"RD",null,4,3,"BN",null,1,"S",{"$f":"1.157*2","v":2.3140000000000001},"Single Strength (2.5 mm)",null,"Model","CDIM","Bott. Sash Height","Bottom Sash Weight","Top Sash Weight","Bal. Loc.","H+S+SS","Sill","EW",null,"# of Coils",{"$f":"IF(ModelNo=\"L201\",VLOOKUP(BTM_WGT,Fusion_W,3,FALSE),VLOOKUP(BTM_WGT,CFB_W,3,FALSE))","v":{"$error":"#N/A"}},null,null,"3S40A","Length","Weight/ft","Weight",null,"8S40A","Length","Weight/ft","Weight",null,null,"Sash Weight","Tube Length","Balance","Weight",null,"Sash Weight","Tube Length","Balance","Weight",null,null,null,"Tube Length",null,null,"Bott. Sash",{"$f":"IF(ISERROR(VLOOKUP((TRUNC(BTM_WGT)),$BD$7:$DB$41,BOTTUBELENGTH,FALSE)),\"N/A\",VLOOKUP((TRUNC(BTM_WGT)),$BD$7:$DB$41,BOTTUBELENGTH,FALSE))","v":"N/A"},{"$f":"BOTTUBELENGTH","v":{"$error":"#N/A"}},null,null,null,null,"  TUBE LENGTH ",null,null,null,null,null,null,null,null,null,null,null,null,null,null,null,"TUBE LENGTH ",null,null,null,null,null,null,null,null,null,null,null,null,null,null,null,null,null,"TUBE LENGTH ",null,null,null,null,null,null,null,null,null,null,null,null,"Sash Weight","Tube Length","Balance","Weight",null,"Sash Weight","Tube Length","Balance","Weight"]
[null,{"$f":"B3+1","v":5},3,"RD",null,{"$f":"F3+1","v":5},3,"BN",null,2,"D",{"$f":"1.6*2","v":3.2},"Double Strength (3 mm)",null,{"$f":"ModelNo","v":"Select Model"},{"$f":"VLOOKUP(ModelNo,WEIGHTCALC,2,FALSE)","v":{"$error":"#N/A"}},{"$f":"VLOOKUP(ModelNo,WEIGHTCALC,3,FALSE)","v":{"$error":"#N/A"}},{"$f":"VLOOKUP(ModelNo,WEIGHTCALC,4,FALSE)","v":{"$error":"#N/A"}},{"$f":"VLOOKUP(ModelNo,WEIGHTCALC,5,FALSE)","v":{"$error":"#N/A"}},{"$f":"VLOOKUP(ModelNo,WEIGHTCALC,6,FALSE)","v":{"$error":"#N/A"}},{"$f":"VLOOKUP(ModelNo,WEIGHTCALC,7,FALSE)","v":{"$error":"#N/A"}},{"$f":"VLOOKUP(ModelNo,WEIGHTCALC,8,FALSE)","v":{"$error":"#N/A"}},{"$f":"VLOOKUP(ModelNo,WEIGHTCALC,9,FALSE)","v":{"$error":"#N/A"}},null,"Displacement",{"$f":"IF($Q$4>37.5,$Q$4-36,0)","v":{"$error":"#N/A"}},null,null,"Top Top Rail",0,0,{"$f":"AD4*AE4","v":0},null,"Top Top Rail",{"$f":"(Frame_Width-3.875)/12","v":-0.32291666666666669},0.36899999999999999,{"$f":"AI4*AJ4","v":-0.11915625000000001},null,null,{"$f":"TRUNC(TOP_WGT)","v":{"$error":"#N/A"}},{"$f":"$AN$9","v":0},"Number","Range",null,{"$f":"TRUNC(BTM_WGT)","v":{"$error":"#N/A"}},{"$f":"$AS$9","v":0},"Number","Range",null,null,null,"Model","Top","Bott",null,null,2,3,4,5,6,7,8,9,10,11,12,13,14,15,16,17,18,19,20,21,22,23,24,25,26,27,28,29,30,31,32,33,34,35,36,37,38,39,40,41,42,43,44,45,46,47,48,49,50,51,null,null,{"$f":"TRUNC(TOP_WGT)","v":{"$error":"#N/A"}},{"$f":"TOPTUBELENGTH","v":{"$error":"#N/A"}},"Number","Range",null,{"$f":"TRUNC(BTM_WGT)","v":{"$error":"#N/A"}},{"$f":"BOTTUBELENGTH","v":{"$error":"#N/A"}},"Number","Range"]
[null,6,3,"RD",null,6,3,"BN",null,3,"T",{"$f":"2.408*2","v":4.8159999999999998},"Triple Strength (5 mm)",null,"3S40A",{"$f":"CDIM3R40A","v":0},{"$f":"BGH3R40A+2.875","v":0.28125},{"$f":"BSW3R40A","v":0},null,1.03125,7.625,1.5369999999999999,4.375,null,"Coil Loc. From CMR",{"$f":"(($Z$3-1)*1.58)+$Z$4+$T$4+1.5","v":{"$error":"#N/A"}},null,null,"Top Bottom Rail",0,0,{"$f":"AD5*AE5","v":0},null,"Top Bottom Rail",{"$f":"(Frame_Width-3.875)/12","v":-0.32291666666666669},0.36899999999999999,-0.11915625000000001,null,null,"Balance Size",{"$f":"IF(AND(AP5>0,AQ5>0),AP5,0)","v":{"$error":"#N/A"}},{"$f":"IF($AO$4<=6,6,0)","v":6},{"$f":"IF(AND(AP5=6,$AN$4>=2,$AN$4<=5),AP5&\"A\",0)","v":{"$error":"#N/A"}},null,"Balance Size",{"$f":"IF(AND(AU5>0,AV5>0),AU5,0)","v":{"$error":"#N/A"}},{"$f":"IF($AT$4<=6,6,0)","v":6},{"$f":"IF(AND(AU5=6,$AS$4>=2,$AS$4<=5),AU5&\"A\",0)","v":{"$error":"#N/A"}},null,"Standard",null,"0100",null,{"$f":"(INT(INT(Frame_Height/2-0.25)/2)+0.5)*2","v":-1},null,"Sash Weight",null,null,null,null,null,null,null,null,null,null,null,null,null,null,null,null,null,null,null,null,null,null,null,null,null,null,null,null,null,null,null,null,null,null,null,null,null,null,null,null,null,null,null,null,null,null,null,null,null,null,null,null,"Balance Size",{"$f":"IF(AND(DG5>0,DH5>0),DG5,0)","v":{"$error":"#N/A"}},{"$f":"IF($DF$4<=8,8,0)","v":{"$error":"#N/A"}},{"$f":"IF(AND(DG5=8,$DE$4>=2,$DE$4<=6),DG5&\"A\",0)","v":{"$error":"#N/A"}},null,"Balance Size",{"$f":"IF(AND(DL5>0,DM5>0),DL5,0)","v":{"$error":"#N/A"}},{"$f":"IF($DK$4<=8,8,0)","v":{"$error":"#N/A"}},{"$f":"IF(AND(DL5=8,$DJ$4>=2,$DJ$4<=6),DL5&\"A\",0)","v":{"$error":"#N/A"}}]
[null,7,3,"RD",null,7,4,"RD",null,4,"STG",{"$f":"1.157*3","v":3.4710000000000001},"Triple IG Single Strrength",null,"8E40A",{"$f":"CDIM8R40A","v":0},{"$f":"BGH8R40A+2.875","v":-0.5625},{"$f":"BSW8R40A","v":0},{"$f":"TSW8R40A","v":0},1.03125,7.9020000000000001,2.294,4.75,null,"Sash H < 37.5",{"$f":"TRUNC((Frame_Height-$Q$4-$U$4)*16+0.5)/16","v":{"$error":"#N/A"}},null,null,"Top Stile",0,0,{"$f":"(AD6*AE6)/12","v":0},null,"Top Stile",{"$f":"(2*(DDIM8R40A-1.625))/12","v":-0.27083333333333331},0.36899999999999999,-9.9937499999999999E-2,null,null,{"$f":"VLOOKUP((MAX(AO5:AO229)),AO5:AQ229,3,FALSE)","v":{"$error":"#N/A"}},{"$error":"#N/A"},6,{"$f":"IF(AND(AP6=6,$AN$4>=6,$AN$4<=9),AP6&\"B\",0)","v":{"$error":"#N/A"}},null,{"$f":"VLOOKUP((MAX(AT5:AT229)),AT5:AV229,3,FALSE)","v":{"$error":"#N/A"}},{"$error":"#N/A"},6,{"$f":"IF(AND(AU6=6,$AS$4>=6,$AS$4<=9),AU6&\"B\",0)","v":{"$error":"#N/A"}},null,{"$f":"IF(ModelNo=Climatech_Control,\"Climatech-4\",\"Climatech\")","v":"Climatech"},null,"02A0",null,null,null,null,null,null,null,null,null,null,null,null,null,null,null,null,null,null,null,null,null,null,null,null,null,null,null,null,null,null,null,null,null,null,null,null,null,null,null,null,null,null,null,null,null,null,null,null,null,null,null,null,null,null,null,null,{"$f":"VLOOKUP((MAX(DF5:DF229)),DF5:DH229,3,FALSE)","v":{"$error":"#N/A"}},{"$error":"#N/A"},{"$f":"IF($DF$4<=8,8,0)","v":{"$error":"#N/A"}},{"$f":"IF(AND(DG6=8,$DE$4>=7,$DE$4<=10),DG6&\"B\",0)","v":{"$error":"#N/A"}},null,{"$f":"VLOOKUP((MAX(DK5:DK229)),DK5:DM229,3,FALSE)","v":{"$error":"#N/A"}},{"$error":"#N/A"},{"$f":"IF($DK$4<=8,8,0)","v":{"$error":"#N/A"}},{"$f":"IF(AND(DL6=8,$DJ$4>=7,$DJ$4<=10),DL6&\"B\",0)","v":{"$error":"#N/A"}}]
[null,8,4,"GN",null,8,4,"RD",null,5,"DTG",{"$f":"1.6*3","v":4.8000000000000007},"Triple IG Double Strength",null,"L201",{"$f":"CMR!$E$27","v":0},{"$f":"CMR!$E$27-0.5625","v":-0.5625},{"$f":"$AF$45","v":0},{"$f":"$AF$44","v":0},1.3125,7.319,1.75,4.4059999999999997,null,"Egress Height",{"$f":"IF($Z$6<(TRUNC((P4-Z5-V4)*16+0.5)/16),$Z$6,TRUNC(($P$4-$Z$5-$V$4)*16+0.5)/16)","v":{"$error":"#N/A"}},null,null,"Top Rail Reinf.",0,0,0,null,"Top Rail Reinf.",{"$f":"(TRUNC(((Frame_Width-3.875)-6)/2)*2)/12","v":-0.66666666666666663},0.26400000000000001,-0.17599999999999999,null,null,null,{"$error":"#N/A"},6,{"$f":"IF(AND(AP7=6,$AN$4>=10,$AN$4<=12),AP7&\"C\",0)","v":{"$error":"#N/A"}},null,null,{"$error":"#N/A"},6,{"$f":"IF(AND(AU7=6,$AS$4>=10,$AS$4<=12),AU7&\"C\",0)","v":{"$error":"#N/A"}},null,{"$f":"IF(ModelNo=Climatech_Control,\"Climatech-SC\",\"Climatech-2\")","v":"Climatech-2"},null,"0201",{"$f":"IF(CMR!$E$26>=Frame_Height/2-0.07,(INT(INT((Frame_Height/2-4.875)+1)/2)-0.5)*2,(INT(INT((CMR!$E$26-4.181)+1)/2)-0.5)*2)","v":-5},{"$f":"IF(Frame_Height>63.6875,IF(Frame_Height<66.3125,30,(INT(INT((Frame_Height/2-0.875)+1)/2)-0.5)*2),(INT(INT((Frame_Height/2-0.875)+1)/2)-0.5)*2)","v":-1},null,6,null,null,null,null,null,null,null,null,null,null,"2R","2R","2R","2R","2R","2R","2R","2R","2R","2R","2R",null,null,null,null,null,null,null,null,null,null,null,null,null,null,null,null,null,null,null,null,null,null,null,null,null,null,null,null,null,null,null,null,{"$error":"#N/A"},{"$f":"IF($DF$4<=8,8,0)","v":{"$error":"#N/A"}},{"$f":"IF(AND(DG7=8,$DE$4>=11,$DE$4<=13),DG7&\"C\",0)","v":{"$error":"#N/A"}},null,null,{"$error":"#N/A"},{"$f":"IF($DK$4<=8,8,0)","v":{"$error":"#N/A"}},{"$f":"IF(AND(DL7=8,$DJ$4>=11,$DJ$4<=13),DL7&\"C\",0)","v":{"$error":"#N/A"}}]
[null,9,5,"BN",null,9,5,"BU",null,6,"L",{"$f":"2.683*2","v":5.3659999999999997},"Laminated",null,"03A0",{"$f":"CMR!$E$133","v":0},{"$f":"CDIM03A0-1.125","v":-1.125},{"$f":"$AF$191","v":0},0,1.3125,7.875,1.875,5.8125,null,"Egress Width",{"$f":"Frame_Width-W4","v":{"$error":"#N/A"}},null,null,"Top Stile Reinf",0,0,0,null,"Top Stile Reinf",{"$f":"IF(TGH8R40A>26.625,((TRUNC((DDIM8R40A-10)/2)*2)/12)*2,0)","v":0},0.26400000000000001,0,null,null,"Top Tube length",{"$error":"#N/A"},6,{"$f":"IF(AND(AP8=6,$AN$4>=13,$AN$4<=15),AP8&\"D\",0)","v":{"$error":"#N/A"}},null,"Bott. Tube Length",{"$error":"#N/A"},6,{"$f":"IF(AND(AU8=6,$AS$4>=13,$AS$4<=15),AU8&\"D\",0)","v":{"$error":"#N/A"}},null,{"$f":"IF(ModelNo=Climatech_Control,\"Climatech-7\",\"Climatech Plus\")","v":"Climatech Plus"},null,"0301",{"$f":"IF(CMR!$E$42>=Frame_Height/2-0.07,(INT(INT((Frame_Height/2-4.875)+1)/2)-0.5)*2,(INT(INT((CMR!$E$42-4.181)+1)/2)-0.5)*2)","v":-5},{"$f":"IF(Frame_Height>63.6875,IF(Frame_Height<66.3125,30,(INT(INT((Frame_Height/2-0.875)+1)/2)-0.5)*2),(INT(INT((Frame_Height/2-0.875)+1)/2)-0.5)*2)","v":-1},null,7,null,null,null,null,null,null,null,null,null,"2R","2R","2R","2R","2R","2R","2R","2R","2R","2R","2R","2R","2R","2R","2R","2R","2R","2R","2R","2R","2R","2R",null,null,null,null,null,null,null,null,null,null,null,null,null,null,null,null,null,null,null,null,null,null,{"$error":"#N/A"},{"$f":"IF(AND($DF$4<=10,$DF$4>8),10,0)","v":{"$error":"#N/A"}},{"$f":"IF(AND(DG8=10,$DE$4>=2,$DE$4<=6),DG8&\"A\",0)","v":{"$error":"#N/A"}},null,null,{"$error":"#N/A"},{"$f":"IF(AND($DK$4<=10,$DK$4>8),10,0)","v":{"$error":"#N/A"}},{"$f":"IF(AND(DL8=10,$DJ$4>=2,$DJ$4<=6),DL8&\"A\",0)","v":{"$error":"#N/A"}}]
[null,10,5,"BN",null,10,5,"BU",null,7,"H",{"$f":"2.408*2","v":4.8159999999999998},"HP Package",null,"02A0",{"$f":"CMR!$L$27","v":0},{"$f":"CMR!$L$27-0.75","v":-0.75},{"$f":"$AF$67","v":0},{"$f":"$AF$66","v":0},1.3125,7.319,1.75,4.5,null,"Egress Area",{"$f":"IF(E301EH>0,ROUND(((E301EH*EW)/144),3),ROUND(((EH*EW)/144),3))","v":{"$error":"#N/A"}},null,null,"Top Glass",0,0,0,null,"Top Glass",{"$f":"(TGW8R40A*TGH8R40A)/144","v":0.1357693142361111},{"$f":"$L$12","v":3.2},0.43446180555555558,null,null,{"$f":"IF(OR(ModelNo=\"8001\",ModelNo=\"R601\"),TOPTUBELENGTH,0)","v":0},{"$error":"#N/A"},6,{"$f":"IF(AND(AP9=6,$AN$4>=16,$AN$4<=20),AP9&\"E\",0)","v":{"$error":"#N/A"}},null,{"$f":"IF(OR(ModelNo=\"8001\",ModelNo=\"R601\"),BOTTUBELENGTH,0)","v":0},{"$error":"#N/A"},6,{"$f":"IF(AND(AU9=6,$AS$4>=16,$AS$4<=20),AU9&\"E\",0)","v":{"$error":"#N/A"}},null,{"$f":"IF(ModelNo=Climatech_Control,\"Climatech-10\",IF(ModelNo=Climatech_Control1,\"Climatech TG2\",\"\"))","v":""},null,"0401",{"$f":"IF(CMR!$E$58>=Frame_Height/2-0.07,(INT(INT((Frame_Height/2-4.0625)+1)/2)-0.5)*2,(INT(INT((CMR!$E$58-4.375)+1)/2)-0.5)*2)","v":-5},{"$f":"(INT(INT((Frame_Height/2-0.0625)+1)/2)-0.5)*2","v":-1},null,8,null,null,null,null,null,null,null,"2R","2R","2R","2R","2R","2R","2R","2R","2R","2R","2R","2R","2R","2R","2R","2R","2R","2R","2R","2R","2R","3R","3R","3R",null,null,null,null,null,null,null,null,null,null,null,null,null,null,null,null,null,null,null,null,null,null,{"$error":"#N/A"},{"$f":"IF(AND($DF$4<=10,$DF$4>8),10,0)","v":{"$error":"#N/A"}},{"$f":"IF(AND(DG9=10,$DE$4>=7,$DE$4<=10),DG9&\"B\",0)","v":{"$error":"#N/A"}},null,null,{"$error":"#N/A"},{"$f":"IF(AND($DK$4<=10,$DK$4>8),10,0)","v":{"$error":"#N/A"}},{"$f":"IF(AND(DL9=10,$DJ$4>=7,$DJ$4<=10),DL9&\"B\",0)","v":{"$error":"#N/A"}}]
[null,11,6,"OR",null,11,6,"YW",null,8,"IL",{"$f":"2.683*2","v":5.3659999999999997},"Impact Laminated",null,"0301",{"$f":"CMR!$E$43","v":0},{"$f":"CMR!$E$43-0.625","v":-0.625},{"$f":"$AF$89","v":0},{"$f":"$AF$88","v":0},1.3125,7.6181200000000002,2.0590600000000001,4.375,null,null,null,null,null,"Top Spacer",0,0,0,null,"Top Spacer",{"$f":"((TGW8R40A*2)+(TGH8R40A*2))/12","v":-1.5208333333333333},5.3600000000000002E-2,-8.1516666666666668E-2,null,null,null,{"$error":"#N/A"},6,{"$f":"IF(AND(AP10=6,$AN$4>=21,$AN$4<=24),\"Dbl.\"&AP10&\"C\",0)","v":{"$error":"#N/A"}},null,null,{"$error":"#N/A"},6,{"$f":"IF(AND(AU10=6,$AS$4>=21,$AS$4<=24),\"Dbl.\"&AU10&\"C\",0)","v":{"$error":"#N/A"}},null,1,null,"0501",{"$f":"IF(CMR!$L$42>=Frame_Height/2-0.07,(INT(INT((Frame_Height/2-4.75)+1)/2)-0.5)*2,(INT(INT((CMR!$L$42-4.75)+1)/2)-0.5)*2)","v":-5},{"$f":"(INT(INT((Frame_Height/2-0.75)+1)/2)-0.5)*2","v":-1},null,9,null,null,null,null,null,"2R","2R","2R","2R","2R","2R","2R","2R","2R","2R","2R","3R","3R","3R","3R","3R","3R","3R","3R","3R","3R","3R","3R","3R","3R","3R",null,null,null,null,null,null,null,null,null,null,null,null,null,null,null,null,null,null,null,null,null,null,{"$error":"#N/A"},{"$f":"IF(AND($DF$4<=10,$DF$4>8),10,0)","v":{"$error":"#N/A"}},{"$f":"IF(AND(DG10=10,$DE$4>=11,$DE$4<=13),DG10&\"C\",0)","v":{"$error":"#N/A"}},null,null,{"$error":"#N/A"},{"$f":"IF(AND($DK$4<=10,$DK$4>8),10,0)","v":{"$error":"#N/A"}},{"$f":"IF(AND(DL10=10,$DJ$4>=11,$DJ$4<=13),DL10&\"C\",0)","v":{"$error":"#N/A"}}]
{"$rows_left_out":220}
{"sheet":"CMR","index":3,"n_rows":138,"n_cols":16,"rows_kept":138,"cut":false,"hidden":true,"merged":[[106,11,106,12],[114,8,114,9],[115,8,115,9],[117,8,117,10],[122,11,122,12],[123,8,123,9],[107,4,107,5],[123,4,123,5],[136,1,136,3],[137,1,137,3],[115,1,115,2],[116,1,116,2],[118,1,118,3],[119,1,119,3],[131,1,131,2],[132,1,132,2],[120,1,120,3],[121,1,121,3],[134,1,134,3],[135,1,135,3],[81,18,81,19],[102,8,102,10],[95,15,95,17],[95,8,95,10],[81,11,81,12],[89,8,89,9],[90,8,90,9],[92,8,92,10],[94,15,94,17],[89,15,89,16],[90,15,90,16],[92,15,92,17],[93,15,93,17],[77,15,77,17],[78,15,78,17],[79,15,79,17],[103,8,103,10],[104,8,104,10],[97,11,97,12],[98,8,98,9],[99,8,99,9],[101,8,101,10],[76,15,76,17],[47,15,47,17],[49,18,49,19],[57,15,57,16],[58,15,58,16],[74,15,74,16],[63,15,63,17],[65,18,65,19],[73,15,73,16],[60,15,60,17],[1,18,1,19],[9,15,9,16],[10,15,10,16],[31,15,31,17],[25,15,25,16],[30,15,30,17],[26,15,26,16],[45,15,45,17],[46,15,46,17],[41,15,41,16],[17,18,17,19],[33,18,33,19],[12,1,12,3],[13,1,13,3],[14,1,14,3],[25,8,25,9],[26,1,26,2],[61,15,61,17],[62,15,62,17],[42,15,42,16],[44,15,44,17],[33,11,33,12],[41,8,41,9],[42,8,42,9],[44,8,44,10],[31,8,31,10],[47,8,47,10],[49,4,49,5],[26,8,26,9],[28,8,28,10],[33,4,33,5],[44,1,44,3],[15,15,15,17],[28,15,28,17],[29,15,29,17],[13,8,13,10],[29,8,29,10],[1,11,1,12],[9,8,9,9],[10,8,10,9],[12,8,12,10],[30,8,30,10],[14,8,14,10],[15,8,15,10],[17,11,17,12],[65,11,65,12],[62,8,62,10],[63,8,63,10],[49,11,49,12],[62,1,62,3],[41,1,41,2],[63,1,63,3],[47,1,47,3],[61,1,61,3],[42,1,42,2],[65,4,65,5],[58,1,58,2],[46,1,46,3],[57,1,57,2],[46,8,46,10],[45,8,45,10],[57,8,57,9],[58,8,58,9],[1,4,1,5],[17,4,17,5],[15,1,15,3],[60,1,60,3],[31,1,31,3],[25,1,25,2],[9,1,9,2],[10,1,10,2],[30,1,30,3],[45,1,45,3],[28,1,28,3],[29,1,29,3],[79,1,79,3],[79,8,79,10],[92,1,92,3],[93,1,93,3],[60,8,60,10],[61,8,61,10],[94,1,94,3],[78,1,78,3],[73,1,73,2],[73,8,73,9],[74,1,74,2],[74,8,74,9],[78,8,78,10],[76,8,76,10],[127,8,127,10],[128,8,128,10],[129,8,129,10],[118,8,118,10],[119,8,119,10],[120,8,120,10],[124,8,124,9],[126,8,126,10],[76,1,76,3],[105,1,105,3],[97,3,97,4],[102,1,102,3],[103,1,103,3],[99,1,99,2],[100,1,100,2],[104,1,104,3],[81,4,81,5],[89,1,89,2],[90,1,90,2],[95,1,95,3],[77,1,77,3],[77,8,77,10],[93,8,93,10],[94,8,94,10]]}
[]
[null,null,"W",null,"3R10A",null,null,null,null,"W",null,"S140, S144, S146",null,null,null,{"$f":"Frame_Height-MR","v":0}]
[null,null,{"$f":"IF(TYPE=1,$C$2,IF(TYPE= \"\",$C$2,\" \"))","v":"W"},1,{"$f":"Frame_Width/2","v":0},{"$f":"TRUNC($E$3*16+0.5)/16","v":0},null,null,null,{"$f":"IF(TYPE=1,$J$2,IF(TYPE= \"\",$J$2,\" \"))","v":"W"},1,{"$f":"Frame_Height/2","v":0},{"$f":"TRUNC($L$3*16+0.5)/16","v":0}]
[null,null,null,2,{"$f":"CEILING(((Frame_Width/5-0.093)*3-0.03125),0.0625)","v":-0.25},{"$f":"TRUNC($E4*16+0.5)/16","v":-0.1875},5,null,null,{"$f":"IF(TYPE=5,$J$2,IF(TYPE=2,IF(Frame_Height>=54.5,IF(Frame_Height<72.5,$J$2,\"\"),\"\"),\"\"))","v":""},2,{"$f":"CEILING(((Frame_Height/3-0.22)*2-0.03125),0.0625)","v":-0.4375},{"$f":"TRUNC($L$4*16+0.5)/16","v":-0.375},5]
[null,null,null,null,{"$f":"TRUNC((Frame_Width/3-0.22)*32+0.5)/16","v":-0.375},{"$f":"TRUNC($E$5*16+0.5)/16","v":-0.3125},6,null,null,{"$f":"IF(TYPE=6,$J$2,IF(AND(TYPE=2,OR(Frame_Height<54.5,Frame_Height>=72.5)),$J$2,\"\"))","v":""},null,{"$f":"TRUNC((Frame_Height/5-0.093)*32+0.5)/16","v":-0.125},{"$f":"TRUNC($L$5*16+0.5)/16","v":-6.25E-2},6]
[null,null,null,3,{"$f":"TRUNC((Frame_Width/5+0.156)*32+0.5)/16","v":0.3125},{"$f":"TRUNC($E$6*16+0.5)/16","v":0.3125},7,null,null,{"$f":"IF(TYPE=7,$J$2,IF(TYPE=3,IF(Frame_Height>=54.5,IF(Frame_Height<72.5,$J$2,\"\"),\"\"),\"\"))","v":""},3,{"$f":"TRUNC((Frame_Height/3+0.44)*32+0.5)/16","v":0.875},{"$f":"TRUNC($L$6*16+0.5)/16","v":0.875},7]
[null,null,null,null,{"$f":"TRUNC((Frame_Width/3+0.44)*16+0.5)/16","v":0.4375},{"$f":"TRUNC($E$7*16+0.5)/16","v":0.4375},8,null,null,{"$f":"IF(TYPE=8,$J$2,IF(AND(TYPE=3,OR(Frame_Height<54.5,Frame_Height>=72.5)),$J$2,\"\"))","v":""},null,{"$f":"TRUNC((Frame_Height/5+0.156)*16+0.5)/16","v":0.125},{"$f":"TRUNC($L$7*16+0.5)/16","v":0.125},8]
[null,null,{"$f":"IF(TYPE=2,$C$2,\"\")","v":""},4,{"$f":"CMR","v":0},{"$f":"TRUNC($E$8*16+0.5)/16","v":0},null,null,null,{"$f":"IF(TYPE=4,$J$2,\"\")","v":""},4,{"$f":"CMR","v":0},{"$f":"TRUNC($L$8*16+0.5)/16","v":0}]
[]
[null,"Dim.,\"D\"",null,"=",{"$f":"IF(C3=C2,F3,IF(C4=C2,F4,IF(C5=C2,F5,IF(C6=C2,F6,IF(C7=C2,F7,IF(C8=C2,F8,F3))))))","v":0},null,null,null,"Dim.,\"D\"",null,"=",{"$f":"IF(EXTSELECT=2,L26,IF($J$3=$J$2,$M$3,IF($J$4=$J$2,$M$4,IF($J$5=$J$2,$M$5,IF($J$6=$J$2,$M$6,IF($J$7=$J$2,$M$7,IF($J$8=$J$2,$M$8,$M$3)))))))","v":0}]
{"$rows_left_out":128}